{"text_format":"1","workbook":"xlsx","n_sheets":13,"sheets":["Oversigt","Graf_Oversigt","Vejledning","Opfølgning","Risikovurdering","Risikohåndtering","ISMS","Ledelsesforankring","Politik","Leverandørstyring","It-beredskab","Måling","Intern opfølgning"],"not_rendered":{"charts":14,"images":0,"macros":1,"external_links":0,"defined_names":16,"comments":0,"pivot_tables":0},"unopened":[],"bounds":{"document_bytes":16777216,"sheet_cells":100000,"rows_first":2000,"rows_last":500,"rows_between":2000,"halvings":0,"cell_chars":16384,"cell_head_chars":4096},"cells_cut":0,"cells_raw":0,"read":"whole","date_system":"1900"}

{"sheet":"Oversigt","index":0,"n_rows":67,"n_cols":18,"rows_kept":67,"cut":false,"hidden":false,"merged":[[60,5,60,6],[60,8,60,9],[60,14,60,15],[60,11,60,12],[60,1,60,3],[0,0,0,3],[5,1,10,1],[2,4,2,6],[0,14,0,15],[2,7,2,9],[2,10,2,12],[2,13,2,15],[2,1,3,3],[0,12,0,13],[47,1,52,1],[53,1,58,1],[11,1,16,1],[23,1,28,1],[29,1,34,1],[35,1,40,1],[41,1,46,1],[17,1,22,1]]}
["Oversigt",null,null,null,null,null,null,null,null,null,null,null,"Opfølgning",null,"Noter"]
[]
[null,"Titel",null,null,"PLAN",null,null,"DO",null,null,"CHECK",null,null,"ACT",null,null,null," "]
[null,null,null,null,"Antal","Vægt","Proces","Antal","Vægt","Proces","Antal","Vægt","Proces","Antal","Vægt","Proces"]
[null,null,"Titel","Svar",{"$f":"E3&\"_Antal\"","v":"PLAN_Antal"},{"$f":"E3&\"_Vægt\"","v":"PLAN_Vægt"},{"$f":"E3&\"_Proces\"","v":"PLAN_Proces"},{"$f":"H3&\"_Antal\"","v":"DO_Antal"},{"$f":"H3&\"_Vægt\"","v":"DO_Vægt"},{"$f":"H3&\"_Proces\"","v":"DO_Proces"},{"$f":"K3&\"_Antal\"","v":"CHECK_Antal"},{"$f":"K3&\"_Vægt\"","v":"CHECK_Vægt"},{"$f":"K3&\"_Proces\"","v":"CHECK_Proces"},{"$f":"N3&\"_Antal\"","v":"ACT_Antal"},{"$f":"N3&\"_Vægt\"","v":"ACT_Vægt"},{"$f":"N3&\"_Proces\"","v":"ACT_Proces"}]
[null,"Risikovurdering",{"$f":"B6","v":"Risikovurdering"},"Ja",{"$f":"IFERROR(COUNTIF(INDIRECT(\"'\"&$B6&\"'!\"&CHAR(MATCH($D6,INDIRECT(\"'\"&$B6&\"'!6:6\",TRUE),0)+64)&MATCH(E$3,INDIRECT(\"'\"&$B6&\"'!B:B\",TRUE),0)&\":\"&CHAR(MATCH($D6,INDIRECT(\"'\"&$B6&\"'!6:6\",TRUE),0)+64)&MATCH(E$3&\"_slut\",INDIRECT(\"'\"&$B6&\"'!B:B\",TRUE),0),TRUE),\"X\"),0)","v":0},{"$f":"IF(E11=0,0,COUNTIF(INDIRECT(\"'\"&$B6&\"'!\"&CHAR(MATCH($D6,INDIRECT(\"'\"&$B6&\"'!6:6\",TRUE),0)+64)&MATCH(E$3,INDIRECT(\"'\"&$B6&\"'!B:B\",TRUE),0)&\":\"&CHAR(MATCH($D6,INDIRECT(\"'\"&$B6&\"'!6:6\",TRUE),0)+64)&MATCH(E$3&\"_slut\",INDIRECT(\"'\"&$B6&\"'!B:B\",TRUE),0),TRUE),\"X\")/E$61)","v":0},{"$f":"IF(E11=0,0,COUNTIF(INDIRECT(\"'\"&$B6&\"'!\"&CHAR(MATCH($D6,INDIRECT(\"'\"&$B6&\"'!6:6\",TRUE),0)+64)&MATCH(E$3,INDIRECT(\"'\"&$B6&\"'!B:B\",TRUE),0)&\":\"&CHAR(MATCH($D6,INDIRECT(\"'\"&$B6&\"'!6:6\",TRUE),0)+64)&MATCH(E$3&\"_slut\",INDIRECT(\"'\"&$B6&\"'!B:B\",TRUE),0),TRUE),\"X\")/SUM(E6:E10))","v":0},{"$f":"IFERROR(COUNTIF(INDIRECT(\"'\"&$B6&\"'!\"&CHAR(MATCH($D6,INDIRECT(\"'\"&$B6&\"'!6:6\",TRUE),0)+64)&MATCH(H$3,INDIRECT(\"'\"&$B6&\"'!B:B\",TRUE),0)&\":\"&CHAR(MATCH($D6,INDIRECT(\"'\"&$B6&\"'!6:6\",TRUE),0)+64)&MATCH(H$3&\"_slut\",INDIRECT(\"'\"&$B6&\"'!B:B\",TRUE),0),TRUE),\"X\"),0)","v":0},{"$f":"IF(H11=0,0,COUNTIF(INDIRECT(\"'\"&$B6&\"'!\"&CHAR(MATCH($D6,INDIRECT(\"'\"&$B6&\"'!6:6\",TRUE),0)+64)&MATCH(H$3,INDIRECT(\"'\"&$B6&\"'!B:B\",TRUE),0)&\":\"&CHAR(MATCH($D6,INDIRECT(\"'\"&$B6&\"'!6:6\",TRUE),0)+64)&MATCH(H$3&\"_slut\",INDIRECT(\"'\"&$B6&\"'!B:B\",TRUE),0),TRUE),\"X\")/H$61)","v":0},{"$f":"IF(H11=0,0,COUNTIF(INDIRECT(\"'\"&$B6&\"'!\"&CHAR(MATCH($D6,INDIRECT(\"'\"&$B6&\"'!6:6\",TRUE),0)+64)&MATCH(H$3,INDIRECT(\"'\"&$B6&\"'!B:B\",TRUE),0)&\":\"&CHAR(MATCH($D6,INDIRECT(\"'\"&$B6&\"'!6:6\",TRUE),0)+64)&MATCH(H$3&\"_slut\",INDIRECT(\"'\"&$B6&\"'!B:B\",TRUE),0),TRUE),\"X\")/SUM(H6:H10))","v":0},{"$f":"IFERROR(COUNTIF(INDIRECT(\"'\"&$B6&\"'!\"&CHAR(MATCH($D6,INDIRECT(\"'\"&$B6&\"'!6:6\",TRUE),0)+64)&MATCH(K$3,INDIRECT(\"'\"&$B6&\"'!B:B\",TRUE),0)&\":\"&CHAR(MATCH($D6,INDIRECT(\"'\"&$B6&\"'!6:6\",TRUE),0)+64)&MATCH(K$3&\"_slut\",INDIRECT(\"'\"&$B6&\"'!B:B\",TRUE),0),TRUE),\"X\"),0)","v":0},{"$f":"IF(K11=0,0,COUNTIF(INDIRECT(\"'\"&$B6&\"'!\"&CHAR(MATCH($D6,INDIRECT(\"'\"&$B6&\"'!6:6\",TRUE),0)+64)&MATCH(K$3,INDIRECT(\"'\"&$B6&\"'!B:B\",TRUE),0)&\":\"&CHAR(MATCH($D6,INDIRECT(\"'\"&$B6&\"'!6:6\",TRUE),0)+64)&MATCH(K$3&\"_slut\",INDIRECT(\"'\"&$B6&\"'!B:B\",TRUE),0),TRUE),\"X\")/K$61)","v":0},{"$f":"IF(K11=0,0,COUNTIF(INDIRECT(\"'\"&$B6&\"'!\"&CHAR(MATCH($D6,INDIRECT(\"'\"&$B6&\"'!6:6\",TRUE),0)+64)&MATCH(K$3,INDIRECT(\"'\"&$B6&\"'!B:B\",TRUE),0)&\":\"&CHAR(MATCH($D6,INDIRECT(\"'\"&$B6&\"'!6:6\",TRUE),0)+64)&MATCH(K$3&\"_slut\",INDIRECT(\"'\"&$B6&\"'!B:B\",TRUE),0),TRUE),\"X\")/SUM(K6:K10))","v":0},{"$f":"IFERROR(COUNTIF(INDIRECT(\"'\"&$B6&\"'!\"&CHAR(MATCH($D6,INDIRECT(\"'\"&$B6&\"'!6:6\",TRUE),0)+64)&MATCH(N$3,INDIRECT(\"'\"&$B6&\"'!B:B\",TRUE),0)&\":\"&CHAR(MATCH($D6,INDIRECT(\"'\"&$B6&\"'!6:6\",TRUE),0)+64)&MATCH(N$3&\"_slut\",INDIRECT(\"'\"&$B6&\"'!B:B\",TRUE),0),TRUE),\"X\"),0)","v":0},{"$f":"IF(N11=0,0,COUNTIF(INDIRECT(\"'\"&$B6&\"'!\"&CHAR(MATCH($D6,INDIRECT(\"'\"&$B6&\"'!6:6\",TRUE),0)+64)&MATCH(N$3,INDIRECT(\"'\"&$B6&\"'!B:B\",TRUE),0)&\":\"&CHAR(MATCH($D6,INDIRECT(\"'\"&$B6&\"'!6:6\",TRUE),0)+64)&MATCH(N$3&\"_slut\",INDIRECT(\"'\"&$B6&\"'!B:B\",TRUE),0),TRUE),\"X\")/N$61)","v":0},{"$f":"IF(N11=0,0,COUNTIF(INDIRECT(\"'\"&$B6&\"'!\"&CHAR(MATCH($D6,INDIRECT(\"'\"&$B6&\"'!6:6\",TRUE),0)+64)&MATCH(N$3,INDIRECT(\"'\"&$B6&\"'!B:B\",TRUE),0)&\":\"&CHAR(MATCH($D6,INDIRECT(\"'\"&$B6&\"'!6:6\",TRUE),0)+64)&MATCH(N$3&\"_slut\",INDIRECT(\"'\"&$B6&\"'!B:B\",TRUE),0),TRUE),\"X\")/SUM(N6:N10))","v":0}]
[null,null,{"$f":"B6","v":"Risikovurdering"},"Delvist",{"$f":"IFERROR(COUNTIF(INDIRECT(\"'\"&$B6&\"'!\"&CHAR(MATCH($D7,INDIRECT(\"'\"&$B6&\"'!6:6\",TRUE),0)+64)&MATCH(E$3,INDIRECT(\"'\"&$B6&\"'!B:B\",TRUE),0)&\":\"&CHAR(MATCH($D7,INDIRECT(\"'\"&$B6&\"'!6:6\",TRUE),0)+64)&MATCH(E$3&\"_slut\",INDIRECT(\"'\"&$B6&\"'!B:B\",TRUE),0),TRUE),\"X\"),0)","v":0},{"$f":"IF(E11=0,0,COUNTIF(INDIRECT(\"'\"&$B6&\"'!\"&CHAR(MATCH($D7,INDIRECT(\"'\"&$B6&\"'!6:6\",TRUE),0)+64)&MATCH(E$3,INDIRECT(\"'\"&$B6&\"'!B:B\",TRUE),0)&\":\"&CHAR(MATCH($D7,INDIRECT(\"'\"&$B6&\"'!6:6\",TRUE),0)+64)&MATCH(E$3&\"_slut\",INDIRECT(\"'\"&$B6&\"'!B:B\",TRUE),0),TRUE),\"X\")/E$61)","v":0},{"$f":"IF(E11=0,0,COUNTIF(INDIRECT(\"'\"&$B6&\"'!\"&CHAR(MATCH($D7,INDIRECT(\"'\"&$B6&\"'!6:6\",TRUE),0)+64)&MATCH(E$3,INDIRECT(\"'\"&$B6&\"'!B:B\",TRUE),0)&\":\"&CHAR(MATCH($D7,INDIRECT(\"'\"&$B6&\"'!6:6\",TRUE),0)+64)&MATCH(E$3&\"_slut\",INDIRECT(\"'\"&$B6&\"'!B:B\",TRUE),0),TRUE),\"X\")/SUM(E6:E10))","v":0},{"$f":"IFERROR(COUNTIF(INDIRECT(\"'\"&$B6&\"'!\"&CHAR(MATCH($D7,INDIRECT(\"'\"&$B6&\"'!6:6\",TRUE),0)+64)&MATCH(H$3,INDIRECT(\"'\"&$B6&\"'!B:B\",TRUE),0)&\":\"&CHAR(MATCH($D7,INDIRECT(\"'\"&$B6&\"'!6:6\",TRUE),0)+64)&MATCH(H$3&\"_slut\",INDIRECT(\"'\"&$B6&\"'!B:B\",TRUE),0),TRUE),\"X\"),0)","v":0},{"$f":"IF(H11=0,0,COUNTIF(INDIRECT(\"'\"&$B6&\"'!\"&CHAR(MATCH($D7,INDIRECT(\"'\"&$B6&\"'!6:6\",TRUE),0)+64)&MATCH(H$3,INDIRECT(\"'\"&$B6&\"'!B:B\",TRUE),0)&\":\"&CHAR(MATCH($D7,INDIRECT(\"'\"&$B6&\"'!6:6\",TRUE),0)+64)&MATCH(H$3&\"_slut\",INDIRECT(\"'\"&$B6&\"'!B:B\",TRUE),0),TRUE),\"X\")/H$61)","v":0},{"$f":"IF(H11=0,0,COUNTIF(INDIRECT(\"'\"&$B6&\"'!\"&CHAR(MATCH($D7,INDIRECT(\"'\"&$B6&\"'!6:6\",TRUE),0)+64)&MATCH(H$3,INDIRECT(\"'\"&$B6&\"'!B:B\",TRUE),0)&\":\"&CHAR(MATCH($D7,INDIRECT(\"'\"&$B6&\"'!6:6\",TRUE),0)+64)&MATCH(H$3&\"_slut\",INDIRECT(\"'\"&$B6&\"'!B:B\",TRUE),0),TRUE),\"X\")/SUM(H6:H10))","v":0},{"$f":"IFERROR(COUNTIF(INDIRECT(\"'\"&$B6&\"'!\"&CHAR(MATCH($D7,INDIRECT(\"'\"&$B6&\"'!6:6\",TRUE),0)+64)&MATCH(K$3,INDIRECT(\"'\"&$B6&\"'!B:B\",TRUE),0)&\":\"&CHAR(MATCH($D7,INDIRECT(\"'\"&$B6&\"'!6:6\",TRUE),0)+64)&MATCH(K$3&\"_slut\",INDIRECT(\"'\"&$B6&\"'!B:B\",TRUE),0),TRUE),\"X\"),0)","v":0},{"$f":"IF(K11=0,0,COUNTIF(INDIRECT(\"'\"&$B6&\"'!\"&CHAR(MATCH($D7,INDIRECT(\"'\"&$B6&\"'!6:6\",TRUE),0)+64)&MATCH(K$3,INDIRECT(\"'\"&$B6&\"'!B:B\",TRUE),0)&\":\"&CHAR(MATCH($D7,INDIRECT(\"'\"&$B6&\"'!6:6\",TRUE),0)+64)&MATCH(K$3&\"_slut\",INDIRECT(\"'\"&$B6&\"'!B:B\",TRUE),0),TRUE),\"X\")/K$61)","v":0},{"$f":"IF(K11=0,0,COUNTIF(INDIRECT(\"'\"&$B6&\"'!\"&CHAR(MATCH($D7,INDIRECT(\"'\"&$B6&\"'!6:6\",TRUE),0)+64)&MATCH(K$3,INDIRECT(\"'\"&$B6&\"'!B:B\",TRUE),0)&\":\"&CHAR(MATCH($D7,INDIRECT(\"'\"&$B6&\"'!6:6\",TRUE),0)+64)&MATCH(K$3&\"_slut\",INDIRECT(\"'\"&$B6&\"'!B:B\",TRUE),0),TRUE),\"X\")/SUM(K6:K10))","v":0},{"$f":"IFERROR(COUNTIF(INDIRECT(\"'\"&$B6&\"'!\"&CHAR(MATCH($D7,INDIRECT(\"'\"&$B6&\"'!6:6\",TRUE),0)+64)&MATCH(N$3,INDIRECT(\"'\"&$B6&\"'!B:B\",TRUE),0)&\":\"&CHAR(MATCH($D7,INDIRECT(\"'\"&$B6&\"'!6:6\",TRUE),0)+64)&MATCH(N$3&\"_slut\",INDIRECT(\"'\"&$B6&\"'!B:B\",TRUE),0),TRUE),\"X\"),0)","v":0},{"$f":"IF(N11=0,0,COUNTIF(INDIRECT(\"'\"&$B6&\"'!\"&CHAR(MATCH($D7,INDIRECT(\"'\"&$B6&\"'!6:6\",TRUE),0)+64)&MATCH(N$3,INDIRECT(\"'\"&$B6&\"'!B:B\",TRUE),0)&\":\"&CHAR(MATCH($D7,INDIRECT(\"'\"&$B6&\"'!6:6\",TRUE),0)+64)&MATCH(N$3&\"_slut\",INDIRECT(\"'\"&$B6&\"'!B:B\",TRUE),0),TRUE),\"X\")/N$61)","v":0},{"$f":"IF(N11=0,0,COUNTIF(INDIRECT(\"'\"&$B6&\"'!\"&CHAR(MATCH($D7,INDIRECT(\"'\"&$B6&\"'!6:6\",TRUE),0)+64)&MATCH(N$3,INDIRECT(\"'\"&$B6&\"'!B:B\",TRUE),0)&\":\"&CHAR(MATCH($D7,INDIRECT(\"'\"&$B6&\"'!6:6\",TRUE),0)+64)&MATCH(N$3&\"_slut\",INDIRECT(\"'\"&$B6&\"'!B:B\",TRUE),0),TRUE),\"X\")/SUM(N6:N10))","v":0}]
[null,null,{"$f":"B6","v":"Risikovurdering"},"Nej",{"$f":"IFERROR(COUNTIF(INDIRECT(\"'\"&$B6&\"'!\"&CHAR(MATCH($D8,INDIRECT(\"'\"&$B6&\"'!6:6\",TRUE),0)+64)&MATCH(E$3,INDIRECT(\"'\"&$B6&\"'!B:B\",TRUE),0)&\":\"&CHAR(MATCH($D8,INDIRECT(\"'\"&$B6&\"'!6:6\",TRUE),0)+64)&MATCH(E$3&\"_slut\",INDIRECT(\"'\"&$B6&\"'!B:B\",TRUE),0),TRUE),\"X\"),0)","v":0},{"$f":"IF(E11=0,0,COUNTIF(INDIRECT(\"'\"&$B6&\"'!\"&CHAR(MATCH($D8,INDIRECT(\"'\"&$B6&\"'!6:6\",TRUE),0)+64)&MATCH(E$3,INDIRECT(\"'\"&$B6&\"'!B:B\",TRUE),0)&\":\"&CHAR(MATCH($D8,INDIRECT(\"'\"&$B6&\"'!6:6\",TRUE),0)+64)&MATCH(E$3&\"_slut\",INDIRECT(\"'\"&$B6&\"'!B:B\",TRUE),0),TRUE),\"X\")/E$61)","v":0},{"$f":"IF(E11=0,0,COUNTIF(INDIRECT(\"'\"&$B6&\"'!\"&CHAR(MATCH($D8,INDIRECT(\"'\"&$B6&\"'!6:6\",TRUE),0)+64)&MATCH(E$3,INDIRECT(\"'\"&$B6&\"'!B:B\",TRUE),0)&\":\"&CHAR(MATCH($D8,INDIRECT(\"'\"&$B6&\"'!6:6\",TRUE),0)+64)&MATCH(E$3&\"_slut\",INDIRECT(\"'\"&$B6&\"'!B:B\",TRUE),0),TRUE),\"X\")/SUM(E6:E10))","v":0},{"$f":"IFERROR(COUNTIF(INDIRECT(\"'\"&$B6&\"'!\"&CHAR(MATCH($D8,INDIRECT(\"'\"&$B6&\"'!6:6\",TRUE),0)+64)&MATCH(H$3,INDIRECT(\"'\"&$B6&\"'!B:B\",TRUE),0)&\":\"&CHAR(MATCH($D8,INDIRECT(\"'\"&$B6&\"'!6:6\",TRUE),0)+64)&MATCH(H$3&\"_slut\",INDIRECT(\"'\"&$B6&\"'!B:B\",TRUE),0),TRUE),\"X\"),0)","v":0},{"$f":"IF(H11=0,0,COUNTIF(INDIRECT(\"'\"&$B6&\"'!\"&CHAR(MATCH($D8,INDIRECT(\"'\"&$B6&\"'!6:6\",TRUE),0)+64)&MATCH(H$3,INDIRECT(\"'\"&$B6&\"'!B:B\",TRUE),0)&\":\"&CHAR(MATCH($D8,INDIRECT(\"'\"&$B6&\"'!6:6\",TRUE),0)+64)&MATCH(H$3&\"_slut\",INDIRECT(\"'\"&$B6&\"'!B:B\",TRUE),0),TRUE),\"X\")/H$61)","v":0},{"$f":"IF(H11=0,0,COUNTIF(INDIRECT(\"'\"&$B6&\"'!\"&CHAR(MATCH($D8,INDIRECT(\"'\"&$B6&\"'!6:6\",TRUE),0)+64)&MATCH(H$3,INDIRECT(\"'\"&$B6&\"'!B:B\",TRUE),0)&\":\"&CHAR(MATCH($D8,INDIRECT(\"'\"&$B6&\"'!6:6\",TRUE),0)+64)&MATCH(H$3&\"_slut\",INDIRECT(\"'\"&$B6&\"'!B:B\",TRUE),0),TRUE),\"X\")/SUM(H6:H10))","v":0},{"$f":"IFERROR(COUNTIF(INDIRECT(\"'\"&$B6&\"'!\"&CHAR(MATCH($D8,INDIRECT(\"'\"&$B6&\"'!6:6\",TRUE),0)+64)&MATCH(K$3,INDIRECT(\"'\"&$B6&\"'!B:B\",TRUE),0)&\":\"&CHAR(MATCH($D8,INDIRECT(\"'\"&$B6&\"'!6:6\",TRUE),0)+64)&MATCH(K$3&\"_slut\",INDIRECT(\"'\"&$B6&\"'!B:B\",TRUE),0),TRUE),\"X\"),0)","v":0},{"$f":"IF(K11=0,0,COUNTIF(INDIRECT(\"'\"&$B6&\"'!\"&CHAR(MATCH($D8,INDIRECT(\"'\"&$B6&\"'!6:6\",TRUE),0)+64)&MATCH(K$3,INDIRECT(\"'\"&$B6&\"'!B:B\",TRUE),0)&\":\"&CHAR(MATCH($D8,INDIRECT(\"'\"&$B6&\"'!6:6\",TRUE),0)+64)&MATCH(K$3&\"_slut\",INDIRECT(\"'\"&$B6&\"'!B:B\",TRUE),0),TRUE),\"X\")/K$61)","v":0},{"$f":"IF(K11=0,0,COUNTIF(INDIRECT(\"'\"&$B6&\"'!\"&CHAR(MATCH($D8,INDIRECT(\"'\"&$B6&\"'!6:6\",TRUE),0)+64)&MATCH(K$3,INDIRECT(\"'\"&$B6&\"'!B:B\",TRUE),0)&\":\"&CHAR(MATCH($D8,INDIRECT(\"'\"&$B6&\"'!6:6\",TRUE),0)+64)&MATCH(K$3&\"_slut\",INDIRECT(\"'\"&$B6&\"'!B:B\",TRUE),0),TRUE),\"X\")/SUM(K6:K10))","v":0},{"$f":"IFERROR(COUNTIF(INDIRECT(\"'\"&$B6&\"'!\"&CHAR(MATCH($D8,INDIRECT(\"'\"&$B6&\"'!6:6\",TRUE),0)+64)&MATCH(N$3,INDIRECT(\"'\"&$B6&\"'!B:B\",TRUE),0)&\":\"&CHAR(MATCH($D8,INDIRECT(\"'\"&$B6&\"'!6:6\",TRUE),0)+64)&MATCH(N$3&\"_slut\",INDIRECT(\"'\"&$B6&\"'!B:B\",TRUE),0),TRUE),\"X\"),0)","v":0},{"$f":"IF(N11=0,0,COUNTIF(INDIRECT(\"'\"&$B6&\"'!\"&CHAR(MATCH($D8,INDIRECT(\"'\"&$B6&\"'!6:6\",TRUE),0)+64)&MATCH(N$3,INDIRECT(\"'\"&$B6&\"'!B:B\",TRUE),0)&\":\"&CHAR(MATCH($D8,INDIRECT(\"'\"&$B6&\"'!6:6\",TRUE),0)+64)&MATCH(N$3&\"_slut\",INDIRECT(\"'\"&$B6&\"'!B:B\",TRUE),0),TRUE),\"X\")/N$61)","v":0},{"$f":"IF(N11=0,0,COUNTIF(INDIRECT(\"'\"&$B6&\"'!\"&CHAR(MATCH($D8,INDIRECT(\"'\"&$B6&\"'!6:6\",TRUE),0)+64)&MATCH(N$3,INDIRECT(\"'\"&$B6&\"'!B:B\",TRUE),0)&\":\"&CHAR(MATCH($D8,INDIRECT(\"'\"&$B6&\"'!6:6\",TRUE),0)+64)&MATCH(N$3&\"_slut\",INDIRECT(\"'\"&$B6&\"'!B:B\",TRUE),0),TRUE),\"X\")/SUM(N6:N10))","v":0}]
[null,null,{"$f":"B6","v":"Risikovurdering"},"Ikke relevant",{"$f":"IFERROR(COUNTIF(INDIRECT(\"'\"&$B6&\"'!\"&CHAR(MATCH($D9,INDIRECT(\"'\"&$B6&\"'!6:6\",TRUE),0)+64)&MATCH(E$3,INDIRECT(\"'\"&$B6&\"'!B:B\",TRUE),0)&\":\"&CHAR(MATCH($D9,INDIRECT(\"'\"&$B6&\"'!6:6\",TRUE),0)+64)&MATCH(E$3&\"_slut\",INDIRECT(\"'\"&$B6&\"'!B:B\",TRUE),0),TRUE),\"X\"),0)","v":0},{"$f":"IF(E11=0,0,COUNTIF(INDIRECT(\"'\"&$B6&\"'!\"&CHAR(MATCH($D9,INDIRECT(\"'\"&$B6&\"'!6:6\",TRUE),0)+64)&MATCH(E$3,INDIRECT(\"'\"&$B6&\"'!B:B\",TRUE),0)&\":\"&CHAR(MATCH($D9,INDIRECT(\"'\"&$B6&\"'!6:6\",TRUE),0)+64)&MATCH(E$3&\"_slut\",INDIRECT(\"'\"&$B6&\"'!B:B\",TRUE),0),TRUE),\"X\")/E$61)","v":0},{"$f":"IF(E11=0,0,COUNTIF(INDIRECT(\"'\"&$B6&\"'!\"&CHAR(MATCH($D9,INDIRECT(\"'\"&$B6&\"'!6:6\",TRUE),0)+64)&MATCH(E$3,INDIRECT(\"'\"&$B6&\"'!B:B\",TRUE),0)&\":\"&CHAR(MATCH($D9,INDIRECT(\"'\"&$B6&\"'!6:6\",TRUE),0)+64)&MATCH(E$3&\"_slut\",INDIRECT(\"'\"&$B6&\"'!B:B\",TRUE),0),TRUE),\"X\")/SUM(E6:E10))","v":0},{"$f":"IFERROR(COUNTIF(INDIRECT(\"'\"&$B6&\"'!\"&CHAR(MATCH($D9,INDIRECT(\"'\"&$B6&\"'!6:6\",TRUE),0)+64)&MATCH(H$3,INDIRECT(\"'\"&$B6&\"'!B:B\",TRUE),0)&\":\"&CHAR(MATCH($D9,INDIRECT(\"'\"&$B6&\"'!6:6\",TRUE),0)+64)&MATCH(H$3&\"_slut\",INDIRECT(\"'\"&$B6&\"'!B:B\",TRUE),0),TRUE),\"X\"),0)","v":0},{"$f":"IF(H11=0,0,COUNTIF(INDIRECT(\"'\"&$B6&\"'!\"&CHAR(MATCH($D9,INDIRECT(\"'\"&$B6&\"'!6:6\",TRUE),0)+64)&MATCH(H$3,INDIRECT(\"'\"&$B6&\"'!B:B\",TRUE),0)&\":\"&CHAR(MATCH($D9,INDIRECT(\"'\"&$B6&\"'!6:6\",TRUE),0)+64)&MATCH(H$3&\"_slut\",INDIRECT(\"'\"&$B6&\"'!B:B\",TRUE),0),TRUE),\"X\")/H$61)","v":0},{"$f":"IF(H11=0,0,COUNTIF(INDIRECT(\"'\"&$B6&\"'!\"&CHAR(MATCH($D9,INDIRECT(\"'\"&$B6&\"'!6:6\",TRUE),0)+64)&MATCH(H$3,INDIRECT(\"'\"&$B6&\"'!B:B\",TRUE),0)&\":\"&CHAR(MATCH($D9,INDIRECT(\"'\"&$B6&\"'!6:6\",TRUE),0)+64)&MATCH(H$3&\"_slut\",INDIRECT(\"'\"&$B6&\"'!B:B\",TRUE),0),TRUE),\"X\")/SUM(H6:H10))","v":0},{"$f":"IFERROR(COUNTIF(INDIRECT(\"'\"&$B6&\"'!\"&CHAR(MATCH($D9,INDIRECT(\"'\"&$B6&\"'!6:6\",TRUE),0)+64)&MATCH(K$3,INDIRECT(\"'\"&$B6&\"'!B:B\",TRUE),0)&\":\"&CHAR(MATCH($D9,INDIRECT(\"'\"&$B6&\"'!6:6\",TRUE),0)+64)&MATCH(K$3&\"_slut\",INDIRECT(\"'\"&$B6&\"'!B:B\",TRUE),0),TRUE),\"X\"),0)","v":0},{"$f":"IF(K11=0,0,COUNTIF(INDIRECT(\"'\"&$B6&\"'!\"&CHAR(MATCH($D9,INDIRECT(\"'\"&$B6&\"'!6:6\",TRUE),0)+64)&MATCH(K$3,INDIRECT(\"'\"&$B6&\"'!B:B\",TRUE),0)&\":\"&CHAR(MATCH($D9,INDIRECT(\"'\"&$B6&\"'!6:6\",TRUE),0)+64)&MATCH(K$3&\"_slut\",INDIRECT(\"'\"&$B6&\"'!B:B\",TRUE),0),TRUE),\"X\")/K$61)","v":0},{"$f":"IF(K11=0,0,COUNTIF(INDIRECT(\"'\"&$B6&\"'!\"&CHAR(MATCH($D9,INDIRECT(\"'\"&$B6&\"'!6:6\",TRUE),0)+64)&MATCH(K$3,INDIRECT(\"'\"&$B6&\"'!B:B\",TRUE),0)&\":\"&CHAR(MATCH($D9,INDIRECT(\"'\"&$B6&\"'!6:6\",TRUE),0)+64)&MATCH(K$3&\"_slut\",INDIRECT(\"'\"&$B6&\"'!B:B\",TRUE),0),TRUE),\"X\")/SUM(K6:K10))","v":0},{"$f":"IFERROR(COUNTIF(INDIRECT(\"'\"&$B6&\"'!\"&CHAR(MATCH($D9,INDIRECT(\"'\"&$B6&\"'!6:6\",TRUE),0)+64)&MATCH(N$3,INDIRECT(\"'\"&$B6&\"'!B:B\",TRUE),0)&\":\"&CHAR(MATCH($D9,INDIRECT(\"'\"&$B6&\"'!6:6\",TRUE),0)+64)&MATCH(N$3&\"_slut\",INDIRECT(\"'\"&$B6&\"'!B:B\",TRUE),0),TRUE),\"X\"),0)","v":0},{"$f":"IF(N11=0,0,COUNTIF(INDIRECT(\"'\"&$B6&\"'!\"&CHAR(MATCH($D9,INDIRECT(\"'\"&$B6&\"'!6:6\",TRUE),0)+64)&MATCH(N$3,INDIRECT(\"'\"&$B6&\"'!B:B\",TRUE),0)&\":\"&CHAR(MATCH($D9,INDIRECT(\"'\"&$B6&\"'!6:6\",TRUE),0)+64)&MATCH(N$3&\"_slut\",INDIRECT(\"'\"&$B6&\"'!B:B\",TRUE),0),TRUE),\"X\")/N$61)","v":0},{"$f":"IF(N11=0,0,COUNTIF(INDIRECT(\"'\"&$B6&\"'!\"&CHAR(MATCH($D9,INDIRECT(\"'\"&$B6&\"'!6:6\",TRUE),0)+64)&MATCH(N$3,INDIRECT(\"'\"&$B6&\"'!B:B\",TRUE),0)&\":\"&CHAR(MATCH($D9,INDIRECT(\"'\"&$B6&\"'!6:6\",TRUE),0)+64)&MATCH(N$3&\"_slut\",INDIRECT(\"'\"&$B6&\"'!B:B\",TRUE),0),TRUE),\"X\")/SUM(N6:N10))","v":0}]
[null,null,{"$f":"B6","v":"Risikovurdering"},"Ikke sat",{"$f":"IF(ISERROR(MATCH(E$3,INDIRECT(\"'\"&$B6&\"'!B:B\",TRUE),0)),0,COUNTA(INDIRECT(\"'\"&$B6&\"'!E\"&MATCH(E$3,INDIRECT(\"'\"&$B6&\"'!B:B\",TRUE),0)&\":E\"&MATCH(E$3&\"_slut\",INDIRECT(\"'\"&$B6&\"'!B:B\",TRUE),0),TRUE))-E6-E7-E8-E9)","v":2},{"$f":"IF(E11=0,0,E11/E$61-F6-F7-F8-F9)","v":6.4516129032258063E-2},{"$f":"IF(E11=0,0,1-G6-G7-G8-G9)","v":1},{"$f":"IF(ISERROR(MATCH(H$3,INDIRECT(\"'\"&$B6&\"'!B:B\",TRUE),0)),0,COUNTA(INDIRECT(\"'\"&$B6&\"'!E\"&MATCH(H$3,INDIRECT(\"'\"&$B6&\"'!B:B\",TRUE),0)&\":E\"&MATCH(H$3&\"_slut\",INDIRECT(\"'\"&$B6&\"'!B:B\",TRUE),0),TRUE))-H6-H7-H8-H9)","v":5},{"$f":"IF(H11=0,0,H11/H$61-I6-I7-I8-I9)","v":0.1388888888888889},{"$f":"IF(H11=0,0,1-J6-J7-J8-J9)","v":1},{"$f":"IF(ISERROR(MATCH(K$3,INDIRECT(\"'\"&$B6&\"'!B:B\",TRUE),0)),0,COUNTA(INDIRECT(\"'\"&$B6&\"'!E\"&MATCH(K$3,INDIRECT(\"'\"&$B6&\"'!B:B\",TRUE),0)&\":E\"&MATCH(K$3&\"_slut\",INDIRECT(\"'\"&$B6&\"'!B:B\",TRUE),0),TRUE))-K6-K7-K8-K9)","v":3},{"$f":"IF(K11=0,0,K11/K$61-L6-L7-L8-L9)","v":0.1111111111111111},{"$f":"IF(K11=0,0,1-M6-M7-M8-M9)","v":1},{"$f":"IF(ISERROR(MATCH(N$3,INDIRECT(\"'\"&$B6&\"'!B:B\",TRUE),0)),0,COUNTA(INDIRECT(\"'\"&$B6&\"'!E\"&MATCH(N$3,INDIRECT(\"'\"&$B6&\"'!B:B\",TRUE),0)&\":E\"&MATCH(N$3&\"_slut\",INDIRECT(\"'\"&$B6&\"'!B:B\",TRUE),0),TRUE))-N6-N7-N8-N9)","v":1},{"$f":"IF(N11=0,0,N11/N$61-O6-O7-O8-O9)","v":6.25E-2},{"$f":"IF(N11=0,0,1-P6-P7-P8-P9)","v":1}]
[null,null,{"$f":"B6","v":"Risikovurdering"},"TOTAL",{"$f":"SUM(E6:E10)","v":2},{"$f":"SUM(F6:F9)","v":0},{"$f":"SUM(G6:G9)","v":0},{"$f":"SUM(H6:H10)","v":5},{"$f":"SUM(I6:I9)","v":0},0,{"$f":"SUM(K6:K10)","v":3},{"$f":"SUM(L6:L9)","v":0},0,{"$f":"SUM(N6:N10)","v":1},{"$f":"SUM(O6:O9)","v":0},0]
[null,"Risikohåndtering",{"$f":"B12","v":"Risikohåndtering"},"Ja",{"$f":"IFERROR(COUNTIF(INDIRECT(\"'\"&$B12&\"'!\"&CHAR(MATCH($D12,INDIRECT(\"'\"&$B12&\"'!6:6\",TRUE),0)+64)&MATCH(E$3,INDIRECT(\"'\"&$B12&\"'!B:B\",TRUE),0)&\":\"&CHAR(MATCH($D12,INDIRECT(\"'\"&$B12&\"'!6:6\",TRUE),0)+64)&MATCH(E$3&\"_slut\",INDIRECT(\"'\"&$B12&\"'!B:B\",TRUE),0),TRUE),\"X\"),0)","v":0},{"$f":"IF(E17=0,0,COUNTIF(INDIRECT(\"'\"&$B12&\"'!\"&CHAR(MATCH($D12,INDIRECT(\"'\"&$B12&\"'!6:6\",TRUE),0)+64)&MATCH(E$3,INDIRECT(\"'\"&$B12&\"'!B:B\",TRUE),0)&\":\"&CHAR(MATCH($D12,INDIRECT(\"'\"&$B12&\"'!6:6\",TRUE),0)+64)&MATCH(E$3&\"_slut\",INDIRECT(\"'\"&$B12&\"'!B:B\",TRUE),0),TRUE),\"X\")/E$61)","v":0},{"$f":"IF(E17=0,0,COUNTIF(INDIRECT(\"'\"&$B12&\"'!\"&CHAR(MATCH($D12,INDIRECT(\"'\"&$B12&\"'!6:6\",TRUE),0)+64)&MATCH(E$3,INDIRECT(\"'\"&$B12&\"'!B:B\",TRUE),0)&\":\"&CHAR(MATCH($D12,INDIRECT(\"'\"&$B12&\"'!6:6\",TRUE),0)+64)&MATCH(E$3&\"_slut\",INDIRECT(\"'\"&$B12&\"'!B:B\",TRUE),0),TRUE),\"X\")/SUM(E12:E16))","v":0},{"$f":"IFERROR(COUNTIF(INDIRECT(\"'\"&$B12&\"'!\"&CHAR(MATCH($D12,INDIRECT(\"'\"&$B12&\"'!6:6\",TRUE),0)+64)&MATCH(H$3,INDIRECT(\"'\"&$B12&\"'!B:B\",TRUE),0)&\":\"&CHAR(MATCH($D12,INDIRECT(\"'\"&$B12&\"'!6:6\",TRUE),0)+64)&MATCH(H$3&\"_slut\",INDIRECT(\"'\"&$B12&\"'!B:B\",TRUE),0),TRUE),\"X\"),0)","v":0},{"$f":"IF(H17=0,0,COUNTIF(INDIRECT(\"'\"&$B12&\"'!\"&CHAR(MATCH($D12,INDIRECT(\"'\"&$B12&\"'!6:6\",TRUE),0)+64)&MATCH(H$3,INDIRECT(\"'\"&$B12&\"'!B:B\",TRUE),0)&\":\"&CHAR(MATCH($D12,INDIRECT(\"'\"&$B12&\"'!6:6\",TRUE),0)+64)&MATCH(H$3&\"_slut\",INDIRECT(\"'\"&$B12&\"'!B:B\",TRUE),0),TRUE),\"X\")/H$61)","v":0},{"$f":"IF(H17=0,0,COUNTIF(INDIRECT(\"'\"&$B12&\"'!\"&CHAR(MATCH($D12,INDIRECT(\"'\"&$B12&\"'!6:6\",TRUE),0)+64)&MATCH(H$3,INDIRECT(\"'\"&$B12&\"'!B:B\",TRUE),0)&\":\"&CHAR(MATCH($D12,INDIRECT(\"'\"&$B12&\"'!6:6\",TRUE),0)+64)&MATCH(H$3&\"_slut\",INDIRECT(\"'\"&$B12&\"'!B:B\",TRUE),0),TRUE),\"X\")/SUM(H12:H16))","v":0},{"$f":"IFERROR(COUNTIF(INDIRECT(\"'\"&$B12&\"'!\"&CHAR(MATCH($D12,INDIRECT(\"'\"&$B12&\"'!6:6\",TRUE),0)+64)&MATCH(K$3,INDIRECT(\"'\"&$B12&\"'!B:B\",TRUE),0)&\":\"&CHAR(MATCH($D12,INDIRECT(\"'\"&$B12&\"'!6:6\",TRUE),0)+64)&MATCH(K$3&\"_slut\",INDIRECT(\"'\"&$B12&\"'!B:B\",TRUE),0),TRUE),\"X\"),0)","v":0},{"$f":"IF(K17=0,0,COUNTIF(INDIRECT(\"'\"&$B12&\"'!\"&CHAR(MATCH($D12,INDIRECT(\"'\"&$B12&\"'!6:6\",TRUE),0)+64)&MATCH(K$3,INDIRECT(\"'\"&$B12&\"'!B:B\",TRUE),0)&\":\"&CHAR(MATCH($D12,INDIRECT(\"'\"&$B12&\"'!6:6\",TRUE),0)+64)&MATCH(K$3&\"_slut\",INDIRECT(\"'\"&$B12&\"'!B:B\",TRUE),0),TRUE),\"X\")/K$61)","v":0},{"$f":"IF(K17=0,0,COUNTIF(INDIRECT(\"'\"&$B12&\"'!\"&CHAR(MATCH($D12,INDIRECT(\"'\"&$B12&\"'!6:6\",TRUE),0)+64)&MATCH(K$3,INDIRECT(\"'\"&$B12&\"'!B:B\",TRUE),0)&\":\"&CHAR(MATCH($D12,INDIRECT(\"'\"&$B12&\"'!6:6\",TRUE),0)+64)&MATCH(K$3&\"_slut\",INDIRECT(\"'\"&$B12&\"'!B:B\",TRUE),0),TRUE),\"X\")/SUM(K12:K16))","v":0},{"$f":"IFERROR(COUNTIF(INDIRECT(\"'\"&$B12&\"'!\"&CHAR(MATCH($D12,INDIRECT(\"'\"&$B12&\"'!6:6\",TRUE),0)+64)&MATCH(N$3,INDIRECT(\"'\"&$B12&\"'!B:B\",TRUE),0)&\":\"&CHAR(MATCH($D12,INDIRECT(\"'\"&$B12&\"'!6:6\",TRUE),0)+64)&MATCH(N$3&\"_slut\",INDIRECT(\"'\"&$B12&\"'!B:B\",TRUE),0),TRUE),\"X\"),0)","v":0},{"$f":"IF(N17=0,0,COUNTIF(INDIRECT(\"'\"&$B12&\"'!\"&CHAR(MATCH($D12,INDIRECT(\"'\"&$B12&\"'!6:6\",TRUE),0)+64)&MATCH(N$3,INDIRECT(\"'\"&$B12&\"'!B:B\",TRUE),0)&\":\"&CHAR(MATCH($D12,INDIRECT(\"'\"&$B12&\"'!6:6\",TRUE),0)+64)&MATCH(N$3&\"_slut\",INDIRECT(\"'\"&$B12&\"'!B:B\",TRUE),0),TRUE),\"X\")/N$61)","v":0},{"$f":"IF(N17=0,0,COUNTIF(INDIRECT(\"'\"&$B12&\"'!\"&CHAR(MATCH($D12,INDIRECT(\"'\"&$B12&\"'!6:6\",TRUE),0)+64)&MATCH(N$3,INDIRECT(\"'\"&$B12&\"'!B:B\",TRUE),0)&\":\"&CHAR(MATCH($D12,INDIRECT(\"'\"&$B12&\"'!6:6\",TRUE),0)+64)&MATCH(N$3&\"_slut\",INDIRECT(\"'\"&$B12&\"'!B:B\",TRUE),0),TRUE),\"X\")/SUM(N12:N16))","v":0}]
[null,null,{"$f":"B12","v":"Risikohåndtering"},"Delvist",{"$f":"IFERROR(COUNTIF(INDIRECT(\"'\"&$B12&\"'!\"&CHAR(MATCH($D13,INDIRECT(\"'\"&$B12&\"'!6:6\",TRUE),0)+64)&MATCH(E$3,INDIRECT(\"'\"&$B12&\"'!B:B\",TRUE),0)&\":\"&CHAR(MATCH($D13,INDIRECT(\"'\"&$B12&\"'!6:6\",TRUE),0)+64)&MATCH(E$3&\"_slut\",INDIRECT(\"'\"&$B12&\"'!B:B\",TRUE),0),TRUE),\"X\"),0)","v":0},{"$f":"IF(E17=0,0,COUNTIF(INDIRECT(\"'\"&$B12&\"'!\"&CHAR(MATCH($D13,INDIRECT(\"'\"&$B12&\"'!6:6\",TRUE),0)+64)&MATCH(E$3,INDIRECT(\"'\"&$B12&\"'!B:B\",TRUE),0)&\":\"&CHAR(MATCH($D13,INDIRECT(\"'\"&$B12&\"'!6:6\",TRUE),0)+64)&MATCH(E$3&\"_slut\",INDIRECT(\"'\"&$B12&\"'!B:B\",TRUE),0),TRUE),\"X\")/E$61)","v":0},{"$f":"IF(E17=0,0,COUNTIF(INDIRECT(\"'\"&$B12&\"'!\"&CHAR(MATCH($D13,INDIRECT(\"'\"&$B12&\"'!6:6\",TRUE),0)+64)&MATCH(E$3,INDIRECT(\"'\"&$B12&\"'!B:B\",TRUE),0)&\":\"&CHAR(MATCH($D13,INDIRECT(\"'\"&$B12&\"'!6:6\",TRUE),0)+64)&MATCH(E$3&\"_slut\",INDIRECT(\"'\"&$B12&\"'!B:B\",TRUE),0),TRUE),\"X\")/SUM(E12:E16))","v":0},{"$f":"IFERROR(COUNTIF(INDIRECT(\"'\"&$B12&\"'!\"&CHAR(MATCH($D13,INDIRECT(\"'\"&$B12&\"'!6:6\",TRUE),0)+64)&MATCH(H$3,INDIRECT(\"'\"&$B12&\"'!B:B\",TRUE),0)&\":\"&CHAR(MATCH($D13,INDIRECT(\"'\"&$B12&\"'!6:6\",TRUE),0)+64)&MATCH(H$3&\"_slut\",INDIRECT(\"'\"&$B12&\"'!B:B\",TRUE),0),TRUE),\"X\"),0)","v":0},{"$f":"IF(H17=0,0,COUNTIF(INDIRECT(\"'\"&$B12&\"'!\"&CHAR(MATCH($D13,INDIRECT(\"'\"&$B12&\"'!6:6\",TRUE),0)+64)&MATCH(H$3,INDIRECT(\"'\"&$B12&\"'!B:B\",TRUE),0)&\":\"&CHAR(MATCH($D13,INDIRECT(\"'\"&$B12&\"'!6:6\",TRUE),0)+64)&MATCH(H$3&\"_slut\",INDIRECT(\"'\"&$B12&\"'!B:B\",TRUE),0),TRUE),\"X\")/H$61)","v":0},{"$f":"IF(H17=0,0,COUNTIF(INDIRECT(\"'\"&$B12&\"'!\"&CHAR(MATCH($D13,INDIRECT(\"'\"&$B12&\"'!6:6\",TRUE),0)+64)&MATCH(H$3,INDIRECT(\"'\"&$B12&\"'!B:B\",TRUE),0)&\":\"&CHAR(MATCH($D13,INDIRECT(\"'\"&$B12&\"'!6:6\",TRUE),0)+64)&MATCH(H$3&\"_slut\",INDIRECT(\"'\"&$B12&\"'!B:B\",TRUE),0),TRUE),\"X\")/SUM(H12:H16))","v":0},{"$f":"IFERROR(COUNTIF(INDIRECT(\"'\"&$B12&\"'!\"&CHAR(MATCH($D13,INDIRECT(\"'\"&$B12&\"'!6:6\",TRUE),0)+64)&MATCH(K$3,INDIRECT(\"'\"&$B12&\"'!B:B\",TRUE),0)&\":\"&CHAR(MATCH($D13,INDIRECT(\"'\"&$B12&\"'!6:6\",TRUE),0)+64)&MATCH(K$3&\"_slut\",INDIRECT(\"'\"&$B12&\"'!B:B\",TRUE),0),TRUE),\"X\"),0)","v":0},{"$f":"IF(K17=0,0,COUNTIF(INDIRECT(\"'\"&$B12&\"'!\"&CHAR(MATCH($D13,INDIRECT(\"'\"&$B12&\"'!6:6\",TRUE),0)+64)&MATCH(K$3,INDIRECT(\"'\"&$B12&\"'!B:B\",TRUE),0)&\":\"&CHAR(MATCH($D13,INDIRECT(\"'\"&$B12&\"'!6:6\",TRUE),0)+64)&MATCH(K$3&\"_slut\",INDIRECT(\"'\"&$B12&\"'!B:B\",TRUE),0),TRUE),\"X\")/K$61)","v":0},{"$f":"IF(K17=0,0,COUNTIF(INDIRECT(\"'\"&$B12&\"'!\"&CHAR(MATCH($D13,INDIRECT(\"'\"&$B12&\"'!6:6\",TRUE),0)+64)&MATCH(K$3,INDIRECT(\"'\"&$B12&\"'!B:B\",TRUE),0)&\":\"&CHAR(MATCH($D13,INDIRECT(\"'\"&$B12&\"'!6:6\",TRUE),0)+64)&MATCH(K$3&\"_slut\",INDIRECT(\"'\"&$B12&\"'!B:B\",TRUE),0),TRUE),\"X\")/SUM(K12:K16))","v":0},{"$f":"IFERROR(COUNTIF(INDIRECT(\"'\"&$B12&\"'!\"&CHAR(MATCH($D13,INDIRECT(\"'\"&$B12&\"'!6:6\",TRUE),0)+64)&MATCH(N$3,INDIRECT(\"'\"&$B12&\"'!B:B\",TRUE),0)&\":\"&CHAR(MATCH($D13,INDIRECT(\"'\"&$B12&\"'!6:6\",TRUE),0)+64)&MATCH(N$3&\"_slut\",INDIRECT(\"'\"&$B12&\"'!B:B\",TRUE),0),TRUE),\"X\"),0)","v":0},{"$f":"IF(N17=0,0,COUNTIF(INDIRECT(\"'\"&$B12&\"'!\"&CHAR(MATCH($D13,INDIRECT(\"'\"&$B12&\"'!6:6\",TRUE),0)+64)&MATCH(N$3,INDIRECT(\"'\"&$B12&\"'!B:B\",TRUE),0)&\":\"&CHAR(MATCH($D13,INDIRECT(\"'\"&$B12&\"'!6:6\",TRUE),0)+64)&MATCH(N$3&\"_slut\",INDIRECT(\"'\"&$B12&\"'!B:B\",TRUE),0),TRUE),\"X\")/N$61)","v":0},{"$f":"IF(N17=0,0,COUNTIF(INDIRECT(\"'\"&$B12&\"'!\"&CHAR(MATCH($D13,INDIRECT(\"'\"&$B12&\"'!6:6\",TRUE),0)+64)&MATCH(N$3,INDIRECT(\"'\"&$B12&\"'!B:B\",TRUE),0)&\":\"&CHAR(MATCH($D13,INDIRECT(\"'\"&$B12&\"'!6:6\",TRUE),0)+64)&MATCH(N$3&\"_slut\",INDIRECT(\"'\"&$B12&\"'!B:B\",TRUE),0),TRUE),\"X\")/SUM(N12:N16))","v":0}]
[null,null,{"$f":"B12","v":"Risikohåndtering"},"Nej",{"$f":"IFERROR(COUNTIF(INDIRECT(\"'\"&$B12&\"'!\"&CHAR(MATCH($D14,INDIRECT(\"'\"&$B12&\"'!6:6\",TRUE),0)+64)&MATCH(E$3,INDIRECT(\"'\"&$B12&\"'!B:B\",TRUE),0)&\":\"&CHAR(MATCH($D14,INDIRECT(\"'\"&$B12&\"'!6:6\",TRUE),0)+64)&MATCH(E$3&\"_slut\",INDIRECT(\"'\"&$B12&\"'!B:B\",TRUE),0),TRUE),\"X\"),0)","v":0},{"$f":"IF(E17=0,0,COUNTIF(INDIRECT(\"'\"&$B12&\"'!\"&CHAR(MATCH($D14,INDIRECT(\"'\"&$B12&\"'!6:6\",TRUE),0)+64)&MATCH(E$3,INDIRECT(\"'\"&$B12&\"'!B:B\",TRUE),0)&\":\"&CHAR(MATCH($D14,INDIRECT(\"'\"&$B12&\"'!6:6\",TRUE),0)+64)&MATCH(E$3&\"_slut\",INDIRECT(\"'\"&$B12&\"'!B:B\",TRUE),0),TRUE),\"X\")/E$61)","v":0},{"$f":"IF(E17=0,0,COUNTIF(INDIRECT(\"'\"&$B12&\"'!\"&CHAR(MATCH($D14,INDIRECT(\"'\"&$B12&\"'!6:6\",TRUE),0)+64)&MATCH(E$3,INDIRECT(\"'\"&$B12&\"'!B:B\",TRUE),0)&\":\"&CHAR(MATCH($D14,INDIRECT(\"'\"&$B12&\"'!6:6\",TRUE),0)+64)&MATCH(E$3&\"_slut\",INDIRECT(\"'\"&$B12&\"'!B:B\",TRUE),0),TRUE),\"X\")/SUM(E12:E16))","v":0},{"$f":"IFERROR(COUNTIF(INDIRECT(\"'\"&$B12&\"'!\"&CHAR(MATCH($D14,INDIRECT(\"'\"&$B12&\"'!6:6\",TRUE),0)+64)&MATCH(H$3,INDIRECT(\"'\"&$B12&\"'!B:B\",TRUE),0)&\":\"&CHAR(MATCH($D14,INDIRECT(\"'\"&$B12&\"'!6:6\",TRUE),0)+64)&MATCH(H$3&\"_slut\",INDIRECT(\"'\"&$B12&\"'!B:B\",TRUE),0),TRUE),\"X\"),0)","v":0},{"$f":"IF(H17=0,0,COUNTIF(INDIRECT(\"'\"&$B12&\"'!\"&CHAR(MATCH($D14,INDIRECT(\"'\"&$B12&\"'!6:6\",TRUE),0)+64)&MATCH(H$3,INDIRECT(\"'\"&$B12&\"'!B:B\",TRUE),0)&\":\"&CHAR(MATCH($D14,INDIRECT(\"'\"&$B12&\"'!6:6\",TRUE),0)+64)&MATCH(H$3&\"_slut\",INDIRECT(\"'\"&$B12&\"'!B:B\",TRUE),0),TRUE),\"X\")/H$61)","v":0},{"$f":"IF(H17=0,0,COUNTIF(INDIRECT(\"'\"&$B12&\"'!\"&CHAR(MATCH($D14,INDIRECT(\"'\"&$B12&\"'!6:6\",TRUE),0)+64)&MATCH(H$3,INDIRECT(\"'\"&$B12&\"'!B:B\",TRUE),0)&\":\"&CHAR(MATCH($D14,INDIRECT(\"'\"&$B12&\"'!6:6\",TRUE),0)+64)&MATCH(H$3&\"_slut\",INDIRECT(\"'\"&$B12&\"'!B:B\",TRUE),0),TRUE),\"X\")/SUM(H12:H16))","v":0},{"$f":"IFERROR(COUNTIF(INDIRECT(\"'\"&$B12&\"'!\"&CHAR(MATCH($D14,INDIRECT(\"'\"&$B12&\"'!6:6\",TRUE),0)+64)&MATCH(K$3,INDIRECT(\"'\"&$B12&\"'!B:B\",TRUE),0)&\":\"&CHAR(MATCH($D14,INDIRECT(\"'\"&$B12&\"'!6:6\",TRUE),0)+64)&MATCH(K$3&\"_slut\",INDIRECT(\"'\"&$B12&\"'!B:B\",TRUE),0),TRUE),\"X\"),0)","v":0},{"$f":"IF(K17=0,0,COUNTIF(INDIRECT(\"'\"&$B12&\"'!\"&CHAR(MATCH($D14,INDIRECT(\"'\"&$B12&\"'!6:6\",TRUE),0)+64)&MATCH(K$3,INDIRECT(\"'\"&$B12&\"'!B:B\",TRUE),0)&\":\"&CHAR(MATCH($D14,INDIRECT(\"'\"&$B12&\"'!6:6\",TRUE),0)+64)&MATCH(K$3&\"_slut\",INDIRECT(\"'\"&$B12&\"'!B:B\",TRUE),0),TRUE),\"X\")/K$61)","v":0},{"$f":"IF(K17=0,0,COUNTIF(INDIRECT(\"'\"&$B12&\"'!\"&CHAR(MATCH($D14,INDIRECT(\"'\"&$B12&\"'!6:6\",TRUE),0)+64)&MATCH(K$3,INDIRECT(\"'\"&$B12&\"'!B:B\",TRUE),0)&\":\"&CHAR(MATCH($D14,INDIRECT(\"'\"&$B12&\"'!6:6\",TRUE),0)+64)&MATCH(K$3&\"_slut\",INDIRECT(\"'\"&$B12&\"'!B:B\",TRUE),0),TRUE),\"X\")/SUM(K12:K16))","v":0},{"$f":"IFERROR(COUNTIF(INDIRECT(\"'\"&$B12&\"'!\"&CHAR(MATCH($D14,INDIRECT(\"'\"&$B12&\"'!6:6\",TRUE),0)+64)&MATCH(N$3,INDIRECT(\"'\"&$B12&\"'!B:B\",TRUE),0)&\":\"&CHAR(MATCH($D14,INDIRECT(\"'\"&$B12&\"'!6:6\",TRUE),0)+64)&MATCH(N$3&\"_slut\",INDIRECT(\"'\"&$B12&\"'!B:B\",TRUE),0),TRUE),\"X\"),0)","v":0},{"$f":"IF(N17=0,0,COUNTIF(INDIRECT(\"'\"&$B12&\"'!\"&CHAR(MATCH($D14,INDIRECT(\"'\"&$B12&\"'!6:6\",TRUE),0)+64)&MATCH(N$3,INDIRECT(\"'\"&$B12&\"'!B:B\",TRUE),0)&\":\"&CHAR(MATCH($D14,INDIRECT(\"'\"&$B12&\"'!6:6\",TRUE),0)+64)&MATCH(N$3&\"_slut\",INDIRECT(\"'\"&$B12&\"'!B:B\",TRUE),0),TRUE),\"X\")/N$61)","v":0},{"$f":"IF(N17=0,0,COUNTIF(INDIRECT(\"'\"&$B12&\"'!\"&CHAR(MATCH($D14,INDIRECT(\"'\"&$B12&\"'!6:6\",TRUE),0)+64)&MATCH(N$3,INDIRECT(\"'\"&$B12&\"'!B:B\",TRUE),0)&\":\"&CHAR(MATCH($D14,INDIRECT(\"'\"&$B12&\"'!6:6\",TRUE),0)+64)&MATCH(N$3&\"_slut\",INDIRECT(\"'\"&$B12&\"'!B:B\",TRUE),0),TRUE),\"X\")/SUM(N12:N16))","v":0}]
[null,null,{"$f":"B12","v":"Risikohåndtering"},"Ikke relevant",{"$f":"IFERROR(COUNTIF(INDIRECT(\"'\"&$B12&\"'!\"&CHAR(MATCH($D15,INDIRECT(\"'\"&$B12&\"'!6:6\",TRUE),0)+64)&MATCH(E$3,INDIRECT(\"'\"&$B12&\"'!B:B\",TRUE),0)&\":\"&CHAR(MATCH($D15,INDIRECT(\"'\"&$B12&\"'!6:6\",TRUE),0)+64)&MATCH(E$3&\"_slut\",INDIRECT(\"'\"&$B12&\"'!B:B\",TRUE),0),TRUE),\"X\"),0)","v":0},{"$f":"IF(E17=0,0,COUNTIF(INDIRECT(\"'\"&$B12&\"'!\"&CHAR(MATCH($D15,INDIRECT(\"'\"&$B12&\"'!6:6\",TRUE),0)+64)&MATCH(E$3,INDIRECT(\"'\"&$B12&\"'!B:B\",TRUE),0)&\":\"&CHAR(MATCH($D15,INDIRECT(\"'\"&$B12&\"'!6:6\",TRUE),0)+64)&MATCH(E$3&\"_slut\",INDIRECT(\"'\"&$B12&\"'!B:B\",TRUE),0),TRUE),\"X\")/E$61)","v":0},{"$f":"IF(E17=0,0,COUNTIF(INDIRECT(\"'\"&$B12&\"'!\"&CHAR(MATCH($D15,INDIRECT(\"'\"&$B12&\"'!6:6\",TRUE),0)+64)&MATCH(E$3,INDIRECT(\"'\"&$B12&\"'!B:B\",TRUE),0)&\":\"&CHAR(MATCH($D15,INDIRECT(\"'\"&$B12&\"'!6:6\",TRUE),0)+64)&MATCH(E$3&\"_slut\",INDIRECT(\"'\"&$B12&\"'!B:B\",TRUE),0),TRUE),\"X\")/SUM(E12:E16))","v":0},{"$f":"IFERROR(COUNTIF(INDIRECT(\"'\"&$B12&\"'!\"&CHAR(MATCH($D15,INDIRECT(\"'\"&$B12&\"'!6:6\",TRUE),0)+64)&MATCH(H$3,INDIRECT(\"'\"&$B12&\"'!B:B\",TRUE),0)&\":\"&CHAR(MATCH($D15,INDIRECT(\"'\"&$B12&\"'!6:6\",TRUE),0)+64)&MATCH(H$3&\"_slut\",INDIRECT(\"'\"&$B12&\"'!B:B\",TRUE),0),TRUE),\"X\"),0)","v":0},{"$f":"IF(H17=0,0,COUNTIF(INDIRECT(\"'\"&$B12&\"'!\"&CHAR(MATCH($D15,INDIRECT(\"'\"&$B12&\"'!6:6\",TRUE),0)+64)&MATCH(H$3,INDIRECT(\"'\"&$B12&\"'!B:B\",TRUE),0)&\":\"&CHAR(MATCH($D15,INDIRECT(\"'\"&$B12&\"'!6:6\",TRUE),0)+64)&MATCH(H$3&\"_slut\",INDIRECT(\"'\"&$B12&\"'!B:B\",TRUE),0),TRUE),\"X\")/H$61)","v":0},{"$f":"IF(H17=0,0,COUNTIF(INDIRECT(\"'\"&$B12&\"'!\"&CHAR(MATCH($D15,INDIRECT(\"'\"&$B12&\"'!6:6\",TRUE),0)+64)&MATCH(H$3,INDIRECT(\"'\"&$B12&\"'!B:B\",TRUE),0)&\":\"&CHAR(MATCH($D15,INDIRECT(\"'\"&$B12&\"'!6:6\",TRUE),0)+64)&MATCH(H$3&\"_slut\",INDIRECT(\"'\"&$B12&\"'!B:B\",TRUE),0),TRUE),\"X\")/SUM(H12:H16))","v":0},{"$f":"IFERROR(COUNTIF(INDIRECT(\"'\"&$B12&\"'!\"&CHAR(MATCH($D15,INDIRECT(\"'\"&$B12&\"'!6:6\",TRUE),0)+64)&MATCH(K$3,INDIRECT(\"'\"&$B12&\"'!B:B\",TRUE),0)&\":\"&CHAR(MATCH($D15,INDIRECT(\"'\"&$B12&\"'!6:6\",TRUE),0)+64)&MATCH(K$3&\"_slut\",INDIRECT(\"'\"&$B12&\"'!B:B\",TRUE),0),TRUE),\"X\"),0)","v":0},{"$f":"IF(K17=0,0,COUNTIF(INDIRECT(\"'\"&$B12&\"'!\"&CHAR(MATCH($D15,INDIRECT(\"'\"&$B12&\"'!6:6\",TRUE),0)+64)&MATCH(K$3,INDIRECT(\"'\"&$B12&\"'!B:B\",TRUE),0)&\":\"&CHAR(MATCH($D15,INDIRECT(\"'\"&$B12&\"'!6:6\",TRUE),0)+64)&MATCH(K$3&\"_slut\",INDIRECT(\"'\"&$B12&\"'!B:B\",TRUE),0),TRUE),\"X\")/K$61)","v":0},{"$f":"IF(K17=0,0,COUNTIF(INDIRECT(\"'\"&$B12&\"'!\"&CHAR(MATCH($D15,INDIRECT(\"'\"&$B12&\"'!6:6\",TRUE),0)+64)&MATCH(K$3,INDIRECT(\"'\"&$B12&\"'!B:B\",TRUE),0)&\":\"&CHAR(MATCH($D15,INDIRECT(\"'\"&$B12&\"'!6:6\",TRUE),0)+64)&MATCH(K$3&\"_slut\",INDIRECT(\"'\"&$B12&\"'!B:B\",TRUE),0),TRUE),\"X\")/SUM(K12:K16))","v":0},{"$f":"IFERROR(COUNTIF(INDIRECT(\"'\"&$B12&\"'!\"&CHAR(MATCH($D15,INDIRECT(\"'\"&$B12&\"'!6:6\",TRUE),0)+64)&MATCH(N$3,INDIRECT(\"'\"&$B12&\"'!B:B\",TRUE),0)&\":\"&CHAR(MATCH($D15,INDIRECT(\"'\"&$B12&\"'!6:6\",TRUE),0)+64)&MATCH(N$3&\"_slut\",INDIRECT(\"'\"&$B12&\"'!B:B\",TRUE),0),TRUE),\"X\"),0)","v":0},{"$f":"IF(N17=0,0,COUNTIF(INDIRECT(\"'\"&$B12&\"'!\"&CHAR(MATCH($D15,INDIRECT(\"'\"&$B12&\"'!6:6\",TRUE),0)+64)&MATCH(N$3,INDIRECT(\"'\"&$B12&\"'!B:B\",TRUE),0)&\":\"&CHAR(MATCH($D15,INDIRECT(\"'\"&$B12&\"'!6:6\",TRUE),0)+64)&MATCH(N$3&\"_slut\",INDIRECT(\"'\"&$B12&\"'!B:B\",TRUE),0),TRUE),\"X\")/N$61)","v":0},{"$f":"IF(N17=0,0,COUNTIF(INDIRECT(\"'\"&$B12&\"'!\"&CHAR(MATCH($D15,INDIRECT(\"'\"&$B12&\"'!6:6\",TRUE),0)+64)&MATCH(N$3,INDIRECT(\"'\"&$B12&\"'!B:B\",TRUE),0)&\":\"&CHAR(MATCH($D15,INDIRECT(\"'\"&$B12&\"'!6:6\",TRUE),0)+64)&MATCH(N$3&\"_slut\",INDIRECT(\"'\"&$B12&\"'!B:B\",TRUE),0),TRUE),\"X\")/SUM(N12:N16))","v":0}]
[null,null,{"$f":"B12","v":"Risikohåndtering"},"Ikke sat",{"$f":"IF(ISERROR(MATCH(E$3,INDIRECT(\"'\"&$B12&\"'!B:B\",TRUE),0)),0,COUNTA(INDIRECT(\"'\"&$B12&\"'!E\"&MATCH(E$3,INDIRECT(\"'\"&$B12&\"'!B:B\",TRUE),0)&\":E\"&MATCH(E$3&\"_slut\",INDIRECT(\"'\"&$B12&\"'!B:B\",TRUE),0),TRUE))-E12-E13-E14-E15)","v":3},{"$f":"IF(E17=0,0,E17/E$61-F12-F13-F14-F15)","v":9.6774193548387094E-2},{"$f":"IF(E17=0,0,1-G12-G13-G14-G15)","v":1},{"$f":"IF(ISERROR(MATCH(H$3,INDIRECT(\"'\"&$B12&\"'!B:B\",TRUE),0)),0,COUNTA(INDIRECT(\"'\"&$B12&\"'!E\"&MATCH(H$3,INDIRECT(\"'\"&$B12&\"'!B:B\",TRUE),0)&\":E\"&MATCH(H$3&\"_slut\",INDIRECT(\"'\"&$B12&\"'!B:B\",TRUE),0),TRUE))-H12-H13-H14-H15)","v":2},{"$f":"IF(H17=0,0,H17/H$61-I12-I13-I14-I15)","v":5.5555555555555552E-2},{"$f":"IF(H17=0,0,1-J12-J13-J14-J15)","v":1},{"$f":"IF(ISERROR(MATCH(K$3,INDIRECT(\"'\"&$B12&\"'!B:B\",TRUE),0)),0,COUNTA(INDIRECT(\"'\"&$B12&\"'!E\"&MATCH(K$3,INDIRECT(\"'\"&$B12&\"'!B:B\",TRUE),0)&\":E\"&MATCH(K$3&\"_slut\",INDIRECT(\"'\"&$B12&\"'!B:B\",TRUE),0),TRUE))-K12-K13-K14-K15)","v":3},{"$f":"IF(K17=0,0,K17/K$61-L12-L13-L14-L15)","v":0.1111111111111111},{"$f":"IF(K17=0,0,1-M12-M13-M14-M15)","v":1},{"$f":"IF(ISERROR(MATCH(N$3,INDIRECT(\"'\"&$B12&\"'!B:B\",TRUE),0)),0,COUNTA(INDIRECT(\"'\"&$B12&\"'!E\"&MATCH(N$3,INDIRECT(\"'\"&$B12&\"'!B:B\",TRUE),0)&\":E\"&MATCH(N$3&\"_slut\",INDIRECT(\"'\"&$B12&\"'!B:B\",TRUE),0),TRUE))-N12-N13-N14-N15)","v":2},{"$f":"IF(N17=0,0,N17/N$61-O12-O13-O14-O15)","v":0.125},{"$f":"IF(N17=0,0,1-P12-P13-P14-P15)","v":1}]
[null,null,{"$f":"B12","v":"Risikohåndtering"},"TOTAL",{"$f":"SUM(E12:E16)","v":3},{"$f":"SUM(F12:F15)","v":0},{"$f":"SUM(G12:G15)","v":0},{"$f":"SUM(H12:H16)","v":2},{"$f":"SUM(I12:I15)","v":0},0,{"$f":"SUM(K12:K16)","v":3},{"$f":"SUM(L12:L15)","v":0},0,{"$f":"SUM(N12:N16)","v":2},{"$f":"SUM(O12:O15)","v":0},0]
[null,"ISMS",{"$f":"B18","v":"ISMS"},"Ja",{"$f":"IFERROR(COUNTIF(INDIRECT(\"'\"&$B18&\"'!\"&CHAR(MATCH($D18,INDIRECT(\"'\"&$B18&\"'!6:6\",TRUE),0)+64)&MATCH(E$3,INDIRECT(\"'\"&$B18&\"'!B:B\",TRUE),0)&\":\"&CHAR(MATCH($D18,INDIRECT(\"'\"&$B18&\"'!6:6\",TRUE),0)+64)&MATCH(E$3&\"_slut\",INDIRECT(\"'\"&$B18&\"'!B:B\",TRUE),0),TRUE),\"X\"),0)","v":0},{"$f":"IF(E23=0,0,COUNTIF(INDIRECT(\"'\"&$B18&\"'!\"&CHAR(MATCH($D18,INDIRECT(\"'\"&$B18&\"'!6:6\",TRUE),0)+64)&MATCH(E$3,INDIRECT(\"'\"&$B18&\"'!B:B\",TRUE),0)&\":\"&CHAR(MATCH($D18,INDIRECT(\"'\"&$B18&\"'!6:6\",TRUE),0)+64)&MATCH(E$3&\"_slut\",INDIRECT(\"'\"&$B18&\"'!B:B\",TRUE),0),TRUE),\"X\")/E$61)","v":0},{"$f":"IF(E23=0,0,COUNTIF(INDIRECT(\"'\"&$B18&\"'!\"&CHAR(MATCH($D18,INDIRECT(\"'\"&$B18&\"'!6:6\",TRUE),0)+64)&MATCH(E$3,INDIRECT(\"'\"&$B18&\"'!B:B\",TRUE),0)&\":\"&CHAR(MATCH($D18,INDIRECT(\"'\"&$B18&\"'!6:6\",TRUE),0)+64)&MATCH(E$3&\"_slut\",INDIRECT(\"'\"&$B18&\"'!B:B\",TRUE),0),TRUE),\"X\")/SUM(E18:E22))","v":0},{"$f":"IFERROR(COUNTIF(INDIRECT(\"'\"&$B18&\"'!\"&CHAR(MATCH($D18,INDIRECT(\"'\"&$B18&\"'!6:6\",TRUE),0)+64)&MATCH(H$3,INDIRECT(\"'\"&$B18&\"'!B:B\",TRUE),0)&\":\"&CHAR(MATCH($D18,INDIRECT(\"'\"&$B18&\"'!6:6\",TRUE),0)+64)&MATCH(H$3&\"_slut\",INDIRECT(\"'\"&$B18&\"'!B:B\",TRUE),0),TRUE),\"X\"),0)","v":0},{"$f":"IF(H23=0,0,COUNTIF(INDIRECT(\"'\"&$B18&\"'!\"&CHAR(MATCH($D18,INDIRECT(\"'\"&$B18&\"'!6:6\",TRUE),0)+64)&MATCH(H$3,INDIRECT(\"'\"&$B18&\"'!B:B\",TRUE),0)&\":\"&CHAR(MATCH($D18,INDIRECT(\"'\"&$B18&\"'!6:6\",TRUE),0)+64)&MATCH(H$3&\"_slut\",INDIRECT(\"'\"&$B18&\"'!B:B\",TRUE),0),TRUE),\"X\")/H$61)","v":0},{"$f":"IF(H23=0,0,COUNTIF(INDIRECT(\"'\"&$B18&\"'!\"&CHAR(MATCH($D18,INDIRECT(\"'\"&$B18&\"'!6:6\",TRUE),0)+64)&MATCH(H$3,INDIRECT(\"'\"&$B18&\"'!B:B\",TRUE),0)&\":\"&CHAR(MATCH($D18,INDIRECT(\"'\"&$B18&\"'!6:6\",TRUE),0)+64)&MATCH(H$3&\"_slut\",INDIRECT(\"'\"&$B18&\"'!B:B\",TRUE),0),TRUE),\"X\")/SUM(H18:H22))","v":0},{"$f":"IFERROR(COUNTIF(INDIRECT(\"'\"&$B18&\"'!\"&CHAR(MATCH($D18,INDIRECT(\"'\"&$B18&\"'!6:6\",TRUE),0)+64)&MATCH(K$3,INDIRECT(\"'\"&$B18&\"'!B:B\",TRUE),0)&\":\"&CHAR(MATCH($D18,INDIRECT(\"'\"&$B18&\"'!6:6\",TRUE),0)+64)&MATCH(K$3&\"_slut\",INDIRECT(\"'\"&$B18&\"'!B:B\",TRUE),0),TRUE),\"X\"),0)","v":0},{"$f":"IF(K23=0,0,COUNTIF(INDIRECT(\"'\"&$B18&\"'!\"&CHAR(MATCH($D18,INDIRECT(\"'\"&$B18&\"'!6:6\",TRUE),0)+64)&MATCH(K$3,INDIRECT(\"'\"&$B18&\"'!B:B\",TRUE),0)&\":\"&CHAR(MATCH($D18,INDIRECT(\"'\"&$B18&\"'!6:6\",TRUE),0)+64)&MATCH(K$3&\"_slut\",INDIRECT(\"'\"&$B18&\"'!B:B\",TRUE),0),TRUE),\"X\")/K$61)","v":0},{"$f":"IF(K23=0,0,COUNTIF(INDIRECT(\"'\"&$B18&\"'!\"&CHAR(MATCH($D18,INDIRECT(\"'\"&$B18&\"'!6:6\",TRUE),0)+64)&MATCH(K$3,INDIRECT(\"'\"&$B18&\"'!B:B\",TRUE),0)&\":\"&CHAR(MATCH($D18,INDIRECT(\"'\"&$B18&\"'!6:6\",TRUE),0)+64)&MATCH(K$3&\"_slut\",INDIRECT(\"'\"&$B18&\"'!B:B\",TRUE),0),TRUE),\"X\")/SUM(K18:K22))","v":0},{"$f":"IFERROR(COUNTIF(INDIRECT(\"'\"&$B18&\"'!\"&CHAR(MATCH($D18,INDIRECT(\"'\"&$B18&\"'!6:6\",TRUE),0)+64)&MATCH(N$3,INDIRECT(\"'\"&$B18&\"'!B:B\",TRUE),0)&\":\"&CHAR(MATCH($D18,INDIRECT(\"'\"&$B18&\"'!6:6\",TRUE),0)+64)&MATCH(N$3&\"_slut\",INDIRECT(\"'\"&$B18&\"'!B:B\",TRUE),0),TRUE),\"X\"),0)","v":0},{"$f":"IF(N23=0,0,COUNTIF(INDIRECT(\"'\"&$B18&\"'!\"&CHAR(MATCH($D18,INDIRECT(\"'\"&$B18&\"'!6:6\",TRUE),0)+64)&MATCH(N$3,INDIRECT(\"'\"&$B18&\"'!B:B\",TRUE),0)&\":\"&CHAR(MATCH($D18,INDIRECT(\"'\"&$B18&\"'!6:6\",TRUE),0)+64)&MATCH(N$3&\"_slut\",INDIRECT(\"'\"&$B18&\"'!B:B\",TRUE),0),TRUE),\"X\")/N$61)","v":0},{"$f":"IF(N23=0,0,COUNTIF(INDIRECT(\"'\"&$B18&\"'!\"&CHAR(MATCH($D18,INDIRECT(\"'\"&$B18&\"'!6:6\",TRUE),0)+64)&MATCH(N$3,INDIRECT(\"'\"&$B18&\"'!B:B\",TRUE),0)&\":\"&CHAR(MATCH($D18,INDIRECT(\"'\"&$B18&\"'!6:6\",TRUE),0)+64)&MATCH(N$3&\"_slut\",INDIRECT(\"'\"&$B18&\"'!B:B\",TRUE),0),TRUE),\"X\")/SUM(N18:N22))","v":0}]
[null,null,{"$f":"B18","v":"ISMS"},"Delvist",{"$f":"IFERROR(COUNTIF(INDIRECT(\"'\"&$B18&\"'!\"&CHAR(MATCH($D19,INDIRECT(\"'\"&$B18&\"'!6:6\",TRUE),0)+64)&MATCH(E$3,INDIRECT(\"'\"&$B18&\"'!B:B\",TRUE),0)&\":\"&CHAR(MATCH($D19,INDIRECT(\"'\"&$B18&\"'!6:6\",TRUE),0)+64)&MATCH(E$3&\"_slut\",INDIRECT(\"'\"&$B18&\"'!B:B\",TRUE),0),TRUE),\"X\"),0)","v":0},{"$f":"IF(E23=0,0,COUNTIF(INDIRECT(\"'\"&$B18&\"'!\"&CHAR(MATCH($D19,INDIRECT(\"'\"&$B18&\"'!6:6\",TRUE),0)+64)&MATCH(E$3,INDIRECT(\"'\"&$B18&\"'!B:B\",TRUE),0)&\":\"&CHAR(MATCH($D19,INDIRECT(\"'\"&$B18&\"'!6:6\",TRUE),0)+64)&MATCH(E$3&\"_slut\",INDIRECT(\"'\"&$B18&\"'!B:B\",TRUE),0),TRUE),\"X\")/E$61)","v":0},{"$f":"IF(E23=0,0,COUNTIF(INDIRECT(\"'\"&$B18&\"'!\"&CHAR(MATCH($D19,INDIRECT(\"'\"&$B18&\"'!6:6\",TRUE),0)+64)&MATCH(E$3,INDIRECT(\"'\"&$B18&\"'!B:B\",TRUE),0)&\":\"&CHAR(MATCH($D19,INDIRECT(\"'\"&$B18&\"'!6:6\",TRUE),0)+64)&MATCH(E$3&\"_slut\",INDIRECT(\"'\"&$B18&\"'!B:B\",TRUE),0),TRUE),\"X\")/SUM(E18:E22))","v":0},{"$f":"IFERROR(COUNTIF(INDIRECT(\"'\"&$B18&\"'!\"&CHAR(MATCH($D19,INDIRECT(\"'\"&$B18&\"'!6:6\",TRUE),0)+64)&MATCH(H$3,INDIRECT(\"'\"&$B18&\"'!B:B\",TRUE),0)&\":\"&CHAR(MATCH($D19,INDIRECT(\"'\"&$B18&\"'!6:6\",TRUE),0)+64)&MATCH(H$3&\"_slut\",INDIRECT(\"'\"&$B18&\"'!B:B\",TRUE),0),TRUE),\"X\"),0)","v":0},{"$f":"IF(H23=0,0,COUNTIF(INDIRECT(\"'\"&$B18&\"'!\"&CHAR(MATCH($D19,INDIRECT(\"'\"&$B18&\"'!6:6\",TRUE),0)+64)&MATCH(H$3,INDIRECT(\"'\"&$B18&\"'!B:B\",TRUE),0)&\":\"&CHAR(MATCH($D19,INDIRECT(\"'\"&$B18&\"'!6:6\",TRUE),0)+64)&MATCH(H$3&\"_slut\",INDIRECT(\"'\"&$B18&\"'!B:B\",TRUE),0),TRUE),\"X\")/H$61)","v":0},{"$f":"IF(H23=0,0,COUNTIF(INDIRECT(\"'\"&$B18&\"'!\"&CHAR(MATCH($D19,INDIRECT(\"'\"&$B18&\"'!6:6\",TRUE),0)+64)&MATCH(H$3,INDIRECT(\"'\"&$B18&\"'!B:B\",TRUE),0)&\":\"&CHAR(MATCH($D19,INDIRECT(\"'\"&$B18&\"'!6:6\",TRUE),0)+64)&MATCH(H$3&\"_slut\",INDIRECT(\"'\"&$B18&\"'!B:B\",TRUE),0),TRUE),\"X\")/SUM(H18:H22))","v":0},{"$f":"IFERROR(COUNTIF(INDIRECT(\"'\"&$B18&\"'!\"&CHAR(MATCH($D19,INDIRECT(\"'\"&$B18&\"'!6:6\",TRUE),0)+64)&MATCH(K$3,INDIRECT(\"'\"&$B18&\"'!B:B\",TRUE),0)&\":\"&CHAR(MATCH($D19,INDIRECT(\"'\"&$B18&\"'!6:6\",TRUE),0)+64)&MATCH(K$3&\"_slut\",INDIRECT(\"'\"&$B18&\"'!B:B\",TRUE),0),TRUE),\"X\"),0)","v":0},{"$f":"IF(K23=0,0,COUNTIF(INDIRECT(\"'\"&$B18&\"'!\"&CHAR(MATCH($D19,INDIRECT(\"'\"&$B18&\"'!6:6\",TRUE),0)+64)&MATCH(K$3,INDIRECT(\"'\"&$B18&\"'!B:B\",TRUE),0)&\":\"&CHAR(MATCH($D19,INDIRECT(\"'\"&$B18&\"'!6:6\",TRUE),0)+64)&MATCH(K$3&\"_slut\",INDIRECT(\"'\"&$B18&\"'!B:B\",TRUE),0),TRUE),\"X\")/K$61)","v":0},{"$f":"IF(K23=0,0,COUNTIF(INDIRECT(\"'\"&$B18&\"'!\"&CHAR(MATCH($D19,INDIRECT(\"'\"&$B18&\"'!6:6\",TRUE),0)+64)&MATCH(K$3,INDIRECT(\"'\"&$B18&\"'!B:B\",TRUE),0)&\":\"&CHAR(MATCH($D19,INDIRECT(\"'\"&$B18&\"'!6:6\",TRUE),0)+64)&MATCH(K$3&\"_slut\",INDIRECT(\"'\"&$B18&\"'!B:B\",TRUE),0),TRUE),\"X\")/SUM(K18:K22))","v":0},{"$f":"IFERROR(COUNTIF(INDIRECT(\"'\"&$B18&\"'!\"&CHAR(MATCH($D19,INDIRECT(\"'\"&$B18&\"'!6:6\",TRUE),0)+64)&MATCH(N$3,INDIRECT(\"'\"&$B18&\"'!B:B\",TRUE),0)&\":\"&CHAR(MATCH($D19,INDIRECT(\"'\"&$B18&\"'!6:6\",TRUE),0)+64)&MATCH(N$3&\"_slut\",INDIRECT(\"'\"&$B18&\"'!B:B\",TRUE),0),TRUE),\"X\"),0)","v":0},{"$f":"IF(N23=0,0,COUNTIF(INDIRECT(\"'\"&$B18&\"'!\"&CHAR(MATCH($D19,INDIRECT(\"'\"&$B18&\"'!6:6\",TRUE),0)+64)&MATCH(N$3,INDIRECT(\"'\"&$B18&\"'!B:B\",TRUE),0)&\":\"&CHAR(MATCH($D19,INDIRECT(\"'\"&$B18&\"'!6:6\",TRUE),0)+64)&MATCH(N$3&\"_slut\",INDIRECT(\"'\"&$B18&\"'!B:B\",TRUE),0),TRUE),\"X\")/N$61)","v":0},{"$f":"IF(N23=0,0,COUNTIF(INDIRECT(\"'\"&$B18&\"'!\"&CHAR(MATCH($D19,INDIRECT(\"'\"&$B18&\"'!6:6\",TRUE),0)+64)&MATCH(N$3,INDIRECT(\"'\"&$B18&\"'!B:B\",TRUE),0)&\":\"&CHAR(MATCH($D19,INDIRECT(\"'\"&$B18&\"'!6:6\",TRUE),0)+64)&MATCH(N$3&\"_slut\",INDIRECT(\"'\"&$B18&\"'!B:B\",TRUE),0),TRUE),\"X\")/SUM(N18:N22))","v":0}]
[null,null,{"$f":"B18","v":"ISMS"},"Nej",{"$f":"IFERROR(COUNTIF(INDIRECT(\"'\"&$B18&\"'!\"&CHAR(MATCH($D20,INDIRECT(\"'\"&$B18&\"'!6:6\",TRUE),0)+64)&MATCH(E$3,INDIRECT(\"'\"&$B18&\"'!B:B\",TRUE),0)&\":\"&CHAR(MATCH($D20,INDIRECT(\"'\"&$B18&\"'!6:6\",TRUE),0)+64)&MATCH(E$3&\"_slut\",INDIRECT(\"'\"&$B18&\"'!B:B\",TRUE),0),TRUE),\"X\"),0)","v":0},{"$f":"IF(E23=0,0,COUNTIF(INDIRECT(\"'\"&$B18&\"'!\"&CHAR(MATCH($D20,INDIRECT(\"'\"&$B18&\"'!6:6\",TRUE),0)+64)&MATCH(E$3,INDIRECT(\"'\"&$B18&\"'!B:B\",TRUE),0)&\":\"&CHAR(MATCH($D20,INDIRECT(\"'\"&$B18&\"'!6:6\",TRUE),0)+64)&MATCH(E$3&\"_slut\",INDIRECT(\"'\"&$B18&\"'!B:B\",TRUE),0),TRUE),\"X\")/E$61)","v":0},{"$f":"IF(E23=0,0,COUNTIF(INDIRECT(\"'\"&$B18&\"'!\"&CHAR(MATCH($D20,INDIRECT(\"'\"&$B18&\"'!6:6\",TRUE),0)+64)&MATCH(E$3,INDIRECT(\"'\"&$B18&\"'!B:B\",TRUE),0)&\":\"&CHAR(MATCH($D20,INDIRECT(\"'\"&$B18&\"'!6:6\",TRUE),0)+64)&MATCH(E$3&\"_slut\",INDIRECT(\"'\"&$B18&\"'!B:B\",TRUE),0),TRUE),\"X\")/SUM(E18:E22))","v":0},{"$f":"IFERROR(COUNTIF(INDIRECT(\"'\"&$B18&\"'!\"&CHAR(MATCH($D20,INDIRECT(\"'\"&$B18&\"'!6:6\",TRUE),0)+64)&MATCH(H$3,INDIRECT(\"'\"&$B18&\"'!B:B\",TRUE),0)&\":\"&CHAR(MATCH($D20,INDIRECT(\"'\"&$B18&\"'!6:6\",TRUE),0)+64)&MATCH(H$3&\"_slut\",INDIRECT(\"'\"&$B18&\"'!B:B\",TRUE),0),TRUE),\"X\"),0)","v":0},{"$f":"IF(H23=0,0,COUNTIF(INDIRECT(\"'\"&$B18&\"'!\"&CHAR(MATCH($D20,INDIRECT(\"'\"&$B18&\"'!6:6\",TRUE),0)+64)&MATCH(H$3,INDIRECT(\"'\"&$B18&\"'!B:B\",TRUE),0)&\":\"&CHAR(MATCH($D20,INDIRECT(\"'\"&$B18&\"'!6:6\",TRUE),0)+64)&MATCH(H$3&\"_slut\",INDIRECT(\"'\"&$B18&\"'!B:B\",TRUE),0),TRUE),\"X\")/H$61)","v":0},{"$f":"IF(H23=0,0,COUNTIF(INDIRECT(\"'\"&$B18&\"'!\"&CHAR(MATCH($D20,INDIRECT(\"'\"&$B18&\"'!6:6\",TRUE),0)+64)&MATCH(H$3,INDIRECT(\"'\"&$B18&\"'!B:B\",TRUE),0)&\":\"&CHAR(MATCH($D20,INDIRECT(\"'\"&$B18&\"'!6:6\",TRUE),0)+64)&MATCH(H$3&\"_slut\",INDIRECT(\"'\"&$B18&\"'!B:B\",TRUE),0),TRUE),\"X\")/SUM(H18:H22))","v":0},{"$f":"IFERROR(COUNTIF(INDIRECT(\"'\"&$B18&\"'!\"&CHAR(MATCH($D20,INDIRECT(\"'\"&$B18&\"'!6:6\",TRUE),0)+64)&MATCH(K$3,INDIRECT(\"'\"&$B18&\"'!B:B\",TRUE),0)&\":\"&CHAR(MATCH($D20,INDIRECT(\"'\"&$B18&\"'!6:6\",TRUE),0)+64)&MATCH(K$3&\"_slut\",INDIRECT(\"'\"&$B18&\"'!B:B\",TRUE),0),TRUE),\"X\"),0)","v":0},{"$f":"IF(K23=0,0,COUNTIF(INDIRECT(\"'\"&$B18&\"'!\"&CHAR(MATCH($D20,INDIRECT(\"'\"&$B18&\"'!6:6\",TRUE),0)+64)&MATCH(K$3,INDIRECT(\"'\"&$B18&\"'!B:B\",TRUE),0)&\":\"&CHAR(MATCH($D20,INDIRECT(\"'\"&$B18&\"'!6:6\",TRUE),0)+64)&MATCH(K$3&\"_slut\",INDIRECT(\"'\"&$B18&\"'!B:B\",TRUE),0),TRUE),\"X\")/K$61)","v":0},{"$f":"IF(K23=0,0,COUNTIF(INDIRECT(\"'\"&$B18&\"'!\"&CHAR(MATCH($D20,INDIRECT(\"'\"&$B18&\"'!6:6\",TRUE),0)+64)&MATCH(K$3,INDIRECT(\"'\"&$B18&\"'!B:B\",TRUE),0)&\":\"&CHAR(MATCH($D20,INDIRECT(\"'\"&$B18&\"'!6:6\",TRUE),0)+64)&MATCH(K$3&\"_slut\",INDIRECT(\"'\"&$B18&\"'!B:B\",TRUE),0),TRUE),\"X\")/SUM(K18:K22))","v":0},{"$f":"IFERROR(COUNTIF(INDIRECT(\"'\"&$B18&\"'!\"&CHAR(MATCH($D20,INDIRECT(\"'\"&$B18&\"'!6:6\",TRUE),0)+64)&MATCH(N$3,INDIRECT(\"'\"&$B18&\"'!B:B\",TRUE),0)&\":\"&CHAR(MATCH($D20,INDIRECT(\"'\"&$B18&\"'!6:6\",TRUE),0)+64)&MATCH(N$3&\"_slut\",INDIRECT(\"'\"&$B18&\"'!B:B\",TRUE),0),TRUE),\"X\"),0)","v":0},{"$f":"IF(N23=0,0,COUNTIF(INDIRECT(\"'\"&$B18&\"'!\"&CHAR(MATCH($D20,INDIRECT(\"'\"&$B18&\"'!6:6\",TRUE),0)+64)&MATCH(N$3,INDIRECT(\"'\"&$B18&\"'!B:B\",TRUE),0)&\":\"&CHAR(MATCH($D20,INDIRECT(\"'\"&$B18&\"'!6:6\",TRUE),0)+64)&MATCH(N$3&\"_slut\",INDIRECT(\"'\"&$B18&\"'!B:B\",TRUE),0),TRUE),\"X\")/N$61)","v":0},{"$f":"IF(N23=0,0,COUNTIF(INDIRECT(\"'\"&$B18&\"'!\"&CHAR(MATCH($D20,INDIRECT(\"'\"&$B18&\"'!6:6\",TRUE),0)+64)&MATCH(N$3,INDIRECT(\"'\"&$B18&\"'!B:B\",TRUE),0)&\":\"&CHAR(MATCH($D20,INDIRECT(\"'\"&$B18&\"'!6:6\",TRUE),0)+64)&MATCH(N$3&\"_slut\",INDIRECT(\"'\"&$B18&\"'!B:B\",TRUE),0),TRUE),\"X\")/SUM(N18:N22))","v":0}]
[null,null,{"$f":"B18","v":"ISMS"},"Ikke relevant",{"$f":"IFERROR(COUNTIF(INDIRECT(\"'\"&$B18&\"'!\"&CHAR(MATCH($D21,INDIRECT(\"'\"&$B18&\"'!6:6\",TRUE),0)+64)&MATCH(E$3,INDIRECT(\"'\"&$B18&\"'!B:B\",TRUE),0)&\":\"&CHAR(MATCH($D21,INDIRECT(\"'\"&$B18&\"'!6:6\",TRUE),0)+64)&MATCH(E$3&\"_slut\",INDIRECT(\"'\"&$B18&\"'!B:B\",TRUE),0),TRUE),\"X\"),0)","v":0},{"$f":"IF(E23=0,0,COUNTIF(INDIRECT(\"'\"&$B18&\"'!\"&CHAR(MATCH($D21,INDIRECT(\"'\"&$B18&\"'!6:6\",TRUE),0)+64)&MATCH(E$3,INDIRECT(\"'\"&$B18&\"'!B:B\",TRUE),0)&\":\"&CHAR(MATCH($D21,INDIRECT(\"'\"&$B18&\"'!6:6\",TRUE),0)+64)&MATCH(E$3&\"_slut\",INDIRECT(\"'\"&$B18&\"'!B:B\",TRUE),0),TRUE),\"X\")/E$61)","v":0},{"$f":"IF(E23=0,0,COUNTIF(INDIRECT(\"'\"&$B18&\"'!\"&CHAR(MATCH($D21,INDIRECT(\"'\"&$B18&\"'!6:6\",TRUE),0)+64)&MATCH(E$3,INDIRECT(\"'\"&$B18&\"'!B:B\",TRUE),0)&\":\"&CHAR(MATCH($D21,INDIRECT(\"'\"&$B18&\"'!6:6\",TRUE),0)+64)&MATCH(E$3&\"_slut\",INDIRECT(\"'\"&$B18&\"'!B:B\",TRUE),0),TRUE),\"X\")/SUM(E18:E22))","v":0},{"$f":"IFERROR(COUNTIF(INDIRECT(\"'\"&$B18&\"'!\"&CHAR(MATCH($D21,INDIRECT(\"'\"&$B18&\"'!6:6\",TRUE),0)+64)&MATCH(H$3,INDIRECT(\"'\"&$B18&\"'!B:B\",TRUE),0)&\":\"&CHAR(MATCH($D21,INDIRECT(\"'\"&$B18&\"'!6:6\",TRUE),0)+64)&MATCH(H$3&\"_slut\",INDIRECT(\"'\"&$B18&\"'!B:B\",TRUE),0),TRUE),\"X\"),0)","v":0},{"$f":"IF(H23=0,0,COUNTIF(INDIRECT(\"'\"&$B18&\"'!\"&CHAR(MATCH($D21,INDIRECT(\"'\"&$B18&\"'!6:6\",TRUE),0)+64)&MATCH(H$3,INDIRECT(\"'\"&$B18&\"'!B:B\",TRUE),0)&\":\"&CHAR(MATCH($D21,INDIRECT(\"'\"&$B18&\"'!6:6\",TRUE),0)+64)&MATCH(H$3&\"_slut\",INDIRECT(\"'\"&$B18&\"'!B:B\",TRUE),0),TRUE),\"X\")/H$61)","v":0},{"$f":"IF(H23=0,0,COUNTIF(INDIRECT(\"'\"&$B18&\"'!\"&CHAR(MATCH($D21,INDIRECT(\"'\"&$B18&\"'!6:6\",TRUE),0)+64)&MATCH(H$3,INDIRECT(\"'\"&$B18&\"'!B:B\",TRUE),0)&\":\"&CHAR(MATCH($D21,INDIRECT(\"'\"&$B18&\"'!6:6\",TRUE),0)+64)&MATCH(H$3&\"_slut\",INDIRECT(\"'\"&$B18&\"'!B:B\",TRUE),0),TRUE),\"X\")/SUM(H18:H22))","v":0},{"$f":"IFERROR(COUNTIF(INDIRECT(\"'\"&$B18&\"'!\"&CHAR(MATCH($D21,INDIRECT(\"'\"&$B18&\"'!6:6\",TRUE),0)+64)&MATCH(K$3,INDIRECT(\"'\"&$B18&\"'!B:B\",TRUE),0)&\":\"&CHAR(MATCH($D21,INDIRECT(\"'\"&$B18&\"'!6:6\",TRUE),0)+64)&MATCH(K$3&\"_slut\",INDIRECT(\"'\"&$B18&\"'!B:B\",TRUE),0),TRUE),\"X\"),0)","v":0},{"$f":"IF(K23=0,0,COUNTIF(INDIRECT(\"'\"&$B18&\"'!\"&CHAR(MATCH($D21,INDIRECT(\"'\"&$B18&\"'!6:6\",TRUE),0)+64)&MATCH(K$3,INDIRECT(\"'\"&$B18&\"'!B:B\",TRUE),0)&\":\"&CHAR(MATCH($D21,INDIRECT(\"'\"&$B18&\"'!6:6\",TRUE),0)+64)&MATCH(K$3&\"_slut\",INDIRECT(\"'\"&$B18&\"'!B:B\",TRUE),0),TRUE),\"X\")/K$61)","v":0},{"$f":"IF(K23=0,0,COUNTIF(INDIRECT(\"'\"&$B18&\"'!\"&CHAR(MATCH($D21,INDIRECT(\"'\"&$B18&\"'!6:6\",TRUE),0)+64)&MATCH(K$3,INDIRECT(\"'\"&$B18&\"'!B:B\",TRUE),0)&\":\"&CHAR(MATCH($D21,INDIRECT(\"'\"&$B18&\"'!6:6\",TRUE),0)+64)&MATCH(K$3&\"_slut\",INDIRECT(\"'\"&$B18&\"'!B:B\",TRUE),0),TRUE),\"X\")/SUM(K18:K22))","v":0},{"$f":"IFERROR(COUNTIF(INDIRECT(\"'\"&$B18&\"'!\"&CHAR(MATCH($D21,INDIRECT(\"'\"&$B18&\"'!6:6\",TRUE),0)+64)&MATCH(N$3,INDIRECT(\"'\"&$B18&\"'!B:B\",TRUE),0)&\":\"&CHAR(MATCH($D21,INDIRECT(\"'\"&$B18&\"'!6:6\",TRUE),0)+64)&MATCH(N$3&\"_slut\",INDIRECT(\"'\"&$B18&\"'!B:B\",TRUE),0),TRUE),\"X\"),0)","v":0},{"$f":"IF(N23=0,0,COUNTIF(INDIRECT(\"'\"&$B18&\"'!\"&CHAR(MATCH($D21,INDIRECT(\"'\"&$B18&\"'!6:6\",TRUE),0)+64)&MATCH(N$3,INDIRECT(\"'\"&$B18&\"'!B:B\",TRUE),0)&\":\"&CHAR(MATCH($D21,INDIRECT(\"'\"&$B18&\"'!6:6\",TRUE),0)+64)&MATCH(N$3&\"_slut\",INDIRECT(\"'\"&$B18&\"'!B:B\",TRUE),0),TRUE),\"X\")/N$61)","v":0},{"$f":"IF(N23=0,0,COUNTIF(INDIRECT(\"'\"&$B18&\"'!\"&CHAR(MATCH($D21,INDIRECT(\"'\"&$B18&\"'!6:6\",TRUE),0)+64)&MATCH(N$3,INDIRECT(\"'\"&$B18&\"'!B:B\",TRUE),0)&\":\"&CHAR(MATCH($D21,INDIRECT(\"'\"&$B18&\"'!6:6\",TRUE),0)+64)&MATCH(N$3&\"_slut\",INDIRECT(\"'\"&$B18&\"'!B:B\",TRUE),0),TRUE),\"X\")/SUM(N18:N22))","v":0}]
[null,null,{"$f":"B18","v":"ISMS"},"Ikke sat",{"$f":"IF(ISERROR(MATCH(E$3,INDIRECT(\"'\"&$B18&\"'!B:B\",TRUE),0)),0,COUNTA(INDIRECT(\"'\"&$B18&\"'!E\"&MATCH(E$3,INDIRECT(\"'\"&$B18&\"'!B:B\",TRUE),0)&\":E\"&MATCH(E$3&\"_slut\",INDIRECT(\"'\"&$B18&\"'!B:B\",TRUE),0),TRUE))-E18-E19-E20-E21)","v":4},{"$f":"IF(E23=0,0,E23/E$61-F18-F19-F20-F21)","v":0.12903225806451613},{"$f":"IF(E23=0,0,1-G18-G19-G20-G21)","v":1},{"$f":"IF(ISERROR(MATCH(H$3,INDIRECT(\"'\"&$B18&\"'!B:B\",TRUE),0)),0,COUNTA(INDIRECT(\"'\"&$B18&\"'!E\"&MATCH(H$3,INDIRECT(\"'\"&$B18&\"'!B:B\",TRUE),0)&\":E\"&MATCH(H$3&\"_slut\",INDIRECT(\"'\"&$B18&\"'!B:B\",TRUE),0),TRUE))-H18-H19-H20-H21)","v":7},{"$f":"IF(H23=0,0,H23/H$61-I18-I19-I20-I21)","v":0.19444444444444445},{"$f":"IF(H23=0,0,1-J18-J19-J20-J21)","v":1},{"$f":"IF(ISERROR(MATCH(K$3,INDIRECT(\"'\"&$B18&\"'!B:B\",TRUE),0)),0,COUNTA(INDIRECT(\"'\"&$B18&\"'!E\"&MATCH(K$3,INDIRECT(\"'\"&$B18&\"'!B:B\",TRUE),0)&\":E\"&MATCH(K$3&\"_slut\",INDIRECT(\"'\"&$B18&\"'!B:B\",TRUE),0),TRUE))-K18-K19-K20-K21)","v":3},{"$f":"IF(K23=0,0,K23/K$61-L18-L19-L20-L21)","v":0.1111111111111111},{"$f":"IF(K23=0,0,1-M18-M19-M20-M21)","v":1},{"$f":"IF(ISERROR(MATCH(N$3,INDIRECT(\"'\"&$B18&\"'!B:B\",TRUE),0)),0,COUNTA(INDIRECT(\"'\"&$B18&\"'!E\"&MATCH(N$3,INDIRECT(\"'\"&$B18&\"'!B:B\",TRUE),0)&\":E\"&MATCH(N$3&\"_slut\",INDIRECT(\"'\"&$B18&\"'!B:B\",TRUE),0),TRUE))-N18-N19-N20-N21)","v":1},{"$f":"IF(N23=0,0,N23/N$61-O18-O19-O20-O21)","v":6.25E-2},{"$f":"IF(N23=0,0,1-P18-P19-P20-P21)","v":1}]
[null,null,{"$f":"B18","v":"ISMS"},"TOTAL",{"$f":"SUM(E18:E22)","v":4},{"$f":"SUM(F18:F21)","v":0},{"$f":"SUM(G18:G21)","v":0},{"$f":"SUM(H18:H22)","v":7},{"$f":"SUM(I18:I21)","v":0},0,{"$f":"SUM(K18:K22)","v":3},{"$f":"SUM(L18:L21)","v":0},0,{"$f":"SUM(N18:N22)","v":1},{"$f":"SUM(O18:O21)","v":0},0]
[null,"Politik",{"$f":"B24","v":"Politik"},"Ja",{"$f":"IFERROR(COUNTIF(INDIRECT(\"'\"&$B24&\"'!\"&CHAR(MATCH($D24,INDIRECT(\"'\"&$B24&\"'!6:6\",TRUE),0)+64)&MATCH(E$3,INDIRECT(\"'\"&$B24&\"'!B:B\",TRUE),0)&\":\"&CHAR(MATCH($D24,INDIRECT(\"'\"&$B24&\"'!6:6\",TRUE),0)+64)&MATCH(E$3&\"_slut\",INDIRECT(\"'\"&$B24&\"'!B:B\",TRUE),0),TRUE),\"X\"),0)","v":0},{"$f":"IF(E29=0,0,COUNTIF(INDIRECT(\"'\"&$B24&\"'!\"&CHAR(MATCH($D24,INDIRECT(\"'\"&$B24&\"'!6:6\",TRUE),0)+64)&MATCH(E$3,INDIRECT(\"'\"&$B24&\"'!B:B\",TRUE),0)&\":\"&CHAR(MATCH($D24,INDIRECT(\"'\"&$B24&\"'!6:6\",TRUE),0)+64)&MATCH(E$3&\"_slut\",INDIRECT(\"'\"&$B24&\"'!B:B\",TRUE),0),TRUE),\"X\")/E$61)","v":0},{"$f":"IF(E29=0,0,COUNTIF(INDIRECT(\"'\"&$B24&\"'!\"&CHAR(MATCH($D24,INDIRECT(\"'\"&$B24&\"'!6:6\",TRUE),0)+64)&MATCH(E$3,INDIRECT(\"'\"&$B24&\"'!B:B\",TRUE),0)&\":\"&CHAR(MATCH($D24,INDIRECT(\"'\"&$B24&\"'!6:6\",TRUE),0)+64)&MATCH(E$3&\"_slut\",INDIRECT(\"'\"&$B24&\"'!B:B\",TRUE),0),TRUE),\"X\")/SUM(E24:E28))","v":0},{"$f":"IFERROR(COUNTIF(INDIRECT(\"'\"&$B24&\"'!\"&CHAR(MATCH($D24,INDIRECT(\"'\"&$B24&\"'!6:6\",TRUE),0)+64)&MATCH(H$3,INDIRECT(\"'\"&$B24&\"'!B:B\",TRUE),0)&\":\"&CHAR(MATCH($D24,INDIRECT(\"'\"&$B24&\"'!6:6\",TRUE),0)+64)&MATCH(H$3&\"_slut\",INDIRECT(\"'\"&$B24&\"'!B:B\",TRUE),0),TRUE),\"X\"),0)","v":0},{"$f":"IF(H29=0,0,COUNTIF(INDIRECT(\"'\"&$B24&\"'!\"&CHAR(MATCH($D24,INDIRECT(\"'\"&$B24&\"'!6:6\",TRUE),0)+64)&MATCH(H$3,INDIRECT(\"'\"&$B24&\"'!B:B\",TRUE),0)&\":\"&CHAR(MATCH($D24,INDIRECT(\"'\"&$B24&\"'!6:6\",TRUE),0)+64)&MATCH(H$3&\"_slut\",INDIRECT(\"'\"&$B24&\"'!B:B\",TRUE),0),TRUE),\"X\")/H$61)","v":0},{"$f":"IF(H29=0,0,COUNTIF(INDIRECT(\"'\"&$B24&\"'!\"&CHAR(MATCH($D24,INDIRECT(\"'\"&$B24&\"'!6:6\",TRUE),0)+64)&MATCH(H$3,INDIRECT(\"'\"&$B24&\"'!B:B\",TRUE),0)&\":\"&CHAR(MATCH($D24,INDIRECT(\"'\"&$B24&\"'!6:6\",TRUE),0)+64)&MATCH(H$3&\"_slut\",INDIRECT(\"'\"&$B24&\"'!B:B\",TRUE),0),TRUE),\"X\")/SUM(H24:H28))","v":0},{"$f":"IFERROR(COUNTIF(INDIRECT(\"'\"&$B24&\"'!\"&CHAR(MATCH($D24,INDIRECT(\"'\"&$B24&\"'!6:6\",TRUE),0)+64)&MATCH(K$3,INDIRECT(\"'\"&$B24&\"'!B:B\",TRUE),0)&\":\"&CHAR(MATCH($D24,INDIRECT(\"'\"&$B24&\"'!6:6\",TRUE),0)+64)&MATCH(K$3&\"_slut\",INDIRECT(\"'\"&$B24&\"'!B:B\",TRUE),0),TRUE),\"X\"),0)","v":0},{"$f":"IF(K29=0,0,COUNTIF(INDIRECT(\"'\"&$B24&\"'!\"&CHAR(MATCH($D24,INDIRECT(\"'\"&$B24&\"'!6:6\",TRUE),0)+64)&MATCH(K$3,INDIRECT(\"'\"&$B24&\"'!B:B\",TRUE),0)&\":\"&CHAR(MATCH($D24,INDIRECT(\"'\"&$B24&\"'!6:6\",TRUE),0)+64)&MATCH(K$3&\"_slut\",INDIRECT(\"'\"&$B24&\"'!B:B\",TRUE),0),TRUE),\"X\")/K$61)","v":0},{"$f":"IF(K29=0,0,COUNTIF(INDIRECT(\"'\"&$B24&\"'!\"&CHAR(MATCH($D24,INDIRECT(\"'\"&$B24&\"'!6:6\",TRUE),0)+64)&MATCH(K$3,INDIRECT(\"'\"&$B24&\"'!B:B\",TRUE),0)&\":\"&CHAR(MATCH($D24,INDIRECT(\"'\"&$B24&\"'!6:6\",TRUE),0)+64)&MATCH(K$3&\"_slut\",INDIRECT(\"'\"&$B24&\"'!B:B\",TRUE),0),TRUE),\"X\")/SUM(K24:K28))","v":0},{"$f":"IFERROR(COUNTIF(INDIRECT(\"'\"&$B24&\"'!\"&CHAR(MATCH($D24,INDIRECT(\"'\"&$B24&\"'!6:6\",TRUE),0)+64)&MATCH(N$3,INDIRECT(\"'\"&$B24&\"'!B:B\",TRUE),0)&\":\"&CHAR(MATCH($D24,INDIRECT(\"'\"&$B24&\"'!6:6\",TRUE),0)+64)&MATCH(N$3&\"_slut\",INDIRECT(\"'\"&$B24&\"'!B:B\",TRUE),0),TRUE),\"X\"),0)","v":0},{"$f":"IF(N29=0,0,COUNTIF(INDIRECT(\"'\"&$B24&\"'!\"&CHAR(MATCH($D24,INDIRECT(\"'\"&$B24&\"'!6:6\",TRUE),0)+64)&MATCH(N$3,INDIRECT(\"'\"&$B24&\"'!B:B\",TRUE),0)&\":\"&CHAR(MATCH($D24,INDIRECT(\"'\"&$B24&\"'!6:6\",TRUE),0)+64)&MATCH(N$3&\"_slut\",INDIRECT(\"'\"&$B24&\"'!B:B\",TRUE),0),TRUE),\"X\")/N$61)","v":0},{"$f":"IF(N29=0,0,COUNTIF(INDIRECT(\"'\"&$B24&\"'!\"&CHAR(MATCH($D24,INDIRECT(\"'\"&$B24&\"'!6:6\",TRUE),0)+64)&MATCH(N$3,INDIRECT(\"'\"&$B24&\"'!B:B\",TRUE),0)&\":\"&CHAR(MATCH($D24,INDIRECT(\"'\"&$B24&\"'!6:6\",TRUE),0)+64)&MATCH(N$3&\"_slut\",INDIRECT(\"'\"&$B24&\"'!B:B\",TRUE),0),TRUE),\"X\")/SUM(N24:N28))","v":0}]
[null,null,{"$f":"B24","v":"Politik"},"Delvist",{"$f":"IFERROR(COUNTIF(INDIRECT(\"'\"&$B24&\"'!\"&CHAR(MATCH($D25,INDIRECT(\"'\"&$B24&\"'!6:6\",TRUE),0)+64)&MATCH(E$3,INDIRECT(\"'\"&$B24&\"'!B:B\",TRUE),0)&\":\"&CHAR(MATCH($D25,INDIRECT(\"'\"&$B24&\"'!6:6\",TRUE),0)+64)&MATCH(E$3&\"_slut\",INDIRECT(\"'\"&$B24&\"'!B:B\",TRUE),0),TRUE),\"X\"),0)","v":0},{"$f":"IF(E29=0,0,COUNTIF(INDIRECT(\"'\"&$B24&\"'!\"&CHAR(MATCH($D25,INDIRECT(\"'\"&$B24&\"'!6:6\",TRUE),0)+64)&MATCH(E$3,INDIRECT(\"'\"&$B24&\"'!B:B\",TRUE),0)&\":\"&CHAR(MATCH($D25,INDIRECT(\"'\"&$B24&\"'!6:6\",TRUE),0)+64)&MATCH(E$3&\"_slut\",INDIRECT(\"'\"&$B24&\"'!B:B\",TRUE),0),TRUE),\"X\")/E$61)","v":0},{"$f":"IF(E29=0,0,COUNTIF(INDIRECT(\"'\"&$B24&\"'!\"&CHAR(MATCH($D25,INDIRECT(\"'\"&$B24&\"'!6:6\",TRUE),0)+64)&MATCH(E$3,INDIRECT(\"'\"&$B24&\"'!B:B\",TRUE),0)&\":\"&CHAR(MATCH($D25,INDIRECT(\"'\"&$B24&\"'!6:6\",TRUE),0)+64)&MATCH(E$3&\"_slut\",INDIRECT(\"'\"&$B24&\"'!B:B\",TRUE),0),TRUE),\"X\")/SUM(E24:E28))","v":0},{"$f":"IFERROR(COUNTIF(INDIRECT(\"'\"&$B24&\"'!\"&CHAR(MATCH($D25,INDIRECT(\"'\"&$B24&\"'!6:6\",TRUE),0)+64)&MATCH(H$3,INDIRECT(\"'\"&$B24&\"'!B:B\",TRUE),0)&\":\"&CHAR(MATCH($D25,INDIRECT(\"'\"&$B24&\"'!6:6\",TRUE),0)+64)&MATCH(H$3&\"_slut\",INDIRECT(\"'\"&$B24&\"'!B:B\",TRUE),0),TRUE),\"X\"),0)","v":0},{"$f":"IF(H29=0,0,COUNTIF(INDIRECT(\"'\"&$B24&\"'!\"&CHAR(MATCH($D25,INDIRECT(\"'\"&$B24&\"'!6:6\",TRUE),0)+64)&MATCH(H$3,INDIRECT(\"'\"&$B24&\"'!B:B\",TRUE),0)&\":\"&CHAR(MATCH($D25,INDIRECT(\"'\"&$B24&\"'!6:6\",TRUE),0)+64)&MATCH(H$3&\"_slut\",INDIRECT(\"'\"&$B24&\"'!B:B\",TRUE),0),TRUE),\"X\")/H$61)","v":0},{"$f":"IF(H29=0,0,COUNTIF(INDIRECT(\"'\"&$B24&\"'!\"&CHAR(MATCH($D25,INDIRECT(\"'\"&$B24&\"'!6:6\",TRUE),0)+64)&MATCH(H$3,INDIRECT(\"'\"&$B24&\"'!B:B\",TRUE),0)&\":\"&CHAR(MATCH($D25,INDIRECT(\"'\"&$B24&\"'!6:6\",TRUE),0)+64)&MATCH(H$3&\"_slut\",INDIRECT(\"'\"&$B24&\"'!B:B\",TRUE),0),TRUE),\"X\")/SUM(H24:H28))","v":0},{"$f":"IFERROR(COUNTIF(INDIRECT(\"'\"&$B24&\"'!\"&CHAR(MATCH($D25,INDIRECT(\"'\"&$B24&\"'!6:6\",TRUE),0)+64)&MATCH(K$3,INDIRECT(\"'\"&$B24&\"'!B:B\",TRUE),0)&\":\"&CHAR(MATCH($D25,INDIRECT(\"'\"&$B24&\"'!6:6\",TRUE),0)+64)&MATCH(K$3&\"_slut\",INDIRECT(\"'\"&$B24&\"'!B:B\",TRUE),0),TRUE),\"X\"),0)","v":0},{"$f":"IF(K29=0,0,COUNTIF(INDIRECT(\"'\"&$B24&\"'!\"&CHAR(MATCH($D25,INDIRECT(\"'\"&$B24&\"'!6:6\",TRUE),0)+64)&MATCH(K$3,INDIRECT(\"'\"&$B24&\"'!B:B\",TRUE),0)&\":\"&CHAR(MATCH($D25,INDIRECT(\"'\"&$B24&\"'!6:6\",TRUE),0)+64)&MATCH(K$3&\"_slut\",INDIRECT(\"'\"&$B24&\"'!B:B\",TRUE),0),TRUE),\"X\")/K$61)","v":0},{"$f":"IF(K29=0,0,COUNTIF(INDIRECT(\"'\"&$B24&\"'!\"&CHAR(MATCH($D25,INDIRECT(\"'\"&$B24&\"'!6:6\",TRUE),0)+64)&MATCH(K$3,INDIRECT(\"'\"&$B24&\"'!B:B\",TRUE),0)&\":\"&CHAR(MATCH($D25,INDIRECT(\"'\"&$B24&\"'!6:6\",TRUE),0)+64)&MATCH(K$3&\"_slut\",INDIRECT(\"'\"&$B24&\"'!B:B\",TRUE),0),TRUE),\"X\")/SUM(K24:K28))","v":0},{"$f":"IFERROR(COUNTIF(INDIRECT(\"'\"&$B24&\"'!\"&CHAR(MATCH($D25,INDIRECT(\"'\"&$B24&\"'!6:6\",TRUE),0)+64)&MATCH(N$3,INDIRECT(\"'\"&$B24&\"'!B:B\",TRUE),0)&\":\"&CHAR(MATCH($D25,INDIRECT(\"'\"&$B24&\"'!6:6\",TRUE),0)+64)&MATCH(N$3&\"_slut\",INDIRECT(\"'\"&$B24&\"'!B:B\",TRUE),0),TRUE),\"X\"),0)","v":0},{"$f":"IF(N29=0,0,COUNTIF(INDIRECT(\"'\"&$B24&\"'!\"&CHAR(MATCH($D25,INDIRECT(\"'\"&$B24&\"'!6:6\",TRUE),0)+64)&MATCH(N$3,INDIRECT(\"'\"&$B24&\"'!B:B\",TRUE),0)&\":\"&CHAR(MATCH($D25,INDIRECT(\"'\"&$B24&\"'!6:6\",TRUE),0)+64)&MATCH(N$3&\"_slut\",INDIRECT(\"'\"&$B24&\"'!B:B\",TRUE),0),TRUE),\"X\")/N$61)","v":0},{"$f":"IF(N29=0,0,COUNTIF(INDIRECT(\"'\"&$B24&\"'!\"&CHAR(MATCH($D25,INDIRECT(\"'\"&$B24&\"'!6:6\",TRUE),0)+64)&MATCH(N$3,INDIRECT(\"'\"&$B24&\"'!B:B\",TRUE),0)&\":\"&CHAR(MATCH($D25,INDIRECT(\"'\"&$B24&\"'!6:6\",TRUE),0)+64)&MATCH(N$3&\"_slut\",INDIRECT(\"'\"&$B24&\"'!B:B\",TRUE),0),TRUE),\"X\")/SUM(N24:N28))","v":0}]
[null,null,{"$f":"B24","v":"Politik"},"Nej",{"$f":"IFERROR(COUNTIF(INDIRECT(\"'\"&$B24&\"'!\"&CHAR(MATCH($D26,INDIRECT(\"'\"&$B24&\"'!6:6\",TRUE),0)+64)&MATCH(E$3,INDIRECT(\"'\"&$B24&\"'!B:B\",TRUE),0)&\":\"&CHAR(MATCH($D26,INDIRECT(\"'\"&$B24&\"'!6:6\",TRUE),0)+64)&MATCH(E$3&\"_slut\",INDIRECT(\"'\"&$B24&\"'!B:B\",TRUE),0),TRUE),\"X\"),0)","v":0},{"$f":"IF(E29=0,0,COUNTIF(INDIRECT(\"'\"&$B24&\"'!\"&CHAR(MATCH($D26,INDIRECT(\"'\"&$B24&\"'!6:6\",TRUE),0)+64)&MATCH(E$3,INDIRECT(\"'\"&$B24&\"'!B:B\",TRUE),0)&\":\"&CHAR(MATCH($D26,INDIRECT(\"'\"&$B24&\"'!6:6\",TRUE),0)+64)&MATCH(E$3&\"_slut\",INDIRECT(\"'\"&$B24&\"'!B:B\",TRUE),0),TRUE),\"X\")/E$61)","v":0},{"$f":"IF(E29=0,0,COUNTIF(INDIRECT(\"'\"&$B24&\"'!\"&CHAR(MATCH($D26,INDIRECT(\"'\"&$B24&\"'!6:6\",TRUE),0)+64)&MATCH(E$3,INDIRECT(\"'\"&$B24&\"'!B:B\",TRUE),0)&\":\"&CHAR(MATCH($D26,INDIRECT(\"'\"&$B24&\"'!6:6\",TRUE),0)+64)&MATCH(E$3&\"_slut\",INDIRECT(\"'\"&$B24&\"'!B:B\",TRUE),0),TRUE),\"X\")/SUM(E24:E28))","v":0},{"$f":"IFERROR(COUNTIF(INDIRECT(\"'\"&$B24&\"'!\"&CHAR(MATCH($D26,INDIRECT(\"'\"&$B24&\"'!6:6\",TRUE),0)+64)&MATCH(H$3,INDIRECT(\"'\"&$B24&\"'!B:B\",TRUE),0)&\":\"&CHAR(MATCH($D26,INDIRECT(\"'\"&$B24&\"'!6:6\",TRUE),0)+64)&MATCH(H$3&\"_slut\",INDIRECT(\"'\"&$B24&\"'!B:B\",TRUE),0),TRUE),\"X\"),0)","v":0},{"$f":"IF(H29=0,0,COUNTIF(INDIRECT(\"'\"&$B24&\"'!\"&CHAR(MATCH($D26,INDIRECT(\"'\"&$B24&\"'!6:6\",TRUE),0)+64)&MATCH(H$3,INDIRECT(\"'\"&$B24&\"'!B:B\",TRUE),0)&\":\"&CHAR(MATCH($D26,INDIRECT(\"'\"&$B24&\"'!6:6\",TRUE),0)+64)&MATCH(H$3&\"_slut\",INDIRECT(\"'\"&$B24&\"'!B:B\",TRUE),0),TRUE),\"X\")/H$61)","v":0},{"$f":"IF(H29=0,0,COUNTIF(INDIRECT(\"'\"&$B24&\"'!\"&CHAR(MATCH($D26,INDIRECT(\"'\"&$B24&\"'!6:6\",TRUE),0)+64)&MATCH(H$3,INDIRECT(\"'\"&$B24&\"'!B:B\",TRUE),0)&\":\"&CHAR(MATCH($D26,INDIRECT(\"'\"&$B24&\"'!6:6\",TRUE),0)+64)&MATCH(H$3&\"_slut\",INDIRECT(\"'\"&$B24&\"'!B:B\",TRUE),0),TRUE),\"X\")/SUM(H24:H28))","v":0},{"$f":"IFERROR(COUNTIF(INDIRECT(\"'\"&$B24&\"'!\"&CHAR(MATCH($D26,INDIRECT(\"'\"&$B24&\"'!6:6\",TRUE),0)+64)&MATCH(K$3,INDIRECT(\"'\"&$B24&\"'!B:B\",TRUE),0)&\":\"&CHAR(MATCH($D26,INDIRECT(\"'\"&$B24&\"'!6:6\",TRUE),0)+64)&MATCH(K$3&\"_slut\",INDIRECT(\"'\"&$B24&\"'!B:B\",TRUE),0),TRUE),\"X\"),0)","v":0},{"$f":"IF(K29=0,0,COUNTIF(INDIRECT(\"'\"&$B24&\"'!\"&CHAR(MATCH($D26,INDIRECT(\"'\"&$B24&\"'!6:6\",TRUE),0)+64)&MATCH(K$3,INDIRECT(\"'\"&$B24&\"'!B:B\",TRUE),0)&\":\"&CHAR(MATCH($D26,INDIRECT(\"'\"&$B24&\"'!6:6\",TRUE),0)+64)&MATCH(K$3&\"_slut\",INDIRECT(\"'\"&$B24&\"'!B:B\",TRUE),0),TRUE),\"X\")/K$61)","v":0},{"$f":"IF(K29=0,0,COUNTIF(INDIRECT(\"'\"&$B24&\"'!\"&CHAR(MATCH($D26,INDIRECT(\"'\"&$B24&\"'!6:6\",TRUE),0)+64)&MATCH(K$3,INDIRECT(\"'\"&$B24&\"'!B:B\",TRUE),0)&\":\"&CHAR(MATCH($D26,INDIRECT(\"'\"&$B24&\"'!6:6\",TRUE),0)+64)&MATCH(K$3&\"_slut\",INDIRECT(\"'\"&$B24&\"'!B:B\",TRUE),0),TRUE),\"X\")/SUM(K24:K28))","v":0},{"$f":"IFERROR(COUNTIF(INDIRECT(\"'\"&$B24&\"'!\"&CHAR(MATCH($D26,INDIRECT(\"'\"&$B24&\"'!6:6\",TRUE),0)+64)&MATCH(N$3,INDIRECT(\"'\"&$B24&\"'!B:B\",TRUE),0)&\":\"&CHAR(MATCH($D26,INDIRECT(\"'\"&$B24&\"'!6:6\",TRUE),0)+64)&MATCH(N$3&\"_slut\",INDIRECT(\"'\"&$B24&\"'!B:B\",TRUE),0),TRUE),\"X\"),0)","v":0},{"$f":"IF(N29=0,0,COUNTIF(INDIRECT(\"'\"&$B24&\"'!\"&CHAR(MATCH($D26,INDIRECT(\"'\"&$B24&\"'!6:6\",TRUE),0)+64)&MATCH(N$3,INDIRECT(\"'\"&$B24&\"'!B:B\",TRUE),0)&\":\"&CHAR(MATCH($D26,INDIRECT(\"'\"&$B24&\"'!6:6\",TRUE),0)+64)&MATCH(N$3&\"_slut\",INDIRECT(\"'\"&$B24&\"'!B:B\",TRUE),0),TRUE),\"X\")/N$61)","v":0},{"$f":"IF(N29=0,0,COUNTIF(INDIRECT(\"'\"&$B24&\"'!\"&CHAR(MATCH($D26,INDIRECT(\"'\"&$B24&\"'!6:6\",TRUE),0)+64)&MATCH(N$3,INDIRECT(\"'\"&$B24&\"'!B:B\",TRUE),0)&\":\"&CHAR(MATCH($D26,INDIRECT(\"'\"&$B24&\"'!6:6\",TRUE),0)+64)&MATCH(N$3&\"_slut\",INDIRECT(\"'\"&$B24&\"'!B:B\",TRUE),0),TRUE),\"X\")/SUM(N24:N28))","v":0}]
[null,null,{"$f":"B24","v":"Politik"},"Ikke relevant",{"$f":"IFERROR(COUNTIF(INDIRECT(\"'\"&$B24&\"'!\"&CHAR(MATCH($D27,INDIRECT(\"'\"&$B24&\"'!6:6\",TRUE),0)+64)&MATCH(E$3,INDIRECT(\"'\"&$B24&\"'!B:B\",TRUE),0)&\":\"&CHAR(MATCH($D27,INDIRECT(\"'\"&$B24&\"'!6:6\",TRUE),0)+64)&MATCH(E$3&\"_slut\",INDIRECT(\"'\"&$B24&\"'!B:B\",TRUE),0),TRUE),\"X\"),0)","v":0},{"$f":"IF(E29=0,0,COUNTIF(INDIRECT(\"'\"&$B24&\"'!\"&CHAR(MATCH($D27,INDIRECT(\"'\"&$B24&\"'!6:6\",TRUE),0)+64)&MATCH(E$3,INDIRECT(\"'\"&$B24&\"'!B:B\",TRUE),0)&\":\"&CHAR(MATCH($D27,INDIRECT(\"'\"&$B24&\"'!6:6\",TRUE),0)+64)&MATCH(E$3&\"_slut\",INDIRECT(\"'\"&$B24&\"'!B:B\",TRUE),0),TRUE),\"X\")/E$61)","v":0},{"$f":"IF(E29=0,0,COUNTIF(INDIRECT(\"'\"&$B24&\"'!\"&CHAR(MATCH($D27,INDIRECT(\"'\"&$B24&\"'!6:6\",TRUE),0)+64)&MATCH(E$3,INDIRECT(\"'\"&$B24&\"'!B:B\",TRUE),0)&\":\"&CHAR(MATCH($D27,INDIRECT(\"'\"&$B24&\"'!6:6\",TRUE),0)+64)&MATCH(E$3&\"_slut\",INDIRECT(\"'\"&$B24&\"'!B:B\",TRUE),0),TRUE),\"X\")/SUM(E24:E28))","v":0},{"$f":"IFERROR(COUNTIF(INDIRECT(\"'\"&$B24&\"'!\"&CHAR(MATCH($D27,INDIRECT(\"'\"&$B24&\"'!6:6\",TRUE),0)+64)&MATCH(H$3,INDIRECT(\"'\"&$B24&\"'!B:B\",TRUE),0)&\":\"&CHAR(MATCH($D27,INDIRECT(\"'\"&$B24&\"'!6:6\",TRUE),0)+64)&MATCH(H$3&\"_slut\",INDIRECT(\"'\"&$B24&\"'!B:B\",TRUE),0),TRUE),\"X\"),0)","v":0},{"$f":"IF(H29=0,0,COUNTIF(INDIRECT(\"'\"&$B24&\"'!\"&CHAR(MATCH($D27,INDIRECT(\"'\"&$B24&\"'!6:6\",TRUE),0)+64)&MATCH(H$3,INDIRECT(\"'\"&$B24&\"'!B:B\",TRUE),0)&\":\"&CHAR(MATCH($D27,INDIRECT(\"'\"&$B24&\"'!6:6\",TRUE),0)+64)&MATCH(H$3&\"_slut\",INDIRECT(\"'\"&$B24&\"'!B:B\",TRUE),0),TRUE),\"X\")/H$61)","v":0},{"$f":"IF(H29=0,0,COUNTIF(INDIRECT(\"'\"&$B24&\"'!\"&CHAR(MATCH($D27,INDIRECT(\"'\"&$B24&\"'!6:6\",TRUE),0)+64)&MATCH(H$3,INDIRECT(\"'\"&$B24&\"'!B:B\",TRUE),0)&\":\"&CHAR(MATCH($D27,INDIRECT(\"'\"&$B24&\"'!6:6\",TRUE),0)+64)&MATCH(H$3&\"_slut\",INDIRECT(\"'\"&$B24&\"'!B:B\",TRUE),0),TRUE),\"X\")/SUM(H24:H28))","v":0},{"$f":"IFERROR(COUNTIF(INDIRECT(\"'\"&$B24&\"'!\"&CHAR(MATCH($D27,INDIRECT(\"'\"&$B24&\"'!6:6\",TRUE),0)+64)&MATCH(K$3,INDIRECT(\"'\"&$B24&\"'!B:B\",TRUE),0)&\":\"&CHAR(MATCH($D27,INDIRECT(\"'\"&$B24&\"'!6:6\",TRUE),0)+64)&MATCH(K$3&\"_slut\",INDIRECT(\"'\"&$B24&\"'!B:B\",TRUE),0),TRUE),\"X\"),0)","v":0},{"$f":"IF(K29=0,0,COUNTIF(INDIRECT(\"'\"&$B24&\"'!\"&CHAR(MATCH($D27,INDIRECT(\"'\"&$B24&\"'!6:6\",TRUE),0)+64)&MATCH(K$3,INDIRECT(\"'\"&$B24&\"'!B:B\",TRUE),0)&\":\"&CHAR(MATCH($D27,INDIRECT(\"'\"&$B24&\"'!6:6\",TRUE),0)+64)&MATCH(K$3&\"_slut\",INDIRECT(\"'\"&$B24&\"'!B:B\",TRUE),0),TRUE),\"X\")/K$61)","v":0},{"$f":"IF(K29=0,0,COUNTIF(INDIRECT(\"'\"&$B24&\"'!\"&CHAR(MATCH($D27,INDIRECT(\"'\"&$B24&\"'!6:6\",TRUE),0)+64)&MATCH(K$3,INDIRECT(\"'\"&$B24&\"'!B:B\",TRUE),0)&\":\"&CHAR(MATCH($D27,INDIRECT(\"'\"&$B24&\"'!6:6\",TRUE),0)+64)&MATCH(K$3&\"_slut\",INDIRECT(\"'\"&$B24&\"'!B:B\",TRUE),0),TRUE),\"X\")/SUM(K24:K28))","v":0},{"$f":"IFERROR(COUNTIF(INDIRECT(\"'\"&$B24&\"'!\"&CHAR(MATCH($D27,INDIRECT(\"'\"&$B24&\"'!6:6\",TRUE),0)+64)&MATCH(N$3,INDIRECT(\"'\"&$B24&\"'!B:B\",TRUE),0)&\":\"&CHAR(MATCH($D27,INDIRECT(\"'\"&$B24&\"'!6:6\",TRUE),0)+64)&MATCH(N$3&\"_slut\",INDIRECT(\"'\"&$B24&\"'!B:B\",TRUE),0),TRUE),\"X\"),0)","v":0},{"$f":"IF(N29=0,0,COUNTIF(INDIRECT(\"'\"&$B24&\"'!\"&CHAR(MATCH($D27,INDIRECT(\"'\"&$B24&\"'!6:6\",TRUE),0)+64)&MATCH(N$3,INDIRECT(\"'\"&$B24&\"'!B:B\",TRUE),0)&\":\"&CHAR(MATCH($D27,INDIRECT(\"'\"&$B24&\"'!6:6\",TRUE),0)+64)&MATCH(N$3&\"_slut\",INDIRECT(\"'\"&$B24&\"'!B:B\",TRUE),0),TRUE),\"X\")/N$61)","v":0},{"$f":"IF(N29=0,0,COUNTIF(INDIRECT(\"'\"&$B24&\"'!\"&CHAR(MATCH($D27,INDIRECT(\"'\"&$B24&\"'!6:6\",TRUE),0)+64)&MATCH(N$3,INDIRECT(\"'\"&$B24&\"'!B:B\",TRUE),0)&\":\"&CHAR(MATCH($D27,INDIRECT(\"'\"&$B24&\"'!6:6\",TRUE),0)+64)&MATCH(N$3&\"_slut\",INDIRECT(\"'\"&$B24&\"'!B:B\",TRUE),0),TRUE),\"X\")/SUM(N24:N28))","v":0}]
[null,null,{"$f":"B24","v":"Politik"},"Ikke sat",{"$f":"IF(ISERROR(MATCH(E$3,INDIRECT(\"'\"&$B24&\"'!B:B\",TRUE),0)),0,COUNTA(INDIRECT(\"'\"&$B24&\"'!E\"&MATCH(E$3,INDIRECT(\"'\"&$B24&\"'!B:B\",TRUE),0)&\":E\"&MATCH(E$3&\"_slut\",INDIRECT(\"'\"&$B24&\"'!B:B\",TRUE),0),TRUE))-E24-E25-E26-E27)","v":3},{"$f":"IF(E29=0,0,E29/E$61-F24-F25-F26-F27)","v":9.6774193548387094E-2},{"$f":"IF(E29=0,0,1-G24-G25-G26-G27)","v":1},{"$f":"IF(ISERROR(MATCH(H$3,INDIRECT(\"'\"&$B24&\"'!B:B\",TRUE),0)),0,COUNTA(INDIRECT(\"'\"&$B24&\"'!E\"&MATCH(H$3,INDIRECT(\"'\"&$B24&\"'!B:B\",TRUE),0)&\":E\"&MATCH(H$3&\"_slut\",INDIRECT(\"'\"&$B24&\"'!B:B\",TRUE),0),TRUE))-H24-H25-H26-H27)","v":3},{"$f":"IF(H29=0,0,H29/H$61-I24-I25-I26-I27)","v":8.3333333333333329E-2},{"$f":"IF(H29=0,0,1-J24-J25-J26-J27)","v":1},{"$f":"IF(ISERROR(MATCH(K$3,INDIRECT(\"'\"&$B24&\"'!B:B\",TRUE),0)),0,COUNTA(INDIRECT(\"'\"&$B24&\"'!E\"&MATCH(K$3,INDIRECT(\"'\"&$B24&\"'!B:B\",TRUE),0)&\":E\"&MATCH(K$3&\"_slut\",INDIRECT(\"'\"&$B24&\"'!B:B\",TRUE),0),TRUE))-K24-K25-K26-K27)","v":2},{"$f":"IF(K29=0,0,K29/K$61-L24-L25-L26-L27)","v":7.407407407407407E-2},{"$f":"IF(K29=0,0,1-M24-M25-M26-M27)","v":1},{"$f":"IF(ISERROR(MATCH(N$3,INDIRECT(\"'\"&$B24&\"'!B:B\",TRUE),0)),0,COUNTA(INDIRECT(\"'\"&$B24&\"'!E\"&MATCH(N$3,INDIRECT(\"'\"&$B24&\"'!B:B\",TRUE),0)&\":E\"&MATCH(N$3&\"_slut\",INDIRECT(\"'\"&$B24&\"'!B:B\",TRUE),0),TRUE))-N24-N25-N26-N27)","v":2},{"$f":"IF(N29=0,0,N29/N$61-O24-O25-O26-O27)","v":0.125},{"$f":"IF(N29=0,0,1-P24-P25-P26-P27)","v":1}]
[null,null,{"$f":"B24","v":"Politik"},"TOTAL",{"$f":"SUM(E24:E28)","v":3},{"$f":"SUM(F24:F27)","v":0},{"$f":"SUM(G24:G27)","v":0},{"$f":"SUM(H24:H28)","v":3},{"$f":"SUM(I24:I27)","v":0},0,{"$f":"SUM(K24:K28)","v":2},{"$f":"SUM(L24:L27)","v":0},0,{"$f":"SUM(N24:N28)","v":2},{"$f":"SUM(O24:O27)","v":0},0]
[null,"Ledelsesforankring",{"$f":"B30","v":"Ledelsesforankring"},"Ja",{"$f":"IFERROR(COUNTIF(INDIRECT(\"'\"&$B30&\"'!\"&CHAR(MATCH($D30,INDIRECT(\"'\"&$B30&\"'!6:6\",TRUE),0)+64)&MATCH(E$3,INDIRECT(\"'\"&$B30&\"'!B:B\",TRUE),0)&\":\"&CHAR(MATCH($D30,INDIRECT(\"'\"&$B30&\"'!6:6\",TRUE),0)+64)&MATCH(E$3&\"_slut\",INDIRECT(\"'\"&$B30&\"'!B:B\",TRUE),0),TRUE),\"X\"),0)","v":0},{"$f":"IF(E35=0,0,COUNTIF(INDIRECT(\"'\"&$B30&\"'!\"&CHAR(MATCH($D30,INDIRECT(\"'\"&$B30&\"'!6:6\",TRUE),0)+64)&MATCH(E$3,INDIRECT(\"'\"&$B30&\"'!B:B\",TRUE),0)&\":\"&CHAR(MATCH($D30,INDIRECT(\"'\"&$B30&\"'!6:6\",TRUE),0)+64)&MATCH(E$3&\"_slut\",INDIRECT(\"'\"&$B30&\"'!B:B\",TRUE),0),TRUE),\"X\")/E$61)","v":0},{"$f":"IF(E35=0,0,COUNTIF(INDIRECT(\"'\"&$B30&\"'!\"&CHAR(MATCH($D30,INDIRECT(\"'\"&$B30&\"'!6:6\",TRUE),0)+64)&MATCH(E$3,INDIRECT(\"'\"&$B30&\"'!B:B\",TRUE),0)&\":\"&CHAR(MATCH($D30,INDIRECT(\"'\"&$B30&\"'!6:6\",TRUE),0)+64)&MATCH(E$3&\"_slut\",INDIRECT(\"'\"&$B30&\"'!B:B\",TRUE),0),TRUE),\"X\")/SUM(E30:E34))","v":0},{"$f":"IFERROR(COUNTIF(INDIRECT(\"'\"&$B30&\"'!\"&CHAR(MATCH($D30,INDIRECT(\"'\"&$B30&\"'!6:6\",TRUE),0)+64)&MATCH(H$3,INDIRECT(\"'\"&$B30&\"'!B:B\",TRUE),0)&\":\"&CHAR(MATCH($D30,INDIRECT(\"'\"&$B30&\"'!6:6\",TRUE),0)+64)&MATCH(H$3&\"_slut\",INDIRECT(\"'\"&$B30&\"'!B:B\",TRUE),0),TRUE),\"X\"),0)","v":0},{"$f":"IF(H35=0,0,COUNTIF(INDIRECT(\"'\"&$B30&\"'!\"&CHAR(MATCH($D30,INDIRECT(\"'\"&$B30&\"'!6:6\",TRUE),0)+64)&MATCH(H$3,INDIRECT(\"'\"&$B30&\"'!B:B\",TRUE),0)&\":\"&CHAR(MATCH($D30,INDIRECT(\"'\"&$B30&\"'!6:6\",TRUE),0)+64)&MATCH(H$3&\"_slut\",INDIRECT(\"'\"&$B30&\"'!B:B\",TRUE),0),TRUE),\"X\")/H$61)","v":0},{"$f":"IF(H35=0,0,COUNTIF(INDIRECT(\"'\"&$B30&\"'!\"&CHAR(MATCH($D30,INDIRECT(\"'\"&$B30&\"'!6:6\",TRUE),0)+64)&MATCH(H$3,INDIRECT(\"'\"&$B30&\"'!B:B\",TRUE),0)&\":\"&CHAR(MATCH($D30,INDIRECT(\"'\"&$B30&\"'!6:6\",TRUE),0)+64)&MATCH(H$3&\"_slut\",INDIRECT(\"'\"&$B30&\"'!B:B\",TRUE),0),TRUE),\"X\")/SUM(H30:H34))","v":0},{"$f":"IFERROR(COUNTIF(INDIRECT(\"'\"&$B30&\"'!\"&CHAR(MATCH($D30,INDIRECT(\"'\"&$B30&\"'!6:6\",TRUE),0)+64)&MATCH(K$3,INDIRECT(\"'\"&$B30&\"'!B:B\",TRUE),0)&\":\"&CHAR(MATCH($D30,INDIRECT(\"'\"&$B30&\"'!6:6\",TRUE),0)+64)&MATCH(K$3&\"_slut\",INDIRECT(\"'\"&$B30&\"'!B:B\",TRUE),0),TRUE),\"X\"),0)","v":0},{"$f":"IF(K35=0,0,COUNTIF(INDIRECT(\"'\"&$B30&\"'!\"&CHAR(MATCH($D30,INDIRECT(\"'\"&$B30&\"'!6:6\",TRUE),0)+64)&MATCH(K$3,INDIRECT(\"'\"&$B30&\"'!B:B\",TRUE),0)&\":\"&CHAR(MATCH($D30,INDIRECT(\"'\"&$B30&\"'!6:6\",TRUE),0)+64)&MATCH(K$3&\"_slut\",INDIRECT(\"'\"&$B30&\"'!B:B\",TRUE),0),TRUE),\"X\")/K$61)","v":0},{"$f":"IF(K35=0,0,COUNTIF(INDIRECT(\"'\"&$B30&\"'!\"&CHAR(MATCH($D30,INDIRECT(\"'\"&$B30&\"'!6:6\",TRUE),0)+64)&MATCH(K$3,INDIRECT(\"'\"&$B30&\"'!B:B\",TRUE),0)&\":\"&CHAR(MATCH($D30,INDIRECT(\"'\"&$B30&\"'!6:6\",TRUE),0)+64)&MATCH(K$3&\"_slut\",INDIRECT(\"'\"&$B30&\"'!B:B\",TRUE),0),TRUE),\"X\")/SUM(K30:K34))","v":0},{"$f":"IFERROR(COUNTIF(INDIRECT(\"'\"&$B30&\"'!\"&CHAR(MATCH($D30,INDIRECT(\"'\"&$B30&\"'!6:6\",TRUE),0)+64)&MATCH(N$3,INDIRECT(\"'\"&$B30&\"'!B:B\",TRUE),0)&\":\"&CHAR(MATCH($D30,INDIRECT(\"'\"&$B30&\"'!6:6\",TRUE),0)+64)&MATCH(N$3&\"_slut\",INDIRECT(\"'\"&$B30&\"'!B:B\",TRUE),0),TRUE),\"X\"),0)","v":0},{"$f":"IF(N35=0,0,COUNTIF(INDIRECT(\"'\"&$B30&\"'!\"&CHAR(MATCH($D30,INDIRECT(\"'\"&$B30&\"'!6:6\",TRUE),0)+64)&MATCH(N$3,INDIRECT(\"'\"&$B30&\"'!B:B\",TRUE),0)&\":\"&CHAR(MATCH($D30,INDIRECT(\"'\"&$B30&\"'!6:6\",TRUE),0)+64)&MATCH(N$3&\"_slut\",INDIRECT(\"'\"&$B30&\"'!B:B\",TRUE),0),TRUE),\"X\")/N$61)","v":0},{"$f":"IF(N35=0,0,COUNTIF(INDIRECT(\"'\"&$B30&\"'!\"&CHAR(MATCH($D30,INDIRECT(\"'\"&$B30&\"'!6:6\",TRUE),0)+64)&MATCH(N$3,INDIRECT(\"'\"&$B30&\"'!B:B\",TRUE),0)&\":\"&CHAR(MATCH($D30,INDIRECT(\"'\"&$B30&\"'!6:6\",TRUE),0)+64)&MATCH(N$3&\"_slut\",INDIRECT(\"'\"&$B30&\"'!B:B\",TRUE),0),TRUE),\"X\")/SUM(N30:N34))","v":0}]
[null,null,{"$f":"B30","v":"Ledelsesforankring"},"Delvist",{"$f":"IFERROR(COUNTIF(INDIRECT(\"'\"&$B30&\"'!\"&CHAR(MATCH($D31,INDIRECT(\"'\"&$B30&\"'!6:6\",TRUE),0)+64)&MATCH(E$3,INDIRECT(\"'\"&$B30&\"'!B:B\",TRUE),0)&\":\"&CHAR(MATCH($D31,INDIRECT(\"'\"&$B30&\"'!6:6\",TRUE),0)+64)&MATCH(E$3&\"_slut\",INDIRECT(\"'\"&$B30&\"'!B:B\",TRUE),0),TRUE),\"X\"),0)","v":0},{"$f":"IF(E35=0,0,COUNTIF(INDIRECT(\"'\"&$B30&\"'!\"&CHAR(MATCH($D31,INDIRECT(\"'\"&$B30&\"'!6:6\",TRUE),0)+64)&MATCH(E$3,INDIRECT(\"'\"&$B30&\"'!B:B\",TRUE),0)&\":\"&CHAR(MATCH($D31,INDIRECT(\"'\"&$B30&\"'!6:6\",TRUE),0)+64)&MATCH(E$3&\"_slut\",INDIRECT(\"'\"&$B30&\"'!B:B\",TRUE),0),TRUE),\"X\")/E$61)","v":0},{"$f":"IF(E35=0,0,COUNTIF(INDIRECT(\"'\"&$B30&\"'!\"&CHAR(MATCH($D31,INDIRECT(\"'\"&$B30&\"'!6:6\",TRUE),0)+64)&MATCH(E$3,INDIRECT(\"'\"&$B30&\"'!B:B\",TRUE),0)&\":\"&CHAR(MATCH($D31,INDIRECT(\"'\"&$B30&\"'!6:6\",TRUE),0)+64)&MATCH(E$3&\"_slut\",INDIRECT(\"'\"&$B30&\"'!B:B\",TRUE),0),TRUE),\"X\")/SUM(E30:E34))","v":0},{"$f":"IFERROR(COUNTIF(INDIRECT(\"'\"&$B30&\"'!\"&CHAR(MATCH($D31,INDIRECT(\"'\"&$B30&\"'!6:6\",TRUE),0)+64)&MATCH(H$3,INDIRECT(\"'\"&$B30&\"'!B:B\",TRUE),0)&\":\"&CHAR(MATCH($D31,INDIRECT(\"'\"&$B30&\"'!6:6\",TRUE),0)+64)&MATCH(H$3&\"_slut\",INDIRECT(\"'\"&$B30&\"'!B:B\",TRUE),0),TRUE),\"X\"),0)","v":0},{"$f":"IF(H35=0,0,COUNTIF(INDIRECT(\"'\"&$B30&\"'!\"&CHAR(MATCH($D31,INDIRECT(\"'\"&$B30&\"'!6:6\",TRUE),0)+64)&MATCH(H$3,INDIRECT(\"'\"&$B30&\"'!B:B\",TRUE),0)&\":\"&CHAR(MATCH($D31,INDIRECT(\"'\"&$B30&\"'!6:6\",TRUE),0)+64)&MATCH(H$3&\"_slut\",INDIRECT(\"'\"&$B30&\"'!B:B\",TRUE),0),TRUE),\"X\")/H$61)","v":0},{"$f":"IF(H35=0,0,COUNTIF(INDIRECT(\"'\"&$B30&\"'!\"&CHAR(MATCH($D31,INDIRECT(\"'\"&$B30&\"'!6:6\",TRUE),0)+64)&MATCH(H$3,INDIRECT(\"'\"&$B30&\"'!B:B\",TRUE),0)&\":\"&CHAR(MATCH($D31,INDIRECT(\"'\"&$B30&\"'!6:6\",TRUE),0)+64)&MATCH(H$3&\"_slut\",INDIRECT(\"'\"&$B30&\"'!B:B\",TRUE),0),TRUE),\"X\")/SUM(H30:H34))","v":0},{"$f":"IFERROR(COUNTIF(INDIRECT(\"'\"&$B30&\"'!\"&CHAR(MATCH($D31,INDIRECT(\"'\"&$B30&\"'!6:6\",TRUE),0)+64)&MATCH(K$3,INDIRECT(\"'\"&$B30&\"'!B:B\",TRUE),0)&\":\"&CHAR(MATCH($D31,INDIRECT(\"'\"&$B30&\"'!6:6\",TRUE),0)+64)&MATCH(K$3&\"_slut\",INDIRECT(\"'\"&$B30&\"'!B:B\",TRUE),0),TRUE),\"X\"),0)","v":0},{"$f":"IF(K35=0,0,COUNTIF(INDIRECT(\"'\"&$B30&\"'!\"&CHAR(MATCH($D31,INDIRECT(\"'\"&$B30&\"'!6:6\",TRUE),0)+64)&MATCH(K$3,INDIRECT(\"'\"&$B30&\"'!B:B\",TRUE),0)&\":\"&CHAR(MATCH($D31,INDIRECT(\"'\"&$B30&\"'!6:6\",TRUE),0)+64)&MATCH(K$3&\"_slut\",INDIRECT(\"'\"&$B30&\"'!B:B\",TRUE),0),TRUE),\"X\")/K$61)","v":0},{"$f":"IF(K35=0,0,COUNTIF(INDIRECT(\"'\"&$B30&\"'!\"&CHAR(MATCH($D31,INDIRECT(\"'\"&$B30&\"'!6:6\",TRUE),0)+64)&MATCH(K$3,INDIRECT(\"'\"&$B30&\"'!B:B\",TRUE),0)&\":\"&CHAR(MATCH($D31,INDIRECT(\"'\"&$B30&\"'!6:6\",TRUE),0)+64)&MATCH(K$3&\"_slut\",INDIRECT(\"'\"&$B30&\"'!B:B\",TRUE),0),TRUE),\"X\")/SUM(K30:K34))","v":0},{"$f":"IFERROR(COUNTIF(INDIRECT(\"'\"&$B30&\"'!\"&CHAR(MATCH($D31,INDIRECT(\"'\"&$B30&\"'!6:6\",TRUE),0)+64)&MATCH(N$3,INDIRECT(\"'\"&$B30&\"'!B:B\",TRUE),0)&\":\"&CHAR(MATCH($D31,INDIRECT(\"'\"&$B30&\"'!6:6\",TRUE),0)+64)&MATCH(N$3&\"_slut\",INDIRECT(\"'\"&$B30&\"'!B:B\",TRUE),0),TRUE),\"X\"),0)","v":0},{"$f":"IF(N35=0,0,COUNTIF(INDIRECT(\"'\"&$B30&\"'!\"&CHAR(MATCH($D31,INDIRECT(\"'\"&$B30&\"'!6:6\",TRUE),0)+64)&MATCH(N$3,INDIRECT(\"'\"&$B30&\"'!B:B\",TRUE),0)&\":\"&CHAR(MATCH($D31,INDIRECT(\"'\"&$B30&\"'!6:6\",TRUE),0)+64)&MATCH(N$3&\"_slut\",INDIRECT(\"'\"&$B30&\"'!B:B\",TRUE),0),TRUE),\"X\")/N$61)","v":0},{"$f":"IF(N35=0,0,COUNTIF(INDIRECT(\"'\"&$B30&\"'!\"&CHAR(MATCH($D31,INDIRECT(\"'\"&$B30&\"'!6:6\",TRUE),0)+64)&MATCH(N$3,INDIRECT(\"'\"&$B30&\"'!B:B\",TRUE),0)&\":\"&CHAR(MATCH($D31,INDIRECT(\"'\"&$B30&\"'!6:6\",TRUE),0)+64)&MATCH(N$3&\"_slut\",INDIRECT(\"'\"&$B30&\"'!B:B\",TRUE),0),TRUE),\"X\")/SUM(N30:N34))","v":0}]
[null,null,{"$f":"B30","v":"Ledelsesforankring"},"Nej",{"$f":"IFERROR(COUNTIF(INDIRECT(\"'\"&$B30&\"'!\"&CHAR(MATCH($D32,INDIRECT(\"'\"&$B30&\"'!6:6\",TRUE),0)+64)&MATCH(E$3,INDIRECT(\"'\"&$B30&\"'!B:B\",TRUE),0)&\":\"&CHAR(MATCH($D32,INDIRECT(\"'\"&$B30&\"'!6:6\",TRUE),0)+64)&MATCH(E$3&\"_slut\",INDIRECT(\"'\"&$B30&\"'!B:B\",TRUE),0),TRUE),\"X\"),0)","v":0},{"$f":"IF(E35=0,0,COUNTIF(INDIRECT(\"'\"&$B30&\"'!\"&CHAR(MATCH($D32,INDIRECT(\"'\"&$B30&\"'!6:6\",TRUE),0)+64)&MATCH(E$3,INDIRECT(\"'\"&$B30&\"'!B:B\",TRUE),0)&\":\"&CHAR(MATCH($D32,INDIRECT(\"'\"&$B30&\"'!6:6\",TRUE),0)+64)&MATCH(E$3&\"_slut\",INDIRECT(\"'\"&$B30&\"'!B:B\",TRUE),0),TRUE),\"X\")/E$61)","v":0},{"$f":"IF(E35=0,0,COUNTIF(INDIRECT(\"'\"&$B30&\"'!\"&CHAR(MATCH($D32,INDIRECT(\"'\"&$B30&\"'!6:6\",TRUE),0)+64)&MATCH(E$3,INDIRECT(\"'\"&$B30&\"'!B:B\",TRUE),0)&\":\"&CHAR(MATCH($D32,INDIRECT(\"'\"&$B30&\"'!6:6\",TRUE),0)+64)&MATCH(E$3&\"_slut\",INDIRECT(\"'\"&$B30&\"'!B:B\",TRUE),0),TRUE),\"X\")/SUM(E30:E34))","v":0},{"$f":"IFERROR(COUNTIF(INDIRECT(\"'\"&$B30&\"'!\"&CHAR(MATCH($D32,INDIRECT(\"'\"&$B30&\"'!6:6\",TRUE),0)+64)&MATCH(H$3,INDIRECT(\"'\"&$B30&\"'!B:B\",TRUE),0)&\":\"&CHAR(MATCH($D32,INDIRECT(\"'\"&$B30&\"'!6:6\",TRUE),0)+64)&MATCH(H$3&\"_slut\",INDIRECT(\"'\"&$B30&\"'!B:B\",TRUE),0),TRUE),\"X\"),0)","v":0},{"$f":"IF(H35=0,0,COUNTIF(INDIRECT(\"'\"&$B30&\"'!\"&CHAR(MATCH($D32,INDIRECT(\"'\"&$B30&\"'!6:6\",TRUE),0)+64)&MATCH(H$3,INDIRECT(\"'\"&$B30&\"'!B:B\",TRUE),0)&\":\"&CHAR(MATCH($D32,INDIRECT(\"'\"&$B30&\"'!6:6\",TRUE),0)+64)&MATCH(H$3&\"_slut\",INDIRECT(\"'\"&$B30&\"'!B:B\",TRUE),0),TRUE),\"X\")/H$61)","v":0},{"$f":"IF(H35=0,0,COUNTIF(INDIRECT(\"'\"&$B30&\"'!\"&CHAR(MATCH($D32,INDIRECT(\"'\"&$B30&\"'!6:6\",TRUE),0)+64)&MATCH(H$3,INDIRECT(\"'\"&$B30&\"'!B:B\",TRUE),0)&\":\"&CHAR(MATCH($D32,INDIRECT(\"'\"&$B30&\"'!6:6\",TRUE),0)+64)&MATCH(H$3&\"_slut\",INDIRECT(\"'\"&$B30&\"'!B:B\",TRUE),0),TRUE),\"X\")/SUM(H30:H34))","v":0},{"$f":"IFERROR(COUNTIF(INDIRECT(\"'\"&$B30&\"'!\"&CHAR(MATCH($D32,INDIRECT(\"'\"&$B30&\"'!6:6\",TRUE),0)+64)&MATCH(K$3,INDIRECT(\"'\"&$B30&\"'!B:B\",TRUE),0)&\":\"&CHAR(MATCH($D32,INDIRECT(\"'\"&$B30&\"'!6:6\",TRUE),0)+64)&MATCH(K$3&\"_slut\",INDIRECT(\"'\"&$B30&\"'!B:B\",TRUE),0),TRUE),\"X\"),0)","v":0},{"$f":"IF(K35=0,0,COUNTIF(INDIRECT(\"'\"&$B30&\"'!\"&CHAR(MATCH($D32,INDIRECT(\"'\"&$B30&\"'!6:6\",TRUE),0)+64)&MATCH(K$3,INDIRECT(\"'\"&$B30&\"'!B:B\",TRUE),0)&\":\"&CHAR(MATCH($D32,INDIRECT(\"'\"&$B30&\"'!6:6\",TRUE),0)+64)&MATCH(K$3&\"_slut\",INDIRECT(\"'\"&$B30&\"'!B:B\",TRUE),0),TRUE),\"X\")/K$61)","v":0},{"$f":"IF(K35=0,0,COUNTIF(INDIRECT(\"'\"&$B30&\"'!\"&CHAR(MATCH($D32,INDIRECT(\"'\"&$B30&\"'!6:6\",TRUE),0)+64)&MATCH(K$3,INDIRECT(\"'\"&$B30&\"'!B:B\",TRUE),0)&\":\"&CHAR(MATCH($D32,INDIRECT(\"'\"&$B30&\"'!6:6\",TRUE),0)+64)&MATCH(K$3&\"_slut\",INDIRECT(\"'\"&$B30&\"'!B:B\",TRUE),0),TRUE),\"X\")/SUM(K30:K34))","v":0},{"$f":"IFERROR(COUNTIF(INDIRECT(\"'\"&$B30&\"'!\"&CHAR(MATCH($D32,INDIRECT(\"'\"&$B30&\"'!6:6\",TRUE),0)+64)&MATCH(N$3,INDIRECT(\"'\"&$B30&\"'!B:B\",TRUE),0)&\":\"&CHAR(MATCH($D32,INDIRECT(\"'\"&$B30&\"'!6:6\",TRUE),0)+64)&MATCH(N$3&\"_slut\",INDIRECT(\"'\"&$B30&\"'!B:B\",TRUE),0),TRUE),\"X\"),0)","v":0},{"$f":"IF(N35=0,0,COUNTIF(INDIRECT(\"'\"&$B30&\"'!\"&CHAR(MATCH($D32,INDIRECT(\"'\"&$B30&\"'!6:6\",TRUE),0)+64)&MATCH(N$3,INDIRECT(\"'\"&$B30&\"'!B:B\",TRUE),0)&\":\"&CHAR(MATCH($D32,INDIRECT(\"'\"&$B30&\"'!6:6\",TRUE),0)+64)&MATCH(N$3&\"_slut\",INDIRECT(\"'\"&$B30&\"'!B:B\",TRUE),0),TRUE),\"X\")/N$61)","v":0},{"$f":"IF(N35=0,0,COUNTIF(INDIRECT(\"'\"&$B30&\"'!\"&CHAR(MATCH($D32,INDIRECT(\"'\"&$B30&\"'!6:6\",TRUE),0)+64)&MATCH(N$3,INDIRECT(\"'\"&$B30&\"'!B:B\",TRUE),0)&\":\"&CHAR(MATCH($D32,INDIRECT(\"'\"&$B30&\"'!6:6\",TRUE),0)+64)&MATCH(N$3&\"_slut\",INDIRECT(\"'\"&$B30&\"'!B:B\",TRUE),0),TRUE),\"X\")/SUM(N30:N34))","v":0}]
[null,null,{"$f":"B30","v":"Ledelsesforankring"},"Ikke relevant",{"$f":"IFERROR(COUNTIF(INDIRECT(\"'\"&$B30&\"'!\"&CHAR(MATCH($D33,INDIRECT(\"'\"&$B30&\"'!6:6\",TRUE),0)+64)&MATCH(E$3,INDIRECT(\"'\"&$B30&\"'!B:B\",TRUE),0)&\":\"&CHAR(MATCH($D33,INDIRECT(\"'\"&$B30&\"'!6:6\",TRUE),0)+64)&MATCH(E$3&\"_slut\",INDIRECT(\"'\"&$B30&\"'!B:B\",TRUE),0),TRUE),\"X\"),0)","v":0},{"$f":"IF(E35=0,0,COUNTIF(INDIRECT(\"'\"&$B30&\"'!\"&CHAR(MATCH($D33,INDIRECT(\"'\"&$B30&\"'!6:6\",TRUE),0)+64)&MATCH(E$3,INDIRECT(\"'\"&$B30&\"'!B:B\",TRUE),0)&\":\"&CHAR(MATCH($D33,INDIRECT(\"'\"&$B30&\"'!6:6\",TRUE),0)+64)&MATCH(E$3&\"_slut\",INDIRECT(\"'\"&$B30&\"'!B:B\",TRUE),0),TRUE),\"X\")/E$61)","v":0},{"$f":"IF(E35=0,0,COUNTIF(INDIRECT(\"'\"&$B30&\"'!\"&CHAR(MATCH($D33,INDIRECT(\"'\"&$B30&\"'!6:6\",TRUE),0)+64)&MATCH(E$3,INDIRECT(\"'\"&$B30&\"'!B:B\",TRUE),0)&\":\"&CHAR(MATCH($D33,INDIRECT(\"'\"&$B30&\"'!6:6\",TRUE),0)+64)&MATCH(E$3&\"_slut\",INDIRECT(\"'\"&$B30&\"'!B:B\",TRUE),0),TRUE),\"X\")/SUM(E30:E34))","v":0},{"$f":"IFERROR(COUNTIF(INDIRECT(\"'\"&$B30&\"'!\"&CHAR(MATCH($D33,INDIRECT(\"'\"&$B30&\"'!6:6\",TRUE),0)+64)&MATCH(H$3,INDIRECT(\"'\"&$B30&\"'!B:B\",TRUE),0)&\":\"&CHAR(MATCH($D33,INDIRECT(\"'\"&$B30&\"'!6:6\",TRUE),0)+64)&MATCH(H$3&\"_slut\",INDIRECT(\"'\"&$B30&\"'!B:B\",TRUE),0),TRUE),\"X\"),0)","v":0},{"$f":"IF(H35=0,0,COUNTIF(INDIRECT(\"'\"&$B30&\"'!\"&CHAR(MATCH($D33,INDIRECT(\"'\"&$B30&\"'!6:6\",TRUE),0)+64)&MATCH(H$3,INDIRECT(\"'\"&$B30&\"'!B:B\",TRUE),0)&\":\"&CHAR(MATCH($D33,INDIRECT(\"'\"&$B30&\"'!6:6\",TRUE),0)+64)&MATCH(H$3&\"_slut\",INDIRECT(\"'\"&$B30&\"'!B:B\",TRUE),0),TRUE),\"X\")/H$61)","v":0},{"$f":"IF(H35=0,0,COUNTIF(INDIRECT(\"'\"&$B30&\"'!\"&CHAR(MATCH($D33,INDIRECT(\"'\"&$B30&\"'!6:6\",TRUE),0)+64)&MATCH(H$3,INDIRECT(\"'\"&$B30&\"'!B:B\",TRUE),0)&\":\"&CHAR(MATCH($D33,INDIRECT(\"'\"&$B30&\"'!6:6\",TRUE),0)+64)&MATCH(H$3&\"_slut\",INDIRECT(\"'\"&$B30&\"'!B:B\",TRUE),0),TRUE),\"X\")/SUM(H30:H34))","v":0},{"$f":"IFERROR(COUNTIF(INDIRECT(\"'\"&$B30&\"'!\"&CHAR(MATCH($D33,INDIRECT(\"'\"&$B30&\"'!6:6\",TRUE),0)+64)&MATCH(K$3,INDIRECT(\"'\"&$B30&\"'!B:B\",TRUE),0)&\":\"&CHAR(MATCH($D33,INDIRECT(\"'\"&$B30&\"'!6:6\",TRUE),0)+64)&MATCH(K$3&\"_slut\",INDIRECT(\"'\"&$B30&\"'!B:B\",TRUE),0),TRUE),\"X\"),0)","v":0},{"$f":"IF(K35=0,0,COUNTIF(INDIRECT(\"'\"&$B30&\"'!\"&CHAR(MATCH($D33,INDIRECT(\"'\"&$B30&\"'!6:6\",TRUE),0)+64)&MATCH(K$3,INDIRECT(\"'\"&$B30&\"'!B:B\",TRUE),0)&\":\"&CHAR(MATCH($D33,INDIRECT(\"'\"&$B30&\"'!6:6\",TRUE),0)+64)&MATCH(K$3&\"_slut\",INDIRECT(\"'\"&$B30&\"'!B:B\",TRUE),0),TRUE),\"X\")/K$61)","v":0},{"$f":"IF(K35=0,0,COUNTIF(INDIRECT(\"'\"&$B30&\"'!\"&CHAR(MATCH($D33,INDIRECT(\"'\"&$B30&\"'!6:6\",TRUE),0)+64)&MATCH(K$3,INDIRECT(\"'\"&$B30&\"'!B:B\",TRUE),0)&\":\"&CHAR(MATCH($D33,INDIRECT(\"'\"&$B30&\"'!6:6\",TRUE),0)+64)&MATCH(K$3&\"_slut\",INDIRECT(\"'\"&$B30&\"'!B:B\",TRUE),0),TRUE),\"X\")/SUM(K30:K34))","v":0},{"$f":"IFERROR(COUNTIF(INDIRECT(\"'\"&$B30&\"'!\"&CHAR(MATCH($D33,INDIRECT(\"'\"&$B30&\"'!6:6\",TRUE),0)+64)&MATCH(N$3,INDIRECT(\"'\"&$B30&\"'!B:B\",TRUE),0)&\":\"&CHAR(MATCH($D33,INDIRECT(\"'\"&$B30&\"'!6:6\",TRUE),0)+64)&MATCH(N$3&\"_slut\",INDIRECT(\"'\"&$B30&\"'!B:B\",TRUE),0),TRUE),\"X\"),0)","v":0},{"$f":"IF(N35=0,0,COUNTIF(INDIRECT(\"'\"&$B30&\"'!\"&CHAR(MATCH($D33,INDIRECT(\"'\"&$B30&\"'!6:6\",TRUE),0)+64)&MATCH(N$3,INDIRECT(\"'\"&$B30&\"'!B:B\",TRUE),0)&\":\"&CHAR(MATCH($D33,INDIRECT(\"'\"&$B30&\"'!6:6\",TRUE),0)+64)&MATCH(N$3&\"_slut\",INDIRECT(\"'\"&$B30&\"'!B:B\",TRUE),0),TRUE),\"X\")/N$61)","v":0},{"$f":"IF(N35=0,0,COUNTIF(INDIRECT(\"'\"&$B30&\"'!\"&CHAR(MATCH($D33,INDIRECT(\"'\"&$B30&\"'!6:6\",TRUE),0)+64)&MATCH(N$3,INDIRECT(\"'\"&$B30&\"'!B:B\",TRUE),0)&\":\"&CHAR(MATCH($D33,INDIRECT(\"'\"&$B30&\"'!6:6\",TRUE),0)+64)&MATCH(N$3&\"_slut\",INDIRECT(\"'\"&$B30&\"'!B:B\",TRUE),0),TRUE),\"X\")/SUM(N30:N34))","v":0}]
[null,null,{"$f":"B30","v":"Ledelsesforankring"},"Ikke sat",{"$f":"IF(ISERROR(MATCH(E$3,INDIRECT(\"'\"&$B30&\"'!B:B\",TRUE),0)),0,COUNTA(INDIRECT(\"'\"&$B30&\"'!E\"&MATCH(E$3,INDIRECT(\"'\"&$B30&\"'!B:B\",TRUE),0)&\":E\"&MATCH(E$3&\"_slut\",INDIRECT(\"'\"&$B30&\"'!B:B\",TRUE),0),TRUE))-E30-E31-E32-E33)","v":0},{"$f":"IF(E35=0,0,E35/E$61-F30-F31-F32-F33)","v":0},{"$f":"IF(E35=0,0,1-G30-G31-G32-G33)","v":0},{"$f":"IF(ISERROR(MATCH(H$3,INDIRECT(\"'\"&$B30&\"'!B:B\",TRUE),0)),0,COUNTA(INDIRECT(\"'\"&$B30&\"'!E\"&MATCH(H$3,INDIRECT(\"'\"&$B30&\"'!B:B\",TRUE),0)&\":E\"&MATCH(H$3&\"_slut\",INDIRECT(\"'\"&$B30&\"'!B:B\",TRUE),0),TRUE))-H30-H31-H32-H33)","v":4},{"$f":"IF(H35=0,0,H35/H$61-I30-I31-I32-I33)","v":0.1111111111111111},{"$f":"IF(H35=0,0,1-J30-J31-J32-J33)","v":1},{"$f":"IF(ISERROR(MATCH(K$3,INDIRECT(\"'\"&$B30&\"'!B:B\",TRUE),0)),0,COUNTA(INDIRECT(\"'\"&$B30&\"'!E\"&MATCH(K$3,INDIRECT(\"'\"&$B30&\"'!B:B\",TRUE),0)&\":E\"&MATCH(K$3&\"_slut\",INDIRECT(\"'\"&$B30&\"'!B:B\",TRUE),0),TRUE))-K30-K31-K32-K33)","v":3},{"$f":"IF(K35=0,0,K35/K$61-L30-L31-L32-L33)","v":0.1111111111111111},{"$f":"IF(K35=0,0,1-M30-M31-M32-M33)","v":1},{"$f":"IF(ISERROR(MATCH(N$3,INDIRECT(\"'\"&$B30&\"'!B:B\",TRUE),0)),0,COUNTA(INDIRECT(\"'\"&$B30&\"'!E\"&MATCH(N$3,INDIRECT(\"'\"&$B30&\"'!B:B\",TRUE),0)&\":E\"&MATCH(N$3&\"_slut\",INDIRECT(\"'\"&$B30&\"'!B:B\",TRUE),0),TRUE))-N30-N31-N32-N33)","v":2},{"$f":"IF(N35=0,0,N35/N$61-O30-O31-O32-O33)","v":0.125},{"$f":"IF(N35=0,0,1-P30-P31-P32-P33)","v":1}]
[null,null,{"$f":"B30","v":"Ledelsesforankring"},"TOTAL",{"$f":"SUM(E30:E34)","v":0},{"$f":"SUM(F30:F33)","v":0},{"$f":"SUM(G30:G33)","v":0},{"$f":"SUM(H30:H34)","v":4},{"$f":"SUM(I30:I33)","v":0},0,{"$f":"SUM(K30:K34)","v":3},{"$f":"SUM(L30:L33)","v":0},0,{"$f":"SUM(N30:N34)","v":2},{"$f":"SUM(O30:O33)","v":0},0]
[null,"Leverandørstyring",{"$f":"B36","v":"Leverandørstyring"},"Ja",{"$f":"IFERROR(COUNTIF(INDIRECT(\"'\"&$B36&\"'!\"&CHAR(MATCH($D36,INDIRECT(\"'\"&$B36&\"'!6:6\",TRUE),0)+64)&MATCH(E$3,INDIRECT(\"'\"&$B36&\"'!B:B\",TRUE),0)&\":\"&CHAR(MATCH($D36,INDIRECT(\"'\"&$B36&\"'!6:6\",TRUE),0)+64)&MATCH(E$3&\"_slut\",INDIRECT(\"'\"&$B36&\"'!B:B\",TRUE),0),TRUE),\"X\"),0)","v":0},{"$f":"IF(E41=0,0,COUNTIF(INDIRECT(\"'\"&$B36&\"'!\"&CHAR(MATCH($D36,INDIRECT(\"'\"&$B36&\"'!6:6\",TRUE),0)+64)&MATCH(E$3,INDIRECT(\"'\"&$B36&\"'!B:B\",TRUE),0)&\":\"&CHAR(MATCH($D36,INDIRECT(\"'\"&$B36&\"'!6:6\",TRUE),0)+64)&MATCH(E$3&\"_slut\",INDIRECT(\"'\"&$B36&\"'!B:B\",TRUE),0),TRUE),\"X\")/E$61)","v":0},{"$f":"IF(E41=0,0,COUNTIF(INDIRECT(\"'\"&$B36&\"'!\"&CHAR(MATCH($D36,INDIRECT(\"'\"&$B36&\"'!6:6\",TRUE),0)+64)&MATCH(E$3,INDIRECT(\"'\"&$B36&\"'!B:B\",TRUE),0)&\":\"&CHAR(MATCH($D36,INDIRECT(\"'\"&$B36&\"'!6:6\",TRUE),0)+64)&MATCH(E$3&\"_slut\",INDIRECT(\"'\"&$B36&\"'!B:B\",TRUE),0),TRUE),\"X\")/SUM(E36:E40))","v":0},{"$f":"IFERROR(COUNTIF(INDIRECT(\"'\"&$B36&\"'!\"&CHAR(MATCH($D36,INDIRECT(\"'\"&$B36&\"'!6:6\",TRUE),0)+64)&MATCH(H$3,INDIRECT(\"'\"&$B36&\"'!B:B\",TRUE),0)&\":\"&CHAR(MATCH($D36,INDIRECT(\"'\"&$B36&\"'!6:6\",TRUE),0)+64)&MATCH(H$3&\"_slut\",INDIRECT(\"'\"&$B36&\"'!B:B\",TRUE),0),TRUE),\"X\"),0)","v":0},{"$f":"IF(H41=0,0,COUNTIF(INDIRECT(\"'\"&$B36&\"'!\"&CHAR(MATCH($D36,INDIRECT(\"'\"&$B36&\"'!6:6\",TRUE),0)+64)&MATCH(H$3,INDIRECT(\"'\"&$B36&\"'!B:B\",TRUE),0)&\":\"&CHAR(MATCH($D36,INDIRECT(\"'\"&$B36&\"'!6:6\",TRUE),0)+64)&MATCH(H$3&\"_slut\",INDIRECT(\"'\"&$B36&\"'!B:B\",TRUE),0),TRUE),\"X\")/H$61)","v":0},{"$f":"IF(H41=0,0,COUNTIF(INDIRECT(\"'\"&$B36&\"'!\"&CHAR(MATCH($D36,INDIRECT(\"'\"&$B36&\"'!6:6\",TRUE),0)+64)&MATCH(H$3,INDIRECT(\"'\"&$B36&\"'!B:B\",TRUE),0)&\":\"&CHAR(MATCH($D36,INDIRECT(\"'\"&$B36&\"'!6:6\",TRUE),0)+64)&MATCH(H$3&\"_slut\",INDIRECT(\"'\"&$B36&\"'!B:B\",TRUE),0),TRUE),\"X\")/SUM(H36:H40))","v":0},{"$f":"IFERROR(COUNTIF(INDIRECT(\"'\"&$B36&\"'!\"&CHAR(MATCH($D36,INDIRECT(\"'\"&$B36&\"'!6:6\",TRUE),0)+64)&MATCH(K$3,INDIRECT(\"'\"&$B36&\"'!B:B\",TRUE),0)&\":\"&CHAR(MATCH($D36,INDIRECT(\"'\"&$B36&\"'!6:6\",TRUE),0)+64)&MATCH(K$3&\"_slut\",INDIRECT(\"'\"&$B36&\"'!B:B\",TRUE),0),TRUE),\"X\"),0)","v":0},{"$f":"IF(K41=0,0,COUNTIF(INDIRECT(\"'\"&$B36&\"'!\"&CHAR(MATCH($D36,INDIRECT(\"'\"&$B36&\"'!6:6\",TRUE),0)+64)&MATCH(K$3,INDIRECT(\"'\"&$B36&\"'!B:B\",TRUE),0)&\":\"&CHAR(MATCH($D36,INDIRECT(\"'\"&$B36&\"'!6:6\",TRUE),0)+64)&MATCH(K$3&\"_slut\",INDIRECT(\"'\"&$B36&\"'!B:B\",TRUE),0),TRUE),\"X\")/K$61)","v":0},{"$f":"IF(K41=0,0,COUNTIF(INDIRECT(\"'\"&$B36&\"'!\"&CHAR(MATCH($D36,INDIRECT(\"'\"&$B36&\"'!6:6\",TRUE),0)+64)&MATCH(K$3,INDIRECT(\"'\"&$B36&\"'!B:B\",TRUE),0)&\":\"&CHAR(MATCH($D36,INDIRECT(\"'\"&$B36&\"'!6:6\",TRUE),0)+64)&MATCH(K$3&\"_slut\",INDIRECT(\"'\"&$B36&\"'!B:B\",TRUE),0),TRUE),\"X\")/SUM(K36:K40))","v":0},{"$f":"IFERROR(COUNTIF(INDIRECT(\"'\"&$B36&\"'!\"&CHAR(MATCH($D36,INDIRECT(\"'\"&$B36&\"'!6:6\",TRUE),0)+64)&MATCH(N$3,INDIRECT(\"'\"&$B36&\"'!B:B\",TRUE),0)&\":\"&CHAR(MATCH($D36,INDIRECT(\"'\"&$B36&\"'!6:6\",TRUE),0)+64)&MATCH(N$3&\"_slut\",INDIRECT(\"'\"&$B36&\"'!B:B\",TRUE),0),TRUE),\"X\"),0)","v":0},{"$f":"IF(N41=0,0,COUNTIF(INDIRECT(\"'\"&$B36&\"'!\"&CHAR(MATCH($D36,INDIRECT(\"'\"&$B36&\"'!6:6\",TRUE),0)+64)&MATCH(N$3,INDIRECT(\"'\"&$B36&\"'!B:B\",TRUE),0)&\":\"&CHAR(MATCH($D36,INDIRECT(\"'\"&$B36&\"'!6:6\",TRUE),0)+64)&MATCH(N$3&\"_slut\",INDIRECT(\"'\"&$B36&\"'!B:B\",TRUE),0),TRUE),\"X\")/N$61)","v":0},{"$f":"IF(N41=0,0,COUNTIF(INDIRECT(\"'\"&$B36&\"'!\"&CHAR(MATCH($D36,INDIRECT(\"'\"&$B36&\"'!6:6\",TRUE),0)+64)&MATCH(N$3,INDIRECT(\"'\"&$B36&\"'!B:B\",TRUE),0)&\":\"&CHAR(MATCH($D36,INDIRECT(\"'\"&$B36&\"'!6:6\",TRUE),0)+64)&MATCH(N$3&\"_slut\",INDIRECT(\"'\"&$B36&\"'!B:B\",TRUE),0),TRUE),\"X\")/SUM(N36:N40))","v":0}]
[null,null,{"$f":"B36","v":"Leverandørstyring"},"Delvist",{"$f":"IFERROR(COUNTIF(INDIRECT(\"'\"&$B36&\"'!\"&CHAR(MATCH($D37,INDIRECT(\"'\"&$B36&\"'!6:6\",TRUE),0)+64)&MATCH(E$3,INDIRECT(\"'\"&$B36&\"'!B:B\",TRUE),0)&\":\"&CHAR(MATCH($D37,INDIRECT(\"'\"&$B36&\"'!6:6\",TRUE),0)+64)&MATCH(E$3&\"_slut\",INDIRECT(\"'\"&$B36&\"'!B:B\",TRUE),0),TRUE),\"X\"),0)","v":0},{"$f":"IF(E41=0,0,COUNTIF(INDIRECT(\"'\"&$B36&\"'!\"&CHAR(MATCH($D37,INDIRECT(\"'\"&$B36&\"'!6:6\",TRUE),0)+64)&MATCH(E$3,INDIRECT(\"'\"&$B36&\"'!B:B\",TRUE),0)&\":\"&CHAR(MATCH($D37,INDIRECT(\"'\"&$B36&\"'!6:6\",TRUE),0)+64)&MATCH(E$3&\"_slut\",INDIRECT(\"'\"&$B36&\"'!B:B\",TRUE),0),TRUE),\"X\")/E$61)","v":0},{"$f":"IF(E41=0,0,COUNTIF(INDIRECT(\"'\"&$B36&\"'!\"&CHAR(MATCH($D37,INDIRECT(\"'\"&$B36&\"'!6:6\",TRUE),0)+64)&MATCH(E$3,INDIRECT(\"'\"&$B36&\"'!B:B\",TRUE),0)&\":\"&CHAR(MATCH($D37,INDIRECT(\"'\"&$B36&\"'!6:6\",TRUE),0)+64)&MATCH(E$3&\"_slut\",INDIRECT(\"'\"&$B36&\"'!B:B\",TRUE),0),TRUE),\"X\")/SUM(E36:E40))","v":0},{"$f":"IFERROR(COUNTIF(INDIRECT(\"'\"&$B36&\"'!\"&CHAR(MATCH($D37,INDIRECT(\"'\"&$B36&\"'!6:6\",TRUE),0)+64)&MATCH(H$3,INDIRECT(\"'\"&$B36&\"'!B:B\",TRUE),0)&\":\"&CHAR(MATCH($D37,INDIRECT(\"'\"&$B36&\"'!6:6\",TRUE),0)+64)&MATCH(H$3&\"_slut\",INDIRECT(\"'\"&$B36&\"'!B:B\",TRUE),0),TRUE),\"X\"),0)","v":0},{"$f":"IF(H41=0,0,COUNTIF(INDIRECT(\"'\"&$B36&\"'!\"&CHAR(MATCH($D37,INDIRECT(\"'\"&$B36&\"'!6:6\",TRUE),0)+64)&MATCH(H$3,INDIRECT(\"'\"&$B36&\"'!B:B\",TRUE),0)&\":\"&CHAR(MATCH($D37,INDIRECT(\"'\"&$B36&\"'!6:6\",TRUE),0)+64)&MATCH(H$3&\"_slut\",INDIRECT(\"'\"&$B36&\"'!B:B\",TRUE),0),TRUE),\"X\")/H$61)","v":0},{"$f":"IF(H41=0,0,COUNTIF(INDIRECT(\"'\"&$B36&\"'!\"&CHAR(MATCH($D37,INDIRECT(\"'\"&$B36&\"'!6:6\",TRUE),0)+64)&MATCH(H$3,INDIRECT(\"'\"&$B36&\"'!B:B\",TRUE),0)&\":\"&CHAR(MATCH($D37,INDIRECT(\"'\"&$B36&\"'!6:6\",TRUE),0)+64)&MATCH(H$3&\"_slut\",INDIRECT(\"'\"&$B36&\"'!B:B\",TRUE),0),TRUE),\"X\")/SUM(H36:H40))","v":0},{"$f":"IFERROR(COUNTIF(INDIRECT(\"'\"&$B36&\"'!\"&CHAR(MATCH($D37,INDIRECT(\"'\"&$B36&\"'!6:6\",TRUE),0)+64)&MATCH(K$3,INDIRECT(\"'\"&$B36&\"'!B:B\",TRUE),0)&\":\"&CHAR(MATCH($D37,INDIRECT(\"'\"&$B36&\"'!6:6\",TRUE),0)+64)&MATCH(K$3&\"_slut\",INDIRECT(\"'\"&$B36&\"'!B:B\",TRUE),0),TRUE),\"X\"),0)","v":0},{"$f":"IF(K41=0,0,COUNTIF(INDIRECT(\"'\"&$B36&\"'!\"&CHAR(MATCH($D37,INDIRECT(\"'\"&$B36&\"'!6:6\",TRUE),0)+64)&MATCH(K$3,INDIRECT(\"'\"&$B36&\"'!B:B\",TRUE),0)&\":\"&CHAR(MATCH($D37,INDIRECT(\"'\"&$B36&\"'!6:6\",TRUE),0)+64)&MATCH(K$3&\"_slut\",INDIRECT(\"'\"&$B36&\"'!B:B\",TRUE),0),TRUE),\"X\")/K$61)","v":0},{"$f":"IF(K41=0,0,COUNTIF(INDIRECT(\"'\"&$B36&\"'!\"&CHAR(MATCH($D37,INDIRECT(\"'\"&$B36&\"'!6:6\",TRUE),0)+64)&MATCH(K$3,INDIRECT(\"'\"&$B36&\"'!B:B\",TRUE),0)&\":\"&CHAR(MATCH($D37,INDIRECT(\"'\"&$B36&\"'!6:6\",TRUE),0)+64)&MATCH(K$3&\"_slut\",INDIRECT(\"'\"&$B36&\"'!B:B\",TRUE),0),TRUE),\"X\")/SUM(K36:K40))","v":0},{"$f":"IFERROR(COUNTIF(INDIRECT(\"'\"&$B36&\"'!\"&CHAR(MATCH($D37,INDIRECT(\"'\"&$B36&\"'!6:6\",TRUE),0)+64)&MATCH(N$3,INDIRECT(\"'\"&$B36&\"'!B:B\",TRUE),0)&\":\"&CHAR(MATCH($D37,INDIRECT(\"'\"&$B36&\"'!6:6\",TRUE),0)+64)&MATCH(N$3&\"_slut\",INDIRECT(\"'\"&$B36&\"'!B:B\",TRUE),0),TRUE),\"X\"),0)","v":0},{"$f":"IF(N41=0,0,COUNTIF(INDIRECT(\"'\"&$B36&\"'!\"&CHAR(MATCH($D37,INDIRECT(\"'\"&$B36&\"'!6:6\",TRUE),0)+64)&MATCH(N$3,INDIRECT(\"'\"&$B36&\"'!B:B\",TRUE),0)&\":\"&CHAR(MATCH($D37,INDIRECT(\"'\"&$B36&\"'!6:6\",TRUE),0)+64)&MATCH(N$3&\"_slut\",INDIRECT(\"'\"&$B36&\"'!B:B\",TRUE),0),TRUE),\"X\")/N$61)","v":0},{"$f":"IF(N41=0,0,COUNTIF(INDIRECT(\"'\"&$B36&\"'!\"&CHAR(MATCH($D37,INDIRECT(\"'\"&$B36&\"'!6:6\",TRUE),0)+64)&MATCH(N$3,INDIRECT(\"'\"&$B36&\"'!B:B\",TRUE),0)&\":\"&CHAR(MATCH($D37,INDIRECT(\"'\"&$B36&\"'!6:6\",TRUE),0)+64)&MATCH(N$3&\"_slut\",INDIRECT(\"'\"&$B36&\"'!B:B\",TRUE),0),TRUE),\"X\")/SUM(N36:N40))","v":0}]
[null,null,{"$f":"B36","v":"Leverandørstyring"},"Nej",{"$f":"IFERROR(COUNTIF(INDIRECT(\"'\"&$B36&\"'!\"&CHAR(MATCH($D38,INDIRECT(\"'\"&$B36&\"'!6:6\",TRUE),0)+64)&MATCH(E$3,INDIRECT(\"'\"&$B36&\"'!B:B\",TRUE),0)&\":\"&CHAR(MATCH($D38,INDIRECT(\"'\"&$B36&\"'!6:6\",TRUE),0)+64)&MATCH(E$3&\"_slut\",INDIRECT(\"'\"&$B36&\"'!B:B\",TRUE),0),TRUE),\"X\"),0)","v":0},{"$f":"IF(E41=0,0,COUNTIF(INDIRECT(\"'\"&$B36&\"'!\"&CHAR(MATCH($D38,INDIRECT(\"'\"&$B36&\"'!6:6\",TRUE),0)+64)&MATCH(E$3,INDIRECT(\"'\"&$B36&\"'!B:B\",TRUE),0)&\":\"&CHAR(MATCH($D38,INDIRECT(\"'\"&$B36&\"'!6:6\",TRUE),0)+64)&MATCH(E$3&\"_slut\",INDIRECT(\"'\"&$B36&\"'!B:B\",TRUE),0),TRUE),\"X\")/E$61)","v":0},{"$f":"IF(E41=0,0,COUNTIF(INDIRECT(\"'\"&$B36&\"'!\"&CHAR(MATCH($D38,INDIRECT(\"'\"&$B36&\"'!6:6\",TRUE),0)+64)&MATCH(E$3,INDIRECT(\"'\"&$B36&\"'!B:B\",TRUE),0)&\":\"&CHAR(MATCH($D38,INDIRECT(\"'\"&$B36&\"'!6:6\",TRUE),0)+64)&MATCH(E$3&\"_slut\",INDIRECT(\"'\"&$B36&\"'!B:B\",TRUE),0),TRUE),\"X\")/SUM(E36:E40))","v":0},{"$f":"IFERROR(COUNTIF(INDIRECT(\"'\"&$B36&\"'!\"&CHAR(MATCH($D38,INDIRECT(\"'\"&$B36&\"'!6:6\",TRUE),0)+64)&MATCH(H$3,INDIRECT(\"'\"&$B36&\"'!B:B\",TRUE),0)&\":\"&CHAR(MATCH($D38,INDIRECT(\"'\"&$B36&\"'!6:6\",TRUE),0)+64)&MATCH(H$3&\"_slut\",INDIRECT(\"'\"&$B36&\"'!B:B\",TRUE),0),TRUE),\"X\"),0)","v":0},{"$f":"IF(H41=0,0,COUNTIF(INDIRECT(\"'\"&$B36&\"'!\"&CHAR(MATCH($D38,INDIRECT(\"'\"&$B36&\"'!6:6\",TRUE),0)+64)&MATCH(H$3,INDIRECT(\"'\"&$B36&\"'!B:B\",TRUE),0)&\":\"&CHAR(MATCH($D38,INDIRECT(\"'\"&$B36&\"'!6:6\",TRUE),0)+64)&MATCH(H$3&\"_slut\",INDIRECT(\"'\"&$B36&\"'!B:B\",TRUE),0),TRUE),\"X\")/H$61)","v":0},{"$f":"IF(H41=0,0,COUNTIF(INDIRECT(\"'\"&$B36&\"'!\"&CHAR(MATCH($D38,INDIRECT(\"'\"&$B36&\"'!6:6\",TRUE),0)+64)&MATCH(H$3,INDIRECT(\"'\"&$B36&\"'!B:B\",TRUE),0)&\":\"&CHAR(MATCH($D38,INDIRECT(\"'\"&$B36&\"'!6:6\",TRUE),0)+64)&MATCH(H$3&\"_slut\",INDIRECT(\"'\"&$B36&\"'!B:B\",TRUE),0),TRUE),\"X\")/SUM(H36:H40))","v":0},{"$f":"IFERROR(COUNTIF(INDIRECT(\"'\"&$B36&\"'!\"&CHAR(MATCH($D38,INDIRECT(\"'\"&$B36&\"'!6:6\",TRUE),0)+64)&MATCH(K$3,INDIRECT(\"'\"&$B36&\"'!B:B\",TRUE),0)&\":\"&CHAR(MATCH($D38,INDIRECT(\"'\"&$B36&\"'!6:6\",TRUE),0)+64)&MATCH(K$3&\"_slut\",INDIRECT(\"'\"&$B36&\"'!B:B\",TRUE),0),TRUE),\"X\"),0)","v":0},{"$f":"IF(K41=0,0,COUNTIF(INDIRECT(\"'\"&$B36&\"'!\"&CHAR(MATCH($D38,INDIRECT(\"'\"&$B36&\"'!6:6\",TRUE),0)+64)&MATCH(K$3,INDIRECT(\"'\"&$B36&\"'!B:B\",TRUE),0)&\":\"&CHAR(MATCH($D38,INDIRECT(\"'\"&$B36&\"'!6:6\",TRUE),0)+64)&MATCH(K$3&\"_slut\",INDIRECT(\"'\"&$B36&\"'!B:B\",TRUE),0),TRUE),\"X\")/K$61)","v":0},{"$f":"IF(K41=0,0,COUNTIF(INDIRECT(\"'\"&$B36&\"'!\"&CHAR(MATCH($D38,INDIRECT(\"'\"&$B36&\"'!6:6\",TRUE),0)+64)&MATCH(K$3,INDIRECT(\"'\"&$B36&\"'!B:B\",TRUE),0)&\":\"&CHAR(MATCH($D38,INDIRECT(\"'\"&$B36&\"'!6:6\",TRUE),0)+64)&MATCH(K$3&\"_slut\",INDIRECT(\"'\"&$B36&\"'!B:B\",TRUE),0),TRUE),\"X\")/SUM(K36:K40))","v":0},{"$f":"IFERROR(COUNTIF(INDIRECT(\"'\"&$B36&\"'!\"&CHAR(MATCH($D38,INDIRECT(\"'\"&$B36&\"'!6:6\",TRUE),0)+64)&MATCH(N$3,INDIRECT(\"'\"&$B36&\"'!B:B\",TRUE),0)&\":\"&CHAR(MATCH($D38,INDIRECT(\"'\"&$B36&\"'!6:6\",TRUE),0)+64)&MATCH(N$3&\"_slut\",INDIRECT(\"'\"&$B36&\"'!B:B\",TRUE),0),TRUE),\"X\"),0)","v":0},{"$f":"IF(N41=0,0,COUNTIF(INDIRECT(\"'\"&$B36&\"'!\"&CHAR(MATCH($D38,INDIRECT(\"'\"&$B36&\"'!6:6\",TRUE),0)+64)&MATCH(N$3,INDIRECT(\"'\"&$B36&\"'!B:B\",TRUE),0)&\":\"&CHAR(MATCH($D38,INDIRECT(\"'\"&$B36&\"'!6:6\",TRUE),0)+64)&MATCH(N$3&\"_slut\",INDIRECT(\"'\"&$B36&\"'!B:B\",TRUE),0),TRUE),\"X\")/N$61)","v":0},{"$f":"IF(N41=0,0,COUNTIF(INDIRECT(\"'\"&$B36&\"'!\"&CHAR(MATCH($D38,INDIRECT(\"'\"&$B36&\"'!6:6\",TRUE),0)+64)&MATCH(N$3,INDIRECT(\"'\"&$B36&\"'!B:B\",TRUE),0)&\":\"&CHAR(MATCH($D38,INDIRECT(\"'\"&$B36&\"'!6:6\",TRUE),0)+64)&MATCH(N$3&\"_slut\",INDIRECT(\"'\"&$B36&\"'!B:B\",TRUE),0),TRUE),\"X\")/SUM(N36:N40))","v":0}]
[null,null,{"$f":"B36","v":"Leverandørstyring"},"Ikke relevant",{"$f":"IFERROR(COUNTIF(INDIRECT(\"'\"&$B36&\"'!\"&CHAR(MATCH($D39,INDIRECT(\"'\"&$B36&\"'!6:6\",TRUE),0)+64)&MATCH(E$3,INDIRECT(\"'\"&$B36&\"'!B:B\",TRUE),0)&\":\"&CHAR(MATCH($D39,INDIRECT(\"'\"&$B36&\"'!6:6\",TRUE),0)+64)&MATCH(E$3&\"_slut\",INDIRECT(\"'\"&$B36&\"'!B:B\",TRUE),0),TRUE),\"X\"),0)","v":0},{"$f":"IF(E41=0,0,COUNTIF(INDIRECT(\"'\"&$B36&\"'!\"&CHAR(MATCH($D39,INDIRECT(\"'\"&$B36&\"'!6:6\",TRUE),0)+64)&MATCH(E$3,INDIRECT(\"'\"&$B36&\"'!B:B\",TRUE),0)&\":\"&CHAR(MATCH($D39,INDIRECT(\"'\"&$B36&\"'!6:6\",TRUE),0)+64)&MATCH(E$3&\"_slut\",INDIRECT(\"'\"&$B36&\"'!B:B\",TRUE),0),TRUE),\"X\")/E$61)","v":0},{"$f":"IF(E41=0,0,COUNTIF(INDIRECT(\"'\"&$B36&\"'!\"&CHAR(MATCH($D39,INDIRECT(\"'\"&$B36&\"'!6:6\",TRUE),0)+64)&MATCH(E$3,INDIRECT(\"'\"&$B36&\"'!B:B\",TRUE),0)&\":\"&CHAR(MATCH($D39,INDIRECT(\"'\"&$B36&\"'!6:6\",TRUE),0)+64)&MATCH(E$3&\"_slut\",INDIRECT(\"'\"&$B36&\"'!B:B\",TRUE),0),TRUE),\"X\")/SUM(E36:E40))","v":0},{"$f":"IFERROR(COUNTIF(INDIRECT(\"'\"&$B36&\"'!\"&CHAR(MATCH($D39,INDIRECT(\"'\"&$B36&\"'!6:6\",TRUE),0)+64)&MATCH(H$3,INDIRECT(\"'\"&$B36&\"'!B:B\",TRUE),0)&\":\"&CHAR(MATCH($D39,INDIRECT(\"'\"&$B36&\"'!6:6\",TRUE),0)+64)&MATCH(H$3&\"_slut\",INDIRECT(\"'\"&$B36&\"'!B:B\",TRUE),0),TRUE),\"X\"),0)","v":0},{"$f":"IF(H41=0,0,COUNTIF(INDIRECT(\"'\"&$B36&\"'!\"&CHAR(MATCH($D39,INDIRECT(\"'\"&$B36&\"'!6:6\",TRUE),0)+64)&MATCH(H$3,INDIRECT(\"'\"&$B36&\"'!B:B\",TRUE),0)&\":\"&CHAR(MATCH($D39,INDIRECT(\"'\"&$B36&\"'!6:6\",TRUE),0)+64)&MATCH(H$3&\"_slut\",INDIRECT(\"'\"&$B36&\"'!B:B\",TRUE),0),TRUE),\"X\")/H$61)","v":0},{"$f":"IF(H41=0,0,COUNTIF(INDIRECT(\"'\"&$B36&\"'!\"&CHAR(MATCH($D39,INDIRECT(\"'\"&$B36&\"'!6:6\",TRUE),0)+64)&MATCH(H$3,INDIRECT(\"'\"&$B36&\"'!B:B\",TRUE),0)&\":\"&CHAR(MATCH($D39,INDIRECT(\"'\"&$B36&\"'!6:6\",TRUE),0)+64)&MATCH(H$3&\"_slut\",INDIRECT(\"'\"&$B36&\"'!B:B\",TRUE),0),TRUE),\"X\")/SUM(H36:H40))","v":0},{"$f":"IFERROR(COUNTIF(INDIRECT(\"'\"&$B36&\"'!\"&CHAR(MATCH($D39,INDIRECT(\"'\"&$B36&\"'!6:6\",TRUE),0)+64)&MATCH(K$3,INDIRECT(\"'\"&$B36&\"'!B:B\",TRUE),0)&\":\"&CHAR(MATCH($D39,INDIRECT(\"'\"&$B36&\"'!6:6\",TRUE),0)+64)&MATCH(K$3&\"_slut\",INDIRECT(\"'\"&$B36&\"'!B:B\",TRUE),0),TRUE),\"X\"),0)","v":0},{"$f":"IF(K41=0,0,COUNTIF(INDIRECT(\"'\"&$B36&\"'!\"&CHAR(MATCH($D39,INDIRECT(\"'\"&$B36&\"'!6:6\",TRUE),0)+64)&MATCH(K$3,INDIRECT(\"'\"&$B36&\"'!B:B\",TRUE),0)&\":\"&CHAR(MATCH($D39,INDIRECT(\"'\"&$B36&\"'!6:6\",TRUE),0)+64)&MATCH(K$3&\"_slut\",INDIRECT(\"'\"&$B36&\"'!B:B\",TRUE),0),TRUE),\"X\")/K$61)","v":0},{"$f":"IF(K41=0,0,COUNTIF(INDIRECT(\"'\"&$B36&\"'!\"&CHAR(MATCH($D39,INDIRECT(\"'\"&$B36&\"'!6:6\",TRUE),0)+64)&MATCH(K$3,INDIRECT(\"'\"&$B36&\"'!B:B\",TRUE),0)&\":\"&CHAR(MATCH($D39,INDIRECT(\"'\"&$B36&\"'!6:6\",TRUE),0)+64)&MATCH(K$3&\"_slut\",INDIRECT(\"'\"&$B36&\"'!B:B\",TRUE),0),TRUE),\"X\")/SUM(K36:K40))","v":0},{"$f":"IFERROR(COUNTIF(INDIRECT(\"'\"&$B36&\"'!\"&CHAR(MATCH($D39,INDIRECT(\"'\"&$B36&\"'!6:6\",TRUE),0)+64)&MATCH(N$3,INDIRECT(\"'\"&$B36&\"'!B:B\",TRUE),0)&\":\"&CHAR(MATCH($D39,INDIRECT(\"'\"&$B36&\"'!6:6\",TRUE),0)+64)&MATCH(N$3&\"_slut\",INDIRECT(\"'\"&$B36&\"'!B:B\",TRUE),0),TRUE),\"X\"),0)","v":0},{"$f":"IF(N41=0,0,COUNTIF(INDIRECT(\"'\"&$B36&\"'!\"&CHAR(MATCH($D39,INDIRECT(\"'\"&$B36&\"'!6:6\",TRUE),0)+64)&MATCH(N$3,INDIRECT(\"'\"&$B36&\"'!B:B\",TRUE),0)&\":\"&CHAR(MATCH($D39,INDIRECT(\"'\"&$B36&\"'!6:6\",TRUE),0)+64)&MATCH(N$3&\"_slut\",INDIRECT(\"'\"&$B36&\"'!B:B\",TRUE),0),TRUE),\"X\")/N$61)","v":0},{"$f":"IF(N41=0,0,COUNTIF(INDIRECT(\"'\"&$B36&\"'!\"&CHAR(MATCH($D39,INDIRECT(\"'\"&$B36&\"'!6:6\",TRUE),0)+64)&MATCH(N$3,INDIRECT(\"'\"&$B36&\"'!B:B\",TRUE),0)&\":\"&CHAR(MATCH($D39,INDIRECT(\"'\"&$B36&\"'!6:6\",TRUE),0)+64)&MATCH(N$3&\"_slut\",INDIRECT(\"'\"&$B36&\"'!B:B\",TRUE),0),TRUE),\"X\")/SUM(N36:N40))","v":0}]
[null,null,{"$f":"B36","v":"Leverandørstyring"},"Ikke sat",{"$f":"IF(ISERROR(MATCH(E$3,INDIRECT(\"'\"&$B36&\"'!B:B\",TRUE),0)),0,COUNTA(INDIRECT(\"'\"&$B36&\"'!E\"&MATCH(E$3,INDIRECT(\"'\"&$B36&\"'!B:B\",TRUE),0)&\":E\"&MATCH(E$3&\"_slut\",INDIRECT(\"'\"&$B36&\"'!B:B\",TRUE),0),TRUE))-E36-E37-E38-E39)","v":9},{"$f":"IF(E41=0,0,E41/E$61-F36-F37-F38-F39)","v":0.29032258064516131},{"$f":"IF(E41=0,0,1-G36-G37-G38-G39)","v":1},{"$f":"IF(ISERROR(MATCH(H$3,INDIRECT(\"'\"&$B36&\"'!B:B\",TRUE),0)),0,COUNTA(INDIRECT(\"'\"&$B36&\"'!E\"&MATCH(H$3,INDIRECT(\"'\"&$B36&\"'!B:B\",TRUE),0)&\":E\"&MATCH(H$3&\"_slut\",INDIRECT(\"'\"&$B36&\"'!B:B\",TRUE),0),TRUE))-H36-H37-H38-H39)","v":8},{"$f":"IF(H41=0,0,H41/H$61-I36-I37-I38-I39)","v":0.22222222222222221},{"$f":"IF(H41=0,0,1-J36-J37-J38-J39)","v":1},{"$f":"IF(ISERROR(MATCH(K$3,INDIRECT(\"'\"&$B36&\"'!B:B\",TRUE),0)),0,COUNTA(INDIRECT(\"'\"&$B36&\"'!E\"&MATCH(K$3,INDIRECT(\"'\"&$B36&\"'!B:B\",TRUE),0)&\":E\"&MATCH(K$3&\"_slut\",INDIRECT(\"'\"&$B36&\"'!B:B\",TRUE),0),TRUE))-K36-K37-K38-K39)","v":7},{"$f":"IF(K41=0,0,K41/K$61-L36-L37-L38-L39)","v":0.25925925925925924},{"$f":"IF(K41=0,0,1-M36-M37-M38-M39)","v":1},{"$f":"IF(ISERROR(MATCH(N$3,INDIRECT(\"'\"&$B36&\"'!B:B\",TRUE),0)),0,COUNTA(INDIRECT(\"'\"&$B36&\"'!E\"&MATCH(N$3,INDIRECT(\"'\"&$B36&\"'!B:B\",TRUE),0)&\":E\"&MATCH(N$3&\"_slut\",INDIRECT(\"'\"&$B36&\"'!B:B\",TRUE),0),TRUE))-N36-N37-N38-N39)","v":2},{"$f":"IF(N41=0,0,N41/N$61-O36-O37-O38-O39)","v":0.125},{"$f":"IF(N41=0,0,1-P36-P37-P38-P39)","v":1}]
[null,null,{"$f":"B36","v":"Leverandørstyring"},"TOTAL",{"$f":"SUM(E36:E40)","v":9},{"$f":"SUM(F36:F39)","v":0},{"$f":"SUM(G36:G39)","v":0},{"$f":"SUM(H36:H40)","v":8},{"$f":"SUM(I36:I39)","v":0},0,{"$f":"SUM(K36:K40)","v":7},{"$f":"SUM(L36:L39)","v":0},0,{"$f":"SUM(N36:N40)","v":2},{"$f":"SUM(O36:O39)","v":0},0]
[null,"It-beredskab",{"$f":"B42","v":"It-beredskab"},"Ja",{"$f":"IFERROR(COUNTIF(INDIRECT(\"'\"&$B42&\"'!\"&CHAR(MATCH($D42,INDIRECT(\"'\"&$B42&\"'!6:6\",TRUE),0)+64)&MATCH(E$3,INDIRECT(\"'\"&$B42&\"'!B:B\",TRUE),0)&\":\"&CHAR(MATCH($D42,INDIRECT(\"'\"&$B42&\"'!6:6\",TRUE),0)+64)&MATCH(E$3&\"_slut\",INDIRECT(\"'\"&$B42&\"'!B:B\",TRUE),0),TRUE),\"X\"),0)","v":0},{"$f":"IF(E47=0,0,COUNTIF(INDIRECT(\"'\"&$B42&\"'!\"&CHAR(MATCH($D42,INDIRECT(\"'\"&$B42&\"'!6:6\",TRUE),0)+64)&MATCH(E$3,INDIRECT(\"'\"&$B42&\"'!B:B\",TRUE),0)&\":\"&CHAR(MATCH($D42,INDIRECT(\"'\"&$B42&\"'!6:6\",TRUE),0)+64)&MATCH(E$3&\"_slut\",INDIRECT(\"'\"&$B42&\"'!B:B\",TRUE),0),TRUE),\"X\")/E$61)","v":0},{"$f":"IF(E47=0,0,COUNTIF(INDIRECT(\"'\"&$B42&\"'!\"&CHAR(MATCH($D42,INDIRECT(\"'\"&$B42&\"'!6:6\",TRUE),0)+64)&MATCH(E$3,INDIRECT(\"'\"&$B42&\"'!B:B\",TRUE),0)&\":\"&CHAR(MATCH($D42,INDIRECT(\"'\"&$B42&\"'!6:6\",TRUE),0)+64)&MATCH(E$3&\"_slut\",INDIRECT(\"'\"&$B42&\"'!B:B\",TRUE),0),TRUE),\"X\")/SUM(E42:E46))","v":0},{"$f":"IFERROR(COUNTIF(INDIRECT(\"'\"&$B42&\"'!\"&CHAR(MATCH($D42,INDIRECT(\"'\"&$B42&\"'!6:6\",TRUE),0)+64)&MATCH(H$3,INDIRECT(\"'\"&$B42&\"'!B:B\",TRUE),0)&\":\"&CHAR(MATCH($D42,INDIRECT(\"'\"&$B42&\"'!6:6\",TRUE),0)+64)&MATCH(H$3&\"_slut\",INDIRECT(\"'\"&$B42&\"'!B:B\",TRUE),0),TRUE),\"X\"),0)","v":0},{"$f":"IF(H47=0,0,COUNTIF(INDIRECT(\"'\"&$B42&\"'!\"&CHAR(MATCH($D42,INDIRECT(\"'\"&$B42&\"'!6:6\",TRUE),0)+64)&MATCH(H$3,INDIRECT(\"'\"&$B42&\"'!B:B\",TRUE),0)&\":\"&CHAR(MATCH($D42,INDIRECT(\"'\"&$B42&\"'!6:6\",TRUE),0)+64)&MATCH(H$3&\"_slut\",INDIRECT(\"'\"&$B42&\"'!B:B\",TRUE),0),TRUE),\"X\")/H$61)","v":0},{"$f":"IF(H47=0,0,COUNTIF(INDIRECT(\"'\"&$B42&\"'!\"&CHAR(MATCH($D42,INDIRECT(\"'\"&$B42&\"'!6:6\",TRUE),0)+64)&MATCH(H$3,INDIRECT(\"'\"&$B42&\"'!B:B\",TRUE),0)&\":\"&CHAR(MATCH($D42,INDIRECT(\"'\"&$B42&\"'!6:6\",TRUE),0)+64)&MATCH(H$3&\"_slut\",INDIRECT(\"'\"&$B42&\"'!B:B\",TRUE),0),TRUE),\"X\")/SUM(H42:H46))","v":0},{"$f":"IFERROR(COUNTIF(INDIRECT(\"'\"&$B42&\"'!\"&CHAR(MATCH($D42,INDIRECT(\"'\"&$B42&\"'!6:6\",TRUE),0)+64)&MATCH(K$3,INDIRECT(\"'\"&$B42&\"'!B:B\",TRUE),0)&\":\"&CHAR(MATCH($D42,INDIRECT(\"'\"&$B42&\"'!6:6\",TRUE),0)+64)&MATCH(K$3&\"_slut\",INDIRECT(\"'\"&$B42&\"'!B:B\",TRUE),0),TRUE),\"X\"),0)","v":0},{"$f":"IF(K47=0,0,COUNTIF(INDIRECT(\"'\"&$B42&\"'!\"&CHAR(MATCH($D42,INDIRECT(\"'\"&$B42&\"'!6:6\",TRUE),0)+64)&MATCH(K$3,INDIRECT(\"'\"&$B42&\"'!B:B\",TRUE),0)&\":\"&CHAR(MATCH($D42,INDIRECT(\"'\"&$B42&\"'!6:6\",TRUE),0)+64)&MATCH(K$3&\"_slut\",INDIRECT(\"'\"&$B42&\"'!B:B\",TRUE),0),TRUE),\"X\")/K$61)","v":0},{"$f":"IF(K47=0,0,COUNTIF(INDIRECT(\"'\"&$B42&\"'!\"&CHAR(MATCH($D42,INDIRECT(\"'\"&$B42&\"'!6:6\",TRUE),0)+64)&MATCH(K$3,INDIRECT(\"'\"&$B42&\"'!B:B\",TRUE),0)&\":\"&CHAR(MATCH($D42,INDIRECT(\"'\"&$B42&\"'!6:6\",TRUE),0)+64)&MATCH(K$3&\"_slut\",INDIRECT(\"'\"&$B42&\"'!B:B\",TRUE),0),TRUE),\"X\")/SUM(K42:K46))","v":0},{"$f":"IFERROR(COUNTIF(INDIRECT(\"'\"&$B42&\"'!\"&CHAR(MATCH($D42,INDIRECT(\"'\"&$B42&\"'!6:6\",TRUE),0)+64)&MATCH(N$3,INDIRECT(\"'\"&$B42&\"'!B:B\",TRUE),0)&\":\"&CHAR(MATCH($D42,INDIRECT(\"'\"&$B42&\"'!6:6\",TRUE),0)+64)&MATCH(N$3&\"_slut\",INDIRECT(\"'\"&$B42&\"'!B:B\",TRUE),0),TRUE),\"X\"),0)","v":0},{"$f":"IF(N47=0,0,COUNTIF(INDIRECT(\"'\"&$B42&\"'!\"&CHAR(MATCH($D42,INDIRECT(\"'\"&$B42&\"'!6:6\",TRUE),0)+64)&MATCH(N$3,INDIRECT(\"'\"&$B42&\"'!B:B\",TRUE),0)&\":\"&CHAR(MATCH($D42,INDIRECT(\"'\"&$B42&\"'!6:6\",TRUE),0)+64)&MATCH(N$3&\"_slut\",INDIRECT(\"'\"&$B42&\"'!B:B\",TRUE),0),TRUE),\"X\")/N$61)","v":0},{"$f":"IF(N47=0,0,COUNTIF(INDIRECT(\"'\"&$B42&\"'!\"&CHAR(MATCH($D42,INDIRECT(\"'\"&$B42&\"'!6:6\",TRUE),0)+64)&MATCH(N$3,INDIRECT(\"'\"&$B42&\"'!B:B\",TRUE),0)&\":\"&CHAR(MATCH($D42,INDIRECT(\"'\"&$B42&\"'!6:6\",TRUE),0)+64)&MATCH(N$3&\"_slut\",INDIRECT(\"'\"&$B42&\"'!B:B\",TRUE),0),TRUE),\"X\")/SUM(N42:N46))","v":0}]
[null,null,{"$f":"B42","v":"It-beredskab"},"Delvist",{"$f":"IFERROR(COUNTIF(INDIRECT(\"'\"&$B42&\"'!\"&CHAR(MATCH($D43,INDIRECT(\"'\"&$B42&\"'!6:6\",TRUE),0)+64)&MATCH(E$3,INDIRECT(\"'\"&$B42&\"'!B:B\",TRUE),0)&\":\"&CHAR(MATCH($D43,INDIRECT(\"'\"&$B42&\"'!6:6\",TRUE),0)+64)&MATCH(E$3&\"_slut\",INDIRECT(\"'\"&$B42&\"'!B:B\",TRUE),0),TRUE),\"X\"),0)","v":0},{"$f":"IF(E47=0,0,COUNTIF(INDIRECT(\"'\"&$B42&\"'!\"&CHAR(MATCH($D43,INDIRECT(\"'\"&$B42&\"'!6:6\",TRUE),0)+64)&MATCH(E$3,INDIRECT(\"'\"&$B42&\"'!B:B\",TRUE),0)&\":\"&CHAR(MATCH($D43,INDIRECT(\"'\"&$B42&\"'!6:6\",TRUE),0)+64)&MATCH(E$3&\"_slut\",INDIRECT(\"'\"&$B42&\"'!B:B\",TRUE),0),TRUE),\"X\")/E$61)","v":0},{"$f":"IF(E47=0,0,COUNTIF(INDIRECT(\"'\"&$B42&\"'!\"&CHAR(MATCH($D43,INDIRECT(\"'\"&$B42&\"'!6:6\",TRUE),0)+64)&MATCH(E$3,INDIRECT(\"'\"&$B42&\"'!B:B\",TRUE),0)&\":\"&CHAR(MATCH($D43,INDIRECT(\"'\"&$B42&\"'!6:6\",TRUE),0)+64)&MATCH(E$3&\"_slut\",INDIRECT(\"'\"&$B42&\"'!B:B\",TRUE),0),TRUE),\"X\")/SUM(E42:E46))","v":0},{"$f":"IFERROR(COUNTIF(INDIRECT(\"'\"&$B42&\"'!\"&CHAR(MATCH($D43,INDIRECT(\"'\"&$B42&\"'!6:6\",TRUE),0)+64)&MATCH(H$3,INDIRECT(\"'\"&$B42&\"'!B:B\",TRUE),0)&\":\"&CHAR(MATCH($D43,INDIRECT(\"'\"&$B42&\"'!6:6\",TRUE),0)+64)&MATCH(H$3&\"_slut\",INDIRECT(\"'\"&$B42&\"'!B:B\",TRUE),0),TRUE),\"X\"),0)","v":0},{"$f":"IF(H47=0,0,COUNTIF(INDIRECT(\"'\"&$B42&\"'!\"&CHAR(MATCH($D43,INDIRECT(\"'\"&$B42&\"'!6:6\",TRUE),0)+64)&MATCH(H$3,INDIRECT(\"'\"&$B42&\"'!B:B\",TRUE),0)&\":\"&CHAR(MATCH($D43,INDIRECT(\"'\"&$B42&\"'!6:6\",TRUE),0)+64)&MATCH(H$3&\"_slut\",INDIRECT(\"'\"&$B42&\"'!B:B\",TRUE),0),TRUE),\"X\")/H$61)","v":0},{"$f":"IF(H47=0,0,COUNTIF(INDIRECT(\"'\"&$B42&\"'!\"&CHAR(MATCH($D43,INDIRECT(\"'\"&$B42&\"'!6:6\",TRUE),0)+64)&MATCH(H$3,INDIRECT(\"'\"&$B42&\"'!B:B\",TRUE),0)&\":\"&CHAR(MATCH($D43,INDIRECT(\"'\"&$B42&\"'!6:6\",TRUE),0)+64)&MATCH(H$3&\"_slut\",INDIRECT(\"'\"&$B42&\"'!B:B\",TRUE),0),TRUE),\"X\")/SUM(H42:H46))","v":0},{"$f":"IFERROR(COUNTIF(INDIRECT(\"'\"&$B42&\"'!\"&CHAR(MATCH($D43,INDIRECT(\"'\"&$B42&\"'!6:6\",TRUE),0)+64)&MATCH(K$3,INDIRECT(\"'\"&$B42&\"'!B:B\",TRUE),0)&\":\"&CHAR(MATCH($D43,INDIRECT(\"'\"&$B42&\"'!6:6\",TRUE),0)+64)&MATCH(K$3&\"_slut\",INDIRECT(\"'\"&$B42&\"'!B:B\",TRUE),0),TRUE),\"X\"),0)","v":0},{"$f":"IF(K47=0,0,COUNTIF(INDIRECT(\"'\"&$B42&\"'!\"&CHAR(MATCH($D43,INDIRECT(\"'\"&$B42&\"'!6:6\",TRUE),0)+64)&MATCH(K$3,INDIRECT(\"'\"&$B42&\"'!B:B\",TRUE),0)&\":\"&CHAR(MATCH($D43,INDIRECT(\"'\"&$B42&\"'!6:6\",TRUE),0)+64)&MATCH(K$3&\"_slut\",INDIRECT(\"'\"&$B42&\"'!B:B\",TRUE),0),TRUE),\"X\")/K$61)","v":0},{"$f":"IF(K47=0,0,COUNTIF(INDIRECT(\"'\"&$B42&\"'!\"&CHAR(MATCH($D43,INDIRECT(\"'\"&$B42&\"'!6:6\",TRUE),0)+64)&MATCH(K$3,INDIRECT(\"'\"&$B42&\"'!B:B\",TRUE),0)&\":\"&CHAR(MATCH($D43,INDIRECT(\"'\"&$B42&\"'!6:6\",TRUE),0)+64)&MATCH(K$3&\"_slut\",INDIRECT(\"'\"&$B42&\"'!B:B\",TRUE),0),TRUE),\"X\")/SUM(K42:K46))","v":0},{"$f":"IFERROR(COUNTIF(INDIRECT(\"'\"&$B42&\"'!\"&CHAR(MATCH($D43,INDIRECT(\"'\"&$B42&\"'!6:6\",TRUE),0)+64)&MATCH(N$3,INDIRECT(\"'\"&$B42&\"'!B:B\",TRUE),0)&\":\"&CHAR(MATCH($D43,INDIRECT(\"'\"&$B42&\"'!6:6\",TRUE),0)+64)&MATCH(N$3&\"_slut\",INDIRECT(\"'\"&$B42&\"'!B:B\",TRUE),0),TRUE),\"X\"),0)","v":0},{"$f":"IF(N47=0,0,COUNTIF(INDIRECT(\"'\"&$B42&\"'!\"&CHAR(MATCH($D43,INDIRECT(\"'\"&$B42&\"'!6:6\",TRUE),0)+64)&MATCH(N$3,INDIRECT(\"'\"&$B42&\"'!B:B\",TRUE),0)&\":\"&CHAR(MATCH($D43,INDIRECT(\"'\"&$B42&\"'!6:6\",TRUE),0)+64)&MATCH(N$3&\"_slut\",INDIRECT(\"'\"&$B42&\"'!B:B\",TRUE),0),TRUE),\"X\")/N$61)","v":0},{"$f":"IF(N47=0,0,COUNTIF(INDIRECT(\"'\"&$B42&\"'!\"&CHAR(MATCH($D43,INDIRECT(\"'\"&$B42&\"'!6:6\",TRUE),0)+64)&MATCH(N$3,INDIRECT(\"'\"&$B42&\"'!B:B\",TRUE),0)&\":\"&CHAR(MATCH($D43,INDIRECT(\"'\"&$B42&\"'!6:6\",TRUE),0)+64)&MATCH(N$3&\"_slut\",INDIRECT(\"'\"&$B42&\"'!B:B\",TRUE),0),TRUE),\"X\")/SUM(N42:N46))","v":0}]
[null,null,{"$f":"B42","v":"It-beredskab"},"Nej",{"$f":"IFERROR(COUNTIF(INDIRECT(\"'\"&$B42&\"'!\"&CHAR(MATCH($D44,INDIRECT(\"'\"&$B42&\"'!6:6\",TRUE),0)+64)&MATCH(E$3,INDIRECT(\"'\"&$B42&\"'!B:B\",TRUE),0)&\":\"&CHAR(MATCH($D44,INDIRECT(\"'\"&$B42&\"'!6:6\",TRUE),0)+64)&MATCH(E$3&\"_slut\",INDIRECT(\"'\"&$B42&\"'!B:B\",TRUE),0),TRUE),\"X\"),0)","v":0},{"$f":"IF(E47=0,0,COUNTIF(INDIRECT(\"'\"&$B42&\"'!\"&CHAR(MATCH($D44,INDIRECT(\"'\"&$B42&\"'!6:6\",TRUE),0)+64)&MATCH(E$3,INDIRECT(\"'\"&$B42&\"'!B:B\",TRUE),0)&\":\"&CHAR(MATCH($D44,INDIRECT(\"'\"&$B42&\"'!6:6\",TRUE),0)+64)&MATCH(E$3&\"_slut\",INDIRECT(\"'\"&$B42&\"'!B:B\",TRUE),0),TRUE),\"X\")/E$61)","v":0},{"$f":"IF(E47=0,0,COUNTIF(INDIRECT(\"'\"&$B42&\"'!\"&CHAR(MATCH($D44,INDIRECT(\"'\"&$B42&\"'!6:6\",TRUE),0)+64)&MATCH(E$3,INDIRECT(\"'\"&$B42&\"'!B:B\",TRUE),0)&\":\"&CHAR(MATCH($D44,INDIRECT(\"'\"&$B42&\"'!6:6\",TRUE),0)+64)&MATCH(E$3&\"_slut\",INDIRECT(\"'\"&$B42&\"'!B:B\",TRUE),0),TRUE),\"X\")/SUM(E42:E46))","v":0},{"$f":"IFERROR(COUNTIF(INDIRECT(\"'\"&$B42&\"'!\"&CHAR(MATCH($D44,INDIRECT(\"'\"&$B42&\"'!6:6\",TRUE),0)+64)&MATCH(H$3,INDIRECT(\"'\"&$B42&\"'!B:B\",TRUE),0)&\":\"&CHAR(MATCH($D44,INDIRECT(\"'\"&$B42&\"'!6:6\",TRUE),0)+64)&MATCH(H$3&\"_slut\",INDIRECT(\"'\"&$B42&\"'!B:B\",TRUE),0),TRUE),\"X\"),0)","v":0},{"$f":"IF(H47=0,0,COUNTIF(INDIRECT(\"'\"&$B42&\"'!\"&CHAR(MATCH($D44,INDIRECT(\"'\"&$B42&\"'!6:6\",TRUE),0)+64)&MATCH(H$3,INDIRECT(\"'\"&$B42&\"'!B:B\",TRUE),0)&\":\"&CHAR(MATCH($D44,INDIRECT(\"'\"&$B42&\"'!6:6\",TRUE),0)+64)&MATCH(H$3&\"_slut\",INDIRECT(\"'\"&$B42&\"'!B:B\",TRUE),0),TRUE),\"X\")/H$61)","v":0},{"$f":"IF(H47=0,0,COUNTIF(INDIRECT(\"'\"&$B42&\"'!\"&CHAR(MATCH($D44,INDIRECT(\"'\"&$B42&\"'!6:6\",TRUE),0)+64)&MATCH(H$3,INDIRECT(\"'\"&$B42&\"'!B:B\",TRUE),0)&\":\"&CHAR(MATCH($D44,INDIRECT(\"'\"&$B42&\"'!6:6\",TRUE),0)+64)&MATCH(H$3&\"_slut\",INDIRECT(\"'\"&$B42&\"'!B:B\",TRUE),0),TRUE),\"X\")/SUM(H42:H46))","v":0},{"$f":"IFERROR(COUNTIF(INDIRECT(\"'\"&$B42&\"'!\"&CHAR(MATCH($D44,INDIRECT(\"'\"&$B42&\"'!6:6\",TRUE),0)+64)&MATCH(K$3,INDIRECT(\"'\"&$B42&\"'!B:B\",TRUE),0)&\":\"&CHAR(MATCH($D44,INDIRECT(\"'\"&$B42&\"'!6:6\",TRUE),0)+64)&MATCH(K$3&\"_slut\",INDIRECT(\"'\"&$B42&\"'!B:B\",TRUE),0),TRUE),\"X\"),0)","v":0},{"$f":"IF(K47=0,0,COUNTIF(INDIRECT(\"'\"&$B42&\"'!\"&CHAR(MATCH($D44,INDIRECT(\"'\"&$B42&\"'!6:6\",TRUE),0)+64)&MATCH(K$3,INDIRECT(\"'\"&$B42&\"'!B:B\",TRUE),0)&\":\"&CHAR(MATCH($D44,INDIRECT(\"'\"&$B42&\"'!6:6\",TRUE),0)+64)&MATCH(K$3&\"_slut\",INDIRECT(\"'\"&$B42&\"'!B:B\",TRUE),0),TRUE),\"X\")/K$61)","v":0},{"$f":"IF(K47=0,0,COUNTIF(INDIRECT(\"'\"&$B42&\"'!\"&CHAR(MATCH($D44,INDIRECT(\"'\"&$B42&\"'!6:6\",TRUE),0)+64)&MATCH(K$3,INDIRECT(\"'\"&$B42&\"'!B:B\",TRUE),0)&\":\"&CHAR(MATCH($D44,INDIRECT(\"'\"&$B42&\"'!6:6\",TRUE),0)+64)&MATCH(K$3&\"_slut\",INDIRECT(\"'\"&$B42&\"'!B:B\",TRUE),0),TRUE),\"X\")/SUM(K42:K46))","v":0},{"$f":"IFERROR(COUNTIF(INDIRECT(\"'\"&$B42&\"'!\"&CHAR(MATCH($D44,INDIRECT(\"'\"&$B42&\"'!6:6\",TRUE),0)+64)&MATCH(N$3,INDIRECT(\"'\"&$B42&\"'!B:B\",TRUE),0)&\":\"&CHAR(MATCH($D44,INDIRECT(\"'\"&$B42&\"'!6:6\",TRUE),0)+64)&MATCH(N$3&\"_slut\",INDIRECT(\"'\"&$B42&\"'!B:B\",TRUE),0),TRUE),\"X\"),0)","v":0},{"$f":"IF(N47=0,0,COUNTIF(INDIRECT(\"'\"&$B42&\"'!\"&CHAR(MATCH($D44,INDIRECT(\"'\"&$B42&\"'!6:6\",TRUE),0)+64)&MATCH(N$3,INDIRECT(\"'\"&$B42&\"'!B:B\",TRUE),0)&\":\"&CHAR(MATCH($D44,INDIRECT(\"'\"&$B42&\"'!6:6\",TRUE),0)+64)&MATCH(N$3&\"_slut\",INDIRECT(\"'\"&$B42&\"'!B:B\",TRUE),0),TRUE),\"X\")/N$61)","v":0},{"$f":"IF(N47=0,0,COUNTIF(INDIRECT(\"'\"&$B42&\"'!\"&CHAR(MATCH($D44,INDIRECT(\"'\"&$B42&\"'!6:6\",TRUE),0)+64)&MATCH(N$3,INDIRECT(\"'\"&$B42&\"'!B:B\",TRUE),0)&\":\"&CHAR(MATCH($D44,INDIRECT(\"'\"&$B42&\"'!6:6\",TRUE),0)+64)&MATCH(N$3&\"_slut\",INDIRECT(\"'\"&$B42&\"'!B:B\",TRUE),0),TRUE),\"X\")/SUM(N42:N46))","v":0}]
[null,null,{"$f":"B42","v":"It-beredskab"},"Ikke relevant",{"$f":"IFERROR(COUNTIF(INDIRECT(\"'\"&$B42&\"'!\"&CHAR(MATCH($D45,INDIRECT(\"'\"&$B42&\"'!6:6\",TRUE),0)+64)&MATCH(E$3,INDIRECT(\"'\"&$B42&\"'!B:B\",TRUE),0)&\":\"&CHAR(MATCH($D45,INDIRECT(\"'\"&$B42&\"'!6:6\",TRUE),0)+64)&MATCH(E$3&\"_slut\",INDIRECT(\"'\"&$B42&\"'!B:B\",TRUE),0),TRUE),\"X\"),0)","v":0},{"$f":"IF(E47=0,0,COUNTIF(INDIRECT(\"'\"&$B42&\"'!\"&CHAR(MATCH($D45,INDIRECT(\"'\"&$B42&\"'!6:6\",TRUE),0)+64)&MATCH(E$3,INDIRECT(\"'\"&$B42&\"'!B:B\",TRUE),0)&\":\"&CHAR(MATCH($D45,INDIRECT(\"'\"&$B42&\"'!6:6\",TRUE),0)+64)&MATCH(E$3&\"_slut\",INDIRECT(\"'\"&$B42&\"'!B:B\",TRUE),0),TRUE),\"X\")/E$61)","v":0},{"$f":"IF(E47=0,0,COUNTIF(INDIRECT(\"'\"&$B42&\"'!\"&CHAR(MATCH($D45,INDIRECT(\"'\"&$B42&\"'!6:6\",TRUE),0)+64)&MATCH(E$3,INDIRECT(\"'\"&$B42&\"'!B:B\",TRUE),0)&\":\"&CHAR(MATCH($D45,INDIRECT(\"'\"&$B42&\"'!6:6\",TRUE),0)+64)&MATCH(E$3&\"_slut\",INDIRECT(\"'\"&$B42&\"'!B:B\",TRUE),0),TRUE),\"X\")/SUM(E42:E46))","v":0},{"$f":"IFERROR(COUNTIF(INDIRECT(\"'\"&$B42&\"'!\"&CHAR(MATCH($D45,INDIRECT(\"'\"&$B42&\"'!6:6\",TRUE),0)+64)&MATCH(H$3,INDIRECT(\"'\"&$B42&\"'!B:B\",TRUE),0)&\":\"&CHAR(MATCH($D45,INDIRECT(\"'\"&$B42&\"'!6:6\",TRUE),0)+64)&MATCH(H$3&\"_slut\",INDIRECT(\"'\"&$B42&\"'!B:B\",TRUE),0),TRUE),\"X\"),0)","v":0},{"$f":"IF(H47=0,0,COUNTIF(INDIRECT(\"'\"&$B42&\"'!\"&CHAR(MATCH($D45,INDIRECT(\"'\"&$B42&\"'!6:6\",TRUE),0)+64)&MATCH(H$3,INDIRECT(\"'\"&$B42&\"'!B:B\",TRUE),0)&\":\"&CHAR(MATCH($D45,INDIRECT(\"'\"&$B42&\"'!6:6\",TRUE),0)+64)&MATCH(H$3&\"_slut\",INDIRECT(\"'\"&$B42&\"'!B:B\",TRUE),0),TRUE),\"X\")/H$61)","v":0},{"$f":"IF(H47=0,0,COUNTIF(INDIRECT(\"'\"&$B42&\"'!\"&CHAR(MATCH($D45,INDIRECT(\"'\"&$B42&\"'!6:6\",TRUE),0)+64)&MATCH(H$3,INDIRECT(\"'\"&$B42&\"'!B:B\",TRUE),0)&\":\"&CHAR(MATCH($D45,INDIRECT(\"'\"&$B42&\"'!6:6\",TRUE),0)+64)&MATCH(H$3&\"_slut\",INDIRECT(\"'\"&$B42&\"'!B:B\",TRUE),0),TRUE),\"X\")/SUM(H42:H46))","v":0},{"$f":"IFERROR(COUNTIF(INDIRECT(\"'\"&$B42&\"'!\"&CHAR(MATCH($D45,INDIRECT(\"'\"&$B42&\"'!6:6\",TRUE),0)+64)&MATCH(K$3,INDIRECT(\"'\"&$B42&\"'!B:B\",TRUE),0)&\":\"&CHAR(MATCH($D45,INDIRECT(\"'\"&$B42&\"'!6:6\",TRUE),0)+64)&MATCH(K$3&\"_slut\",INDIRECT(\"'\"&$B42&\"'!B:B\",TRUE),0),TRUE),\"X\"),0)","v":0},{"$f":"IF(K47=0,0,COUNTIF(INDIRECT(\"'\"&$B42&\"'!\"&CHAR(MATCH($D45,INDIRECT(\"'\"&$B42&\"'!6:6\",TRUE),0)+64)&MATCH(K$3,INDIRECT(\"'\"&$B42&\"'!B:B\",TRUE),0)&\":\"&CHAR(MATCH($D45,INDIRECT(\"'\"&$B42&\"'!6:6\",TRUE),0)+64)&MATCH(K$3&\"_slut\",INDIRECT(\"'\"&$B42&\"'!B:B\",TRUE),0),TRUE),\"X\")/K$61)","v":0},{"$f":"IF(K47=0,0,COUNTIF(INDIRECT(\"'\"&$B42&\"'!\"&CHAR(MATCH($D45,INDIRECT(\"'\"&$B42&\"'!6:6\",TRUE),0)+64)&MATCH(K$3,INDIRECT(\"'\"&$B42&\"'!B:B\",TRUE),0)&\":\"&CHAR(MATCH($D45,INDIRECT(\"'\"&$B42&\"'!6:6\",TRUE),0)+64)&MATCH(K$3&\"_slut\",INDIRECT(\"'\"&$B42&\"'!B:B\",TRUE),0),TRUE),\"X\")/SUM(K42:K46))","v":0},{"$f":"IFERROR(COUNTIF(INDIRECT(\"'\"&$B42&\"'!\"&CHAR(MATCH($D45,INDIRECT(\"'\"&$B42&\"'!6:6\",TRUE),0)+64)&MATCH(N$3,INDIRECT(\"'\"&$B42&\"'!B:B\",TRUE),0)&\":\"&CHAR(MATCH($D45,INDIRECT(\"'\"&$B42&\"'!6:6\",TRUE),0)+64)&MATCH(N$3&\"_slut\",INDIRECT(\"'\"&$B42&\"'!B:B\",TRUE),0),TRUE),\"X\"),0)","v":0},{"$f":"IF(N47=0,0,COUNTIF(INDIRECT(\"'\"&$B42&\"'!\"&CHAR(MATCH($D45,INDIRECT(\"'\"&$B42&\"'!6:6\",TRUE),0)+64)&MATCH(N$3,INDIRECT(\"'\"&$B42&\"'!B:B\",TRUE),0)&\":\"&CHAR(MATCH($D45,INDIRECT(\"'\"&$B42&\"'!6:6\",TRUE),0)+64)&MATCH(N$3&\"_slut\",INDIRECT(\"'\"&$B42&\"'!B:B\",TRUE),0),TRUE),\"X\")/N$61)","v":0},{"$f":"IF(N47=0,0,COUNTIF(INDIRECT(\"'\"&$B42&\"'!\"&CHAR(MATCH($D45,INDIRECT(\"'\"&$B42&\"'!6:6\",TRUE),0)+64)&MATCH(N$3,INDIRECT(\"'\"&$B42&\"'!B:B\",TRUE),0)&\":\"&CHAR(MATCH($D45,INDIRECT(\"'\"&$B42&\"'!6:6\",TRUE),0)+64)&MATCH(N$3&\"_slut\",INDIRECT(\"'\"&$B42&\"'!B:B\",TRUE),0),TRUE),\"X\")/SUM(N42:N46))","v":0}]
[null,null,{"$f":"B42","v":"It-beredskab"},"Ikke sat",{"$f":"IF(ISERROR(MATCH(E$3,INDIRECT(\"'\"&$B42&\"'!B:B\",TRUE),0)),0,COUNTA(INDIRECT(\"'\"&$B42&\"'!E\"&MATCH(E$3,INDIRECT(\"'\"&$B42&\"'!B:B\",TRUE),0)&\":E\"&MATCH(E$3&\"_slut\",INDIRECT(\"'\"&$B42&\"'!B:B\",TRUE),0),TRUE))-E42-E43-E44-E45)","v":8},{"$f":"IF(E47=0,0,E47/E$61-F42-F43-F44-F45)","v":0.25806451612903225},{"$f":"IF(E47=0,0,1-G42-G43-G44-G45)","v":1},{"$f":"IF(ISERROR(MATCH(H$3,INDIRECT(\"'\"&$B42&\"'!B:B\",TRUE),0)),0,COUNTA(INDIRECT(\"'\"&$B42&\"'!E\"&MATCH(H$3,INDIRECT(\"'\"&$B42&\"'!B:B\",TRUE),0)&\":E\"&MATCH(H$3&\"_slut\",INDIRECT(\"'\"&$B42&\"'!B:B\",TRUE),0),TRUE))-H42-H43-H44-H45)","v":4},{"$f":"IF(H47=0,0,H47/H$61-I42-I43-I44-I45)","v":0.1111111111111111},{"$f":"IF(H47=0,0,1-J42-J43-J44-J45)","v":1},{"$f":"IF(ISERROR(MATCH(K$3,INDIRECT(\"'\"&$B42&\"'!B:B\",TRUE),0)),0,COUNTA(INDIRECT(\"'\"&$B42&\"'!E\"&MATCH(K$3,INDIRECT(\"'\"&$B42&\"'!B:B\",TRUE),0)&\":E\"&MATCH(K$3&\"_slut\",INDIRECT(\"'\"&$B42&\"'!B:B\",TRUE),0),TRUE))-K42-K43-K44-K45)","v":2},{"$f":"IF(K47=0,0,K47/K$61-L42-L43-L44-L45)","v":7.407407407407407E-2},{"$f":"IF(K47=0,0,1-M42-M43-M44-M45)","v":1},{"$f":"IF(ISERROR(MATCH(N$3,INDIRECT(\"'\"&$B42&\"'!B:B\",TRUE),0)),0,COUNTA(INDIRECT(\"'\"&$B42&\"'!E\"&MATCH(N$3,INDIRECT(\"'\"&$B42&\"'!B:B\",TRUE),0)&\":E\"&MATCH(N$3&\"_slut\",INDIRECT(\"'\"&$B42&\"'!B:B\",TRUE),0),TRUE))-N42-N43-N44-N45)","v":2},{"$f":"IF(N47=0,0,N47/N$61-O42-O43-O44-O45)","v":0.125},{"$f":"IF(N47=0,0,1-P42-P43-P44-P45)","v":1}]
[null,null,{"$f":"B42","v":"It-beredskab"},"TOTAL",{"$f":"SUM(E42:E46)","v":8},{"$f":"SUM(F42:F45)","v":0},{"$f":"SUM(G42:G45)","v":0},{"$f":"SUM(H42:H46)","v":4},{"$f":"SUM(I42:I45)","v":0},0,{"$f":"SUM(K42:K46)","v":2},{"$f":"SUM(L42:L45)","v":0},0,{"$f":"SUM(N42:N46)","v":2},{"$f":"SUM(O42:O45)","v":0},0]
[null,"Måling",{"$f":"B48","v":"Måling"},"Ja",{"$f":"IFERROR(COUNTIF(INDIRECT(\"'\"&$B48&\"'!\"&CHAR(MATCH($D48,INDIRECT(\"'\"&$B48&\"'!6:6\",TRUE),0)+64)&MATCH(E$3,INDIRECT(\"'\"&$B48&\"'!B:B\",TRUE),0)&\":\"&CHAR(MATCH($D48,INDIRECT(\"'\"&$B48&\"'!6:6\",TRUE),0)+64)&MATCH(E$3&\"_slut\",INDIRECT(\"'\"&$B48&\"'!B:B\",TRUE),0),TRUE),\"X\"),0)","v":0},{"$f":"IF(E53=0,0,COUNTIF(INDIRECT(\"'\"&$B48&\"'!\"&CHAR(MATCH($D48,INDIRECT(\"'\"&$B48&\"'!6:6\",TRUE),0)+64)&MATCH(E$3,INDIRECT(\"'\"&$B48&\"'!B:B\",TRUE),0)&\":\"&CHAR(MATCH($D48,INDIRECT(\"'\"&$B48&\"'!6:6\",TRUE),0)+64)&MATCH(E$3&\"_slut\",INDIRECT(\"'\"&$B48&\"'!B:B\",TRUE),0),TRUE),\"X\")/E$61)","v":0},{"$f":"IF(E53=0,0,COUNTIF(INDIRECT(\"'\"&$B48&\"'!\"&CHAR(MATCH($D48,INDIRECT(\"'\"&$B48&\"'!6:6\",TRUE),0)+64)&MATCH(E$3,INDIRECT(\"'\"&$B48&\"'!B:B\",TRUE),0)&\":\"&CHAR(MATCH($D48,INDIRECT(\"'\"&$B48&\"'!6:6\",TRUE),0)+64)&MATCH(E$3&\"_slut\",INDIRECT(\"'\"&$B48&\"'!B:B\",TRUE),0),TRUE),\"X\")/SUM(E48:E52))","v":0},{"$f":"IFERROR(COUNTIF(INDIRECT(\"'\"&$B48&\"'!\"&CHAR(MATCH($D48,INDIRECT(\"'\"&$B48&\"'!6:6\",TRUE),0)+64)&MATCH(H$3,INDIRECT(\"'\"&$B48&\"'!B:B\",TRUE),0)&\":\"&CHAR(MATCH($D48,INDIRECT(\"'\"&$B48&\"'!6:6\",TRUE),0)+64)&MATCH(H$3&\"_slut\",INDIRECT(\"'\"&$B48&\"'!B:B\",TRUE),0),TRUE),\"X\"),0)","v":0},{"$f":"IF(H53=0,0,COUNTIF(INDIRECT(\"'\"&$B48&\"'!\"&CHAR(MATCH($D48,INDIRECT(\"'\"&$B48&\"'!6:6\",TRUE),0)+64)&MATCH(H$3,INDIRECT(\"'\"&$B48&\"'!B:B\",TRUE),0)&\":\"&CHAR(MATCH($D48,INDIRECT(\"'\"&$B48&\"'!6:6\",TRUE),0)+64)&MATCH(H$3&\"_slut\",INDIRECT(\"'\"&$B48&\"'!B:B\",TRUE),0),TRUE),\"X\")/H$61)","v":0},{"$f":"IF(H53=0,0,COUNTIF(INDIRECT(\"'\"&$B48&\"'!\"&CHAR(MATCH($D48,INDIRECT(\"'\"&$B48&\"'!6:6\",TRUE),0)+64)&MATCH(H$3,INDIRECT(\"'\"&$B48&\"'!B:B\",TRUE),0)&\":\"&CHAR(MATCH($D48,INDIRECT(\"'\"&$B48&\"'!6:6\",TRUE),0)+64)&MATCH(H$3&\"_slut\",INDIRECT(\"'\"&$B48&\"'!B:B\",TRUE),0),TRUE),\"X\")/SUM(H48:H52))","v":0},{"$f":"IFERROR(COUNTIF(INDIRECT(\"'\"&$B48&\"'!\"&CHAR(MATCH($D48,INDIRECT(\"'\"&$B48&\"'!6:6\",TRUE),0)+64)&MATCH(K$3,INDIRECT(\"'\"&$B48&\"'!B:B\",TRUE),0)&\":\"&CHAR(MATCH($D48,INDIRECT(\"'\"&$B48&\"'!6:6\",TRUE),0)+64)&MATCH(K$3&\"_slut\",INDIRECT(\"'\"&$B48&\"'!B:B\",TRUE),0),TRUE),\"X\"),0)","v":0},{"$f":"IF(K53=0,0,COUNTIF(INDIRECT(\"'\"&$B48&\"'!\"&CHAR(MATCH($D48,INDIRECT(\"'\"&$B48&\"'!6:6\",TRUE),0)+64)&MATCH(K$3,INDIRECT(\"'\"&$B48&\"'!B:B\",TRUE),0)&\":\"&CHAR(MATCH($D48,INDIRECT(\"'\"&$B48&\"'!6:6\",TRUE),0)+64)&MATCH(K$3&\"_slut\",INDIRECT(\"'\"&$B48&\"'!B:B\",TRUE),0),TRUE),\"X\")/K$61)","v":0},{"$f":"IF(K53=0,0,COUNTIF(INDIRECT(\"'\"&$B48&\"'!\"&CHAR(MATCH($D48,INDIRECT(\"'\"&$B48&\"'!6:6\",TRUE),0)+64)&MATCH(K$3,INDIRECT(\"'\"&$B48&\"'!B:B\",TRUE),0)&\":\"&CHAR(MATCH($D48,INDIRECT(\"'\"&$B48&\"'!6:6\",TRUE),0)+64)&MATCH(K$3&\"_slut\",INDIRECT(\"'\"&$B48&\"'!B:B\",TRUE),0),TRUE),\"X\")/SUM(K48:K52))","v":0},{"$f":"IFERROR(COUNTIF(INDIRECT(\"'\"&$B48&\"'!\"&CHAR(MATCH($D48,INDIRECT(\"'\"&$B48&\"'!6:6\",TRUE),0)+64)&MATCH(N$3,INDIRECT(\"'\"&$B48&\"'!B:B\",TRUE),0)&\":\"&CHAR(MATCH($D48,INDIRECT(\"'\"&$B48&\"'!6:6\",TRUE),0)+64)&MATCH(N$3&\"_slut\",INDIRECT(\"'\"&$B48&\"'!B:B\",TRUE),0),TRUE),\"X\"),0)","v":0},{"$f":"IF(N53=0,0,COUNTIF(INDIRECT(\"'\"&$B48&\"'!\"&CHAR(MATCH($D48,INDIRECT(\"'\"&$B48&\"'!6:6\",TRUE),0)+64)&MATCH(N$3,INDIRECT(\"'\"&$B48&\"'!B:B\",TRUE),0)&\":\"&CHAR(MATCH($D48,INDIRECT(\"'\"&$B48&\"'!6:6\",TRUE),0)+64)&MATCH(N$3&\"_slut\",INDIRECT(\"'\"&$B48&\"'!B:B\",TRUE),0),TRUE),\"X\")/N$61)","v":0},{"$f":"IF(N53=0,0,COUNTIF(INDIRECT(\"'\"&$B48&\"'!\"&CHAR(MATCH($D48,INDIRECT(\"'\"&$B48&\"'!6:6\",TRUE),0)+64)&MATCH(N$3,INDIRECT(\"'\"&$B48&\"'!B:B\",TRUE),0)&\":\"&CHAR(MATCH($D48,INDIRECT(\"'\"&$B48&\"'!6:6\",TRUE),0)+64)&MATCH(N$3&\"_slut\",INDIRECT(\"'\"&$B48&\"'!B:B\",TRUE),0),TRUE),\"X\")/SUM(N48:N52))","v":0}]
[null,null,{"$f":"B48","v":"Måling"},"Delvist",{"$f":"IFERROR(COUNTIF(INDIRECT(\"'\"&$B48&\"'!\"&CHAR(MATCH($D49,INDIRECT(\"'\"&$B48&\"'!6:6\",TRUE),0)+64)&MATCH(E$3,INDIRECT(\"'\"&$B48&\"'!B:B\",TRUE),0)&\":\"&CHAR(MATCH($D49,INDIRECT(\"'\"&$B48&\"'!6:6\",TRUE),0)+64)&MATCH(E$3&\"_slut\",INDIRECT(\"'\"&$B48&\"'!B:B\",TRUE),0),TRUE),\"X\"),0)","v":0},{"$f":"IF(E53=0,0,COUNTIF(INDIRECT(\"'\"&$B48&\"'!\"&CHAR(MATCH($D49,INDIRECT(\"'\"&$B48&\"'!6:6\",TRUE),0)+64)&MATCH(E$3,INDIRECT(\"'\"&$B48&\"'!B:B\",TRUE),0)&\":\"&CHAR(MATCH($D49,INDIRECT(\"'\"&$B48&\"'!6:6\",TRUE),0)+64)&MATCH(E$3&\"_slut\",INDIRECT(\"'\"&$B48&\"'!B:B\",TRUE),0),TRUE),\"X\")/E$61)","v":0},{"$f":"IF(E53=0,0,COUNTIF(INDIRECT(\"'\"&$B48&\"'!\"&CHAR(MATCH($D49,INDIRECT(\"'\"&$B48&\"'!6:6\",TRUE),0)+64)&MATCH(E$3,INDIRECT(\"'\"&$B48&\"'!B:B\",TRUE),0)&\":\"&CHAR(MATCH($D49,INDIRECT(\"'\"&$B48&\"'!6:6\",TRUE),0)+64)&MATCH(E$3&\"_slut\",INDIRECT(\"'\"&$B48&\"'!B:B\",TRUE),0),TRUE),\"X\")/SUM(E48:E52))","v":0},{"$f":"IFERROR(COUNTIF(INDIRECT(\"'\"&$B48&\"'!\"&CHAR(MATCH($D49,INDIRECT(\"'\"&$B48&\"'!6:6\",TRUE),0)+64)&MATCH(H$3,INDIRECT(\"'\"&$B48&\"'!B:B\",TRUE),0)&\":\"&CHAR(MATCH($D49,INDIRECT(\"'\"&$B48&\"'!6:6\",TRUE),0)+64)&MATCH(H$3&\"_slut\",INDIRECT(\"'\"&$B48&\"'!B:B\",TRUE),0),TRUE),\"X\"),0)","v":0},{"$f":"IF(H53=0,0,COUNTIF(INDIRECT(\"'\"&$B48&\"'!\"&CHAR(MATCH($D49,INDIRECT(\"'\"&$B48&\"'!6:6\",TRUE),0)+64)&MATCH(H$3,INDIRECT(\"'\"&$B48&\"'!B:B\",TRUE),0)&\":\"&CHAR(MATCH($D49,INDIRECT(\"'\"&$B48&\"'!6:6\",TRUE),0)+64)&MATCH(H$3&\"_slut\",INDIRECT(\"'\"&$B48&\"'!B:B\",TRUE),0),TRUE),\"X\")/H$61)","v":0},{"$f":"IF(H53=0,0,COUNTIF(INDIRECT(\"'\"&$B48&\"'!\"&CHAR(MATCH($D49,INDIRECT(\"'\"&$B48&\"'!6:6\",TRUE),0)+64)&MATCH(H$3,INDIRECT(\"'\"&$B48&\"'!B:B\",TRUE),0)&\":\"&CHAR(MATCH($D49,INDIRECT(\"'\"&$B48&\"'!6:6\",TRUE),0)+64)&MATCH(H$3&\"_slut\",INDIRECT(\"'\"&$B48&\"'!B:B\",TRUE),0),TRUE),\"X\")/SUM(H48:H52))","v":0},{"$f":"IFERROR(COUNTIF(INDIRECT(\"'\"&$B48&\"'!\"&CHAR(MATCH($D49,INDIRECT(\"'\"&$B48&\"'!6:6\",TRUE),0)+64)&MATCH(K$3,INDIRECT(\"'\"&$B48&\"'!B:B\",TRUE),0)&\":\"&CHAR(MATCH($D49,INDIRECT(\"'\"&$B48&\"'!6:6\",TRUE),0)+64)&MATCH(K$3&\"_slut\",INDIRECT(\"'\"&$B48&\"'!B:B\",TRUE),0),TRUE),\"X\"),0)","v":0},{"$f":"IF(K53=0,0,COUNTIF(INDIRECT(\"'\"&$B48&\"'!\"&CHAR(MATCH($D49,INDIRECT(\"'\"&$B48&\"'!6:6\",TRUE),0)+64)&MATCH(K$3,INDIRECT(\"'\"&$B48&\"'!B:B\",TRUE),0)&\":\"&CHAR(MATCH($D49,INDIRECT(\"'\"&$B48&\"'!6:6\",TRUE),0)+64)&MATCH(K$3&\"_slut\",INDIRECT(\"'\"&$B48&\"'!B:B\",TRUE),0),TRUE),\"X\")/K$61)","v":0},{"$f":"IF(K53=0,0,COUNTIF(INDIRECT(\"'\"&$B48&\"'!\"&CHAR(MATCH($D49,INDIRECT(\"'\"&$B48&\"'!6:6\",TRUE),0)+64)&MATCH(K$3,INDIRECT(\"'\"&$B48&\"'!B:B\",TRUE),0)&\":\"&CHAR(MATCH($D49,INDIRECT(\"'\"&$B48&\"'!6:6\",TRUE),0)+64)&MATCH(K$3&\"_slut\",INDIRECT(\"'\"&$B48&\"'!B:B\",TRUE),0),TRUE),\"X\")/SUM(K48:K52))","v":0},{"$f":"IFERROR(COUNTIF(INDIRECT(\"'\"&$B48&\"'!\"&CHAR(MATCH($D49,INDIRECT(\"'\"&$B48&\"'!6:6\",TRUE),0)+64)&MATCH(N$3,INDIRECT(\"'\"&$B48&\"'!B:B\",TRUE),0)&\":\"&CHAR(MATCH($D49,INDIRECT(\"'\"&$B48&\"'!6:6\",TRUE),0)+64)&MATCH(N$3&\"_slut\",INDIRECT(\"'\"&$B48&\"'!B:B\",TRUE),0),TRUE),\"X\"),0)","v":0},{"$f":"IF(N53=0,0,COUNTIF(INDIRECT(\"'\"&$B48&\"'!\"&CHAR(MATCH($D49,INDIRECT(\"'\"&$B48&\"'!6:6\",TRUE),0)+64)&MATCH(N$3,INDIRECT(\"'\"&$B48&\"'!B:B\",TRUE),0)&\":\"&CHAR(MATCH($D49,INDIRECT(\"'\"&$B48&\"'!6:6\",TRUE),0)+64)&MATCH(N$3&\"_slut\",INDIRECT(\"'\"&$B48&\"'!B:B\",TRUE),0),TRUE),\"X\")/N$61)","v":0},{"$f":"IF(N53=0,0,COUNTIF(INDIRECT(\"'\"&$B48&\"'!\"&CHAR(MATCH($D49,INDIRECT(\"'\"&$B48&\"'!6:6\",TRUE),0)+64)&MATCH(N$3,INDIRECT(\"'\"&$B48&\"'!B:B\",TRUE),0)&\":\"&CHAR(MATCH($D49,INDIRECT(\"'\"&$B48&\"'!6:6\",TRUE),0)+64)&MATCH(N$3&\"_slut\",INDIRECT(\"'\"&$B48&\"'!B:B\",TRUE),0),TRUE),\"X\")/SUM(N48:N52))","v":0}]
[null,null,{"$f":"B48","v":"Måling"},"Nej",{"$f":"IFERROR(COUNTIF(INDIRECT(\"'\"&$B48&\"'!\"&CHAR(MATCH($D50,INDIRECT(\"'\"&$B48&\"'!6:6\",TRUE),0)+64)&MATCH(E$3,INDIRECT(\"'\"&$B48&\"'!B:B\",TRUE),0)&\":\"&CHAR(MATCH($D50,INDIRECT(\"'\"&$B48&\"'!6:6\",TRUE),0)+64)&MATCH(E$3&\"_slut\",INDIRECT(\"'\"&$B48&\"'!B:B\",TRUE),0),TRUE),\"X\"),0)","v":0},{"$f":"IF(E53=0,0,COUNTIF(INDIRECT(\"'\"&$B48&\"'!\"&CHAR(MATCH($D50,INDIRECT(\"'\"&$B48&\"'!6:6\",TRUE),0)+64)&MATCH(E$3,INDIRECT(\"'\"&$B48&\"'!B:B\",TRUE),0)&\":\"&CHAR(MATCH($D50,INDIRECT(\"'\"&$B48&\"'!6:6\",TRUE),0)+64)&MATCH(E$3&\"_slut\",INDIRECT(\"'\"&$B48&\"'!B:B\",TRUE),0),TRUE),\"X\")/E$61)","v":0},{"$f":"IF(E53=0,0,COUNTIF(INDIRECT(\"'\"&$B48&\"'!\"&CHAR(MATCH($D50,INDIRECT(\"'\"&$B48&\"'!6:6\",TRUE),0)+64)&MATCH(E$3,INDIRECT(\"'\"&$B48&\"'!B:B\",TRUE),0)&\":\"&CHAR(MATCH($D50,INDIRECT(\"'\"&$B48&\"'!6:6\",TRUE),0)+64)&MATCH(E$3&\"_slut\",INDIRECT(\"'\"&$B48&\"'!B:B\",TRUE),0),TRUE),\"X\")/SUM(E48:E52))","v":0},{"$f":"IFERROR(COUNTIF(INDIRECT(\"'\"&$B48&\"'!\"&CHAR(MATCH($D50,INDIRECT(\"'\"&$B48&\"'!6:6\",TRUE),0)+64)&MATCH(H$3,INDIRECT(\"'\"&$B48&\"'!B:B\",TRUE),0)&\":\"&CHAR(MATCH($D50,INDIRECT(\"'\"&$B48&\"'!6:6\",TRUE),0)+64)&MATCH(H$3&\"_slut\",INDIRECT(\"'\"&$B48&\"'!B:B\",TRUE),0),TRUE),\"X\"),0)","v":0},{"$f":"IF(H53=0,0,COUNTIF(INDIRECT(\"'\"&$B48&\"'!\"&CHAR(MATCH($D50,INDIRECT(\"'\"&$B48&\"'!6:6\",TRUE),0)+64)&MATCH(H$3,INDIRECT(\"'\"&$B48&\"'!B:B\",TRUE),0)&\":\"&CHAR(MATCH($D50,INDIRECT(\"'\"&$B48&\"'!6:6\",TRUE),0)+64)&MATCH(H$3&\"_slut\",INDIRECT(\"'\"&$B48&\"'!B:B\",TRUE),0),TRUE),\"X\")/H$61)","v":0},{"$f":"IF(H53=0,0,COUNTIF(INDIRECT(\"'\"&$B48&\"'!\"&CHAR(MATCH($D50,INDIRECT(\"'\"&$B48&\"'!6:6\",TRUE),0)+64)&MATCH(H$3,INDIRECT(\"'\"&$B48&\"'!B:B\",TRUE),0)&\":\"&CHAR(MATCH($D50,INDIRECT(\"'\"&$B48&\"'!6:6\",TRUE),0)+64)&MATCH(H$3&\"_slut\",INDIRECT(\"'\"&$B48&\"'!B:B\",TRUE),0),TRUE),\"X\")/SUM(H48:H52))","v":0},{"$f":"IFERROR(COUNTIF(INDIRECT(\"'\"&$B48&\"'!\"&CHAR(MATCH($D50,INDIRECT(\"'\"&$B48&\"'!6:6\",TRUE),0)+64)&MATCH(K$3,INDIRECT(\"'\"&$B48&\"'!B:B\",TRUE),0)&\":\"&CHAR(MATCH($D50,INDIRECT(\"'\"&$B48&\"'!6:6\",TRUE),0)+64)&MATCH(K$3&\"_slut\",INDIRECT(\"'\"&$B48&\"'!B:B\",TRUE),0),TRUE),\"X\"),0)","v":0},{"$f":"IF(K53=0,0,COUNTIF(INDIRECT(\"'\"&$B48&\"'!\"&CHAR(MATCH($D50,INDIRECT(\"'\"&$B48&\"'!6:6\",TRUE),0)+64)&MATCH(K$3,INDIRECT(\"'\"&$B48&\"'!B:B\",TRUE),0)&\":\"&CHAR(MATCH($D50,INDIRECT(\"'\"&$B48&\"'!6:6\",TRUE),0)+64)&MATCH(K$3&\"_slut\",INDIRECT(\"'\"&$B48&\"'!B:B\",TRUE),0),TRUE),\"X\")/K$61)","v":0},{"$f":"IF(K53=0,0,COUNTIF(INDIRECT(\"'\"&$B48&\"'!\"&CHAR(MATCH($D50,INDIRECT(\"'\"&$B48&\"'!6:6\",TRUE),0)+64)&MATCH(K$3,INDIRECT(\"'\"&$B48&\"'!B:B\",TRUE),0)&\":\"&CHAR(MATCH($D50,INDIRECT(\"'\"&$B48&\"'!6:6\",TRUE),0)+64)&MATCH(K$3&\"_slut\",INDIRECT(\"'\"&$B48&\"'!B:B\",TRUE),0),TRUE),\"X\")/SUM(K48:K52))","v":0},{"$f":"IFERROR(COUNTIF(INDIRECT(\"'\"&$B48&\"'!\"&CHAR(MATCH($D50,INDIRECT(\"'\"&$B48&\"'!6:6\",TRUE),0)+64)&MATCH(N$3,INDIRECT(\"'\"&$B48&\"'!B:B\",TRUE),0)&\":\"&CHAR(MATCH($D50,INDIRECT(\"'\"&$B48&\"'!6:6\",TRUE),0)+64)&MATCH(N$3&\"_slut\",INDIRECT(\"'\"&$B48&\"'!B:B\",TRUE),0),TRUE),\"X\"),0)","v":0},{"$f":"IF(N53=0,0,COUNTIF(INDIRECT(\"'\"&$B48&\"'!\"&CHAR(MATCH($D50,INDIRECT(\"'\"&$B48&\"'!6:6\",TRUE),0)+64)&MATCH(N$3,INDIRECT(\"'\"&$B48&\"'!B:B\",TRUE),0)&\":\"&CHAR(MATCH($D50,INDIRECT(\"'\"&$B48&\"'!6:6\",TRUE),0)+64)&MATCH(N$3&\"_slut\",INDIRECT(\"'\"&$B48&\"'!B:B\",TRUE),0),TRUE),\"X\")/N$61)","v":0},{"$f":"IF(N53=0,0,COUNTIF(INDIRECT(\"'\"&$B48&\"'!\"&CHAR(MATCH($D50,INDIRECT(\"'\"&$B48&\"'!6:6\",TRUE),0)+64)&MATCH(N$3,INDIRECT(\"'\"&$B48&\"'!B:B\",TRUE),0)&\":\"&CHAR(MATCH($D50,INDIRECT(\"'\"&$B48&\"'!6:6\",TRUE),0)+64)&MATCH(N$3&\"_slut\",INDIRECT(\"'\"&$B48&\"'!B:B\",TRUE),0),TRUE),\"X\")/SUM(N48:N52))","v":0}]
[null,null,{"$f":"B48","v":"Måling"},"Ikke relevant",{"$f":"IFERROR(COUNTIF(INDIRECT(\"'\"&$B48&\"'!\"&CHAR(MATCH($D51,INDIRECT(\"'\"&$B48&\"'!6:6\",TRUE),0)+64)&MATCH(E$3,INDIRECT(\"'\"&$B48&\"'!B:B\",TRUE),0)&\":\"&CHAR(MATCH($D51,INDIRECT(\"'\"&$B48&\"'!6:6\",TRUE),0)+64)&MATCH(E$3&\"_slut\",INDIRECT(\"'\"&$B48&\"'!B:B\",TRUE),0),TRUE),\"X\"),0)","v":0},{"$f":"IF(E53=0,0,COUNTIF(INDIRECT(\"'\"&$B48&\"'!\"&CHAR(MATCH($D51,INDIRECT(\"'\"&$B48&\"'!6:6\",TRUE),0)+64)&MATCH(E$3,INDIRECT(\"'\"&$B48&\"'!B:B\",TRUE),0)&\":\"&CHAR(MATCH($D51,INDIRECT(\"'\"&$B48&\"'!6:6\",TRUE),0)+64)&MATCH(E$3&\"_slut\",INDIRECT(\"'\"&$B48&\"'!B:B\",TRUE),0),TRUE),\"X\")/E$61)","v":0},{"$f":"IF(E53=0,0,COUNTIF(INDIRECT(\"'\"&$B48&\"'!\"&CHAR(MATCH($D51,INDIRECT(\"'\"&$B48&\"'!6:6\",TRUE),0)+64)&MATCH(E$3,INDIRECT(\"'\"&$B48&\"'!B:B\",TRUE),0)&\":\"&CHAR(MATCH($D51,INDIRECT(\"'\"&$B48&\"'!6:6\",TRUE),0)+64)&MATCH(E$3&\"_slut\",INDIRECT(\"'\"&$B48&\"'!B:B\",TRUE),0),TRUE),\"X\")/SUM(E48:E52))","v":0},{"$f":"IFERROR(COUNTIF(INDIRECT(\"'\"&$B48&\"'!\"&CHAR(MATCH($D51,INDIRECT(\"'\"&$B48&\"'!6:6\",TRUE),0)+64)&MATCH(H$3,INDIRECT(\"'\"&$B48&\"'!B:B\",TRUE),0)&\":\"&CHAR(MATCH($D51,INDIRECT(\"'\"&$B48&\"'!6:6\",TRUE),0)+64)&MATCH(H$3&\"_slut\",INDIRECT(\"'\"&$B48&\"'!B:B\",TRUE),0),TRUE),\"X\"),0)","v":0},{"$f":"IF(H53=0,0,COUNTIF(INDIRECT(\"'\"&$B48&\"'!\"&CHAR(MATCH($D51,INDIRECT(\"'\"&$B48&\"'!6:6\",TRUE),0)+64)&MATCH(H$3,INDIRECT(\"'\"&$B48&\"'!B:B\",TRUE),0)&\":\"&CHAR(MATCH($D51,INDIRECT(\"'\"&$B48&\"'!6:6\",TRUE),0)+64)&MATCH(H$3&\"_slut\",INDIRECT(\"'\"&$B48&\"'!B:B\",TRUE),0),TRUE),\"X\")/H$61)","v":0},{"$f":"IF(H53=0,0,COUNTIF(INDIRECT(\"'\"&$B48&\"'!\"&CHAR(MATCH($D51,INDIRECT(\"'\"&$B48&\"'!6:6\",TRUE),0)+64)&MATCH(H$3,INDIRECT(\"'\"&$B48&\"'!B:B\",TRUE),0)&\":\"&CHAR(MATCH($D51,INDIRECT(\"'\"&$B48&\"'!6:6\",TRUE),0)+64)&MATCH(H$3&\"_slut\",INDIRECT(\"'\"&$B48&\"'!B:B\",TRUE),0),TRUE),\"X\")/SUM(H48:H52))","v":0},{"$f":"IFERROR(COUNTIF(INDIRECT(\"'\"&$B48&\"'!\"&CHAR(MATCH($D51,INDIRECT(\"'\"&$B48&\"'!6:6\",TRUE),0)+64)&MATCH(K$3,INDIRECT(\"'\"&$B48&\"'!B:B\",TRUE),0)&\":\"&CHAR(MATCH($D51,INDIRECT(\"'\"&$B48&\"'!6:6\",TRUE),0)+64)&MATCH(K$3&\"_slut\",INDIRECT(\"'\"&$B48&\"'!B:B\",TRUE),0),TRUE),\"X\"),0)","v":0},{"$f":"IF(K53=0,0,COUNTIF(INDIRECT(\"'\"&$B48&\"'!\"&CHAR(MATCH($D51,INDIRECT(\"'\"&$B48&\"'!6:6\",TRUE),0)+64)&MATCH(K$3,INDIRECT(\"'\"&$B48&\"'!B:B\",TRUE),0)&\":\"&CHAR(MATCH($D51,INDIRECT(\"'\"&$B48&\"'!6:6\",TRUE),0)+64)&MATCH(K$3&\"_slut\",INDIRECT(\"'\"&$B48&\"'!B:B\",TRUE),0),TRUE),\"X\")/K$61)","v":0},{"$f":"IF(K53=0,0,COUNTIF(INDIRECT(\"'\"&$B48&\"'!\"&CHAR(MATCH($D51,INDIRECT(\"'\"&$B48&\"'!6:6\",TRUE),0)+64)&MATCH(K$3,INDIRECT(\"'\"&$B48&\"'!B:B\",TRUE),0)&\":\"&CHAR(MATCH($D51,INDIRECT(\"'\"&$B48&\"'!6:6\",TRUE),0)+64)&MATCH(K$3&\"_slut\",INDIRECT(\"'\"&$B48&\"'!B:B\",TRUE),0),TRUE),\"X\")/SUM(K48:K52))","v":0},{"$f":"IFERROR(COUNTIF(INDIRECT(\"'\"&$B48&\"'!\"&CHAR(MATCH($D51,INDIRECT(\"'\"&$B48&\"'!6:6\",TRUE),0)+64)&MATCH(N$3,INDIRECT(\"'\"&$B48&\"'!B:B\",TRUE),0)&\":\"&CHAR(MATCH($D51,INDIRECT(\"'\"&$B48&\"'!6:6\",TRUE),0)+64)&MATCH(N$3&\"_slut\",INDIRECT(\"'\"&$B48&\"'!B:B\",TRUE),0),TRUE),\"X\"),0)","v":0},{"$f":"IF(N53=0,0,COUNTIF(INDIRECT(\"'\"&$B48&\"'!\"&CHAR(MATCH($D51,INDIRECT(\"'\"&$B48&\"'!6:6\",TRUE),0)+64)&MATCH(N$3,INDIRECT(\"'\"&$B48&\"'!B:B\",TRUE),0)&\":\"&CHAR(MATCH($D51,INDIRECT(\"'\"&$B48&\"'!6:6\",TRUE),0)+64)&MATCH(N$3&\"_slut\",INDIRECT(\"'\"&$B48&\"'!B:B\",TRUE),0),TRUE),\"X\")/N$61)","v":0},{"$f":"IF(N53=0,0,COUNTIF(INDIRECT(\"'\"&$B48&\"'!\"&CHAR(MATCH($D51,INDIRECT(\"'\"&$B48&\"'!6:6\",TRUE),0)+64)&MATCH(N$3,INDIRECT(\"'\"&$B48&\"'!B:B\",TRUE),0)&\":\"&CHAR(MATCH($D51,INDIRECT(\"'\"&$B48&\"'!6:6\",TRUE),0)+64)&MATCH(N$3&\"_slut\",INDIRECT(\"'\"&$B48&\"'!B:B\",TRUE),0),TRUE),\"X\")/SUM(N48:N52))","v":0}]
[null,null,{"$f":"B48","v":"Måling"},"Ikke sat",{"$f":"IF(ISERROR(MATCH(E$3,INDIRECT(\"'\"&$B48&\"'!B:B\",TRUE),0)),0,COUNTA(INDIRECT(\"'\"&$B48&\"'!E\"&MATCH(E$3,INDIRECT(\"'\"&$B48&\"'!B:B\",TRUE),0)&\":E\"&MATCH(E$3&\"_slut\",INDIRECT(\"'\"&$B48&\"'!B:B\",TRUE),0),TRUE))-E48-E49-E50-E51)","v":1},{"$f":"IF(E53=0,0,E53/E$61-F48-F49-F50-F51)","v":3.2258064516129031E-2},{"$f":"IF(E53=0,0,1-G48-G49-G50-G51)","v":1},{"$f":"IF(ISERROR(MATCH(H$3,INDIRECT(\"'\"&$B48&\"'!B:B\",TRUE),0)),0,COUNTA(INDIRECT(\"'\"&$B48&\"'!E\"&MATCH(H$3,INDIRECT(\"'\"&$B48&\"'!B:B\",TRUE),0)&\":E\"&MATCH(H$3&\"_slut\",INDIRECT(\"'\"&$B48&\"'!B:B\",TRUE),0),TRUE))-H48-H49-H50-H51)","v":0},{"$f":"IF(H53=0,0,H53/H$61-I48-I49-I50-I51)","v":0},{"$f":"IF(H53=0,0,1-J48-J49-J50-J51)","v":0},{"$f":"IF(ISERROR(MATCH(K$3,INDIRECT(\"'\"&$B48&\"'!B:B\",TRUE),0)),0,COUNTA(INDIRECT(\"'\"&$B48&\"'!E\"&MATCH(K$3,INDIRECT(\"'\"&$B48&\"'!B:B\",TRUE),0)&\":E\"&MATCH(K$3&\"_slut\",INDIRECT(\"'\"&$B48&\"'!B:B\",TRUE),0),TRUE))-K48-K49-K50-K51)","v":2},{"$f":"IF(K53=0,0,K53/K$61-L48-L49-L50-L51)","v":7.407407407407407E-2},{"$f":"IF(K53=0,0,1-M48-M49-M50-M51)","v":1},{"$f":"IF(ISERROR(MATCH(N$3,INDIRECT(\"'\"&$B48&\"'!B:B\",TRUE),0)),0,COUNTA(INDIRECT(\"'\"&$B48&\"'!E\"&MATCH(N$3,INDIRECT(\"'\"&$B48&\"'!B:B\",TRUE),0)&\":E\"&MATCH(N$3&\"_slut\",INDIRECT(\"'\"&$B48&\"'!B:B\",TRUE),0),TRUE))-N48-N49-N50-N51)","v":1},{"$f":"IF(N53=0,0,N53/N$61-O48-O49-O50-O51)","v":6.25E-2},{"$f":"IF(N53=0,0,1-P48-P49-P50-P51)","v":1}]
[null,null,{"$f":"B48","v":"Måling"},"TOTAL",{"$f":"SUM(E48:E52)","v":1},{"$f":"SUM(F48:F51)","v":0},{"$f":"SUM(G48:G51)","v":0},{"$f":"SUM(H48:H52)","v":0},{"$f":"SUM(I48:I51)","v":0},0,{"$f":"SUM(K48:K52)","v":2},{"$f":"SUM(L48:L51)","v":0},0,{"$f":"SUM(N48:N52)","v":1},{"$f":"SUM(O48:O51)","v":0},0]
[null,"Intern opfølgning",{"$f":"B54","v":"Intern opfølgning"},"Ja",{"$f":"IFERROR(COUNTIF(INDIRECT(\"'\"&$B54&\"'!\"&CHAR(MATCH($D54,INDIRECT(\"'\"&$B54&\"'!6:6\",TRUE),0)+64)&MATCH(E$3,INDIRECT(\"'\"&$B54&\"'!B:B\",TRUE),0)&\":\"&CHAR(MATCH($D54,INDIRECT(\"'\"&$B54&\"'!6:6\",TRUE),0)+64)&MATCH(E$3&\"_slut\",INDIRECT(\"'\"&$B54&\"'!B:B\",TRUE),0),TRUE),\"X\"),0)","v":0},{"$f":"IF(E59=0,0,COUNTIF(INDIRECT(\"'\"&$B54&\"'!\"&CHAR(MATCH($D54,INDIRECT(\"'\"&$B54&\"'!6:6\",TRUE),0)+64)&MATCH(E$3,INDIRECT(\"'\"&$B54&\"'!B:B\",TRUE),0)&\":\"&CHAR(MATCH($D54,INDIRECT(\"'\"&$B54&\"'!6:6\",TRUE),0)+64)&MATCH(E$3&\"_slut\",INDIRECT(\"'\"&$B54&\"'!B:B\",TRUE),0),TRUE),\"X\")/E$61)","v":0},{"$f":"IF(E59=0,0,COUNTIF(INDIRECT(\"'\"&$B54&\"'!\"&CHAR(MATCH($D54,INDIRECT(\"'\"&$B54&\"'!6:6\",TRUE),0)+64)&MATCH(E$3,INDIRECT(\"'\"&$B54&\"'!B:B\",TRUE),0)&\":\"&CHAR(MATCH($D54,INDIRECT(\"'\"&$B54&\"'!6:6\",TRUE),0)+64)&MATCH(E$3&\"_slut\",INDIRECT(\"'\"&$B54&\"'!B:B\",TRUE),0),TRUE),\"X\")/SUM(E54:E58))","v":0},{"$f":"IFERROR(COUNTIF(INDIRECT(\"'\"&$B54&\"'!\"&CHAR(MATCH($D54,INDIRECT(\"'\"&$B54&\"'!6:6\",TRUE),0)+64)&MATCH(H$3,INDIRECT(\"'\"&$B54&\"'!B:B\",TRUE),0)&\":\"&CHAR(MATCH($D54,INDIRECT(\"'\"&$B54&\"'!6:6\",TRUE),0)+64)&MATCH(H$3&\"_slut\",INDIRECT(\"'\"&$B54&\"'!B:B\",TRUE),0),TRUE),\"X\"),0)","v":0},{"$f":"IF(H59=0,0,COUNTIF(INDIRECT(\"'\"&$B54&\"'!\"&CHAR(MATCH($D54,INDIRECT(\"'\"&$B54&\"'!6:6\",TRUE),0)+64)&MATCH(H$3,INDIRECT(\"'\"&$B54&\"'!B:B\",TRUE),0)&\":\"&CHAR(MATCH($D54,INDIRECT(\"'\"&$B54&\"'!6:6\",TRUE),0)+64)&MATCH(H$3&\"_slut\",INDIRECT(\"'\"&$B54&\"'!B:B\",TRUE),0),TRUE),\"X\")/H$61)","v":0},{"$f":"IF(H59=0,0,COUNTIF(INDIRECT(\"'\"&$B54&\"'!\"&CHAR(MATCH($D54,INDIRECT(\"'\"&$B54&\"'!6:6\",TRUE),0)+64)&MATCH(H$3,INDIRECT(\"'\"&$B54&\"'!B:B\",TRUE),0)&\":\"&CHAR(MATCH($D54,INDIRECT(\"'\"&$B54&\"'!6:6\",TRUE),0)+64)&MATCH(H$3&\"_slut\",INDIRECT(\"'\"&$B54&\"'!B:B\",TRUE),0),TRUE),\"X\")/SUM(H54:H58))","v":0},{"$f":"IFERROR(COUNTIF(INDIRECT(\"'\"&$B54&\"'!\"&CHAR(MATCH($D54,INDIRECT(\"'\"&$B54&\"'!6:6\",TRUE),0)+64)&MATCH(K$3,INDIRECT(\"'\"&$B54&\"'!B:B\",TRUE),0)&\":\"&CHAR(MATCH($D54,INDIRECT(\"'\"&$B54&\"'!6:6\",TRUE),0)+64)&MATCH(K$3&\"_slut\",INDIRECT(\"'\"&$B54&\"'!B:B\",TRUE),0),TRUE),\"X\"),0)","v":0},{"$f":"IF(K59=0,0,COUNTIF(INDIRECT(\"'\"&$B54&\"'!\"&CHAR(MATCH($D54,INDIRECT(\"'\"&$B54&\"'!6:6\",TRUE),0)+64)&MATCH(K$3,INDIRECT(\"'\"&$B54&\"'!B:B\",TRUE),0)&\":\"&CHAR(MATCH($D54,INDIRECT(\"'\"&$B54&\"'!6:6\",TRUE),0)+64)&MATCH(K$3&\"_slut\",INDIRECT(\"'\"&$B54&\"'!B:B\",TRUE),0),TRUE),\"X\")/K$61)","v":0},{"$f":"IF(K59=0,0,COUNTIF(INDIRECT(\"'\"&$B54&\"'!\"&CHAR(MATCH($D54,INDIRECT(\"'\"&$B54&\"'!6:6\",TRUE),0)+64)&MATCH(K$3,INDIRECT(\"'\"&$B54&\"'!B:B\",TRUE),0)&\":\"&CHAR(MATCH($D54,INDIRECT(\"'\"&$B54&\"'!6:6\",TRUE),0)+64)&MATCH(K$3&\"_slut\",INDIRECT(\"'\"&$B54&\"'!B:B\",TRUE),0),TRUE),\"X\")/SUM(K54:K58))","v":0},{"$f":"IFERROR(COUNTIF(INDIRECT(\"'\"&$B54&\"'!\"&CHAR(MATCH($D54,INDIRECT(\"'\"&$B54&\"'!6:6\",TRUE),0)+64)&MATCH(N$3,INDIRECT(\"'\"&$B54&\"'!B:B\",TRUE),0)&\":\"&CHAR(MATCH($D54,INDIRECT(\"'\"&$B54&\"'!6:6\",TRUE),0)+64)&MATCH(N$3&\"_slut\",INDIRECT(\"'\"&$B54&\"'!B:B\",TRUE),0),TRUE),\"X\"),0)","v":0},{"$f":"IF(N59=0,0,COUNTIF(INDIRECT(\"'\"&$B54&\"'!\"&CHAR(MATCH($D54,INDIRECT(\"'\"&$B54&\"'!6:6\",TRUE),0)+64)&MATCH(N$3,INDIRECT(\"'\"&$B54&\"'!B:B\",TRUE),0)&\":\"&CHAR(MATCH($D54,INDIRECT(\"'\"&$B54&\"'!6:6\",TRUE),0)+64)&MATCH(N$3&\"_slut\",INDIRECT(\"'\"&$B54&\"'!B:B\",TRUE),0),TRUE),\"X\")/N$61)","v":0},{"$f":"IF(N59=0,0,COUNTIF(INDIRECT(\"'\"&$B54&\"'!\"&CHAR(MATCH($D54,INDIRECT(\"'\"&$B54&\"'!6:6\",TRUE),0)+64)&MATCH(N$3,INDIRECT(\"'\"&$B54&\"'!B:B\",TRUE),0)&\":\"&CHAR(MATCH($D54,INDIRECT(\"'\"&$B54&\"'!6:6\",TRUE),0)+64)&MATCH(N$3&\"_slut\",INDIRECT(\"'\"&$B54&\"'!B:B\",TRUE),0),TRUE),\"X\")/SUM(N54:N58))","v":0}]
[null,null,{"$f":"B54","v":"Intern opfølgning"},"Delvist",{"$f":"IFERROR(COUNTIF(INDIRECT(\"'\"&$B54&\"'!\"&CHAR(MATCH($D55,INDIRECT(\"'\"&$B54&\"'!6:6\",TRUE),0)+64)&MATCH(E$3,INDIRECT(\"'\"&$B54&\"'!B:B\",TRUE),0)&\":\"&CHAR(MATCH($D55,INDIRECT(\"'\"&$B54&\"'!6:6\",TRUE),0)+64)&MATCH(E$3&\"_slut\",INDIRECT(\"'\"&$B54&\"'!B:B\",TRUE),0),TRUE),\"X\"),0)","v":0},{"$f":"IF(E59=0,0,COUNTIF(INDIRECT(\"'\"&$B54&\"'!\"&CHAR(MATCH($D55,INDIRECT(\"'\"&$B54&\"'!6:6\",TRUE),0)+64)&MATCH(E$3,INDIRECT(\"'\"&$B54&\"'!B:B\",TRUE),0)&\":\"&CHAR(MATCH($D55,INDIRECT(\"'\"&$B54&\"'!6:6\",TRUE),0)+64)&MATCH(E$3&\"_slut\",INDIRECT(\"'\"&$B54&\"'!B:B\",TRUE),0),TRUE),\"X\")/E$61)","v":0},{"$f":"IF(E59=0,0,COUNTIF(INDIRECT(\"'\"&$B54&\"'!\"&CHAR(MATCH($D55,INDIRECT(\"'\"&$B54&\"'!6:6\",TRUE),0)+64)&MATCH(E$3,INDIRECT(\"'\"&$B54&\"'!B:B\",TRUE),0)&\":\"&CHAR(MATCH($D55,INDIRECT(\"'\"&$B54&\"'!6:6\",TRUE),0)+64)&MATCH(E$3&\"_slut\",INDIRECT(\"'\"&$B54&\"'!B:B\",TRUE),0),TRUE),\"X\")/SUM(E54:E58))","v":0},{"$f":"IFERROR(COUNTIF(INDIRECT(\"'\"&$B54&\"'!\"&CHAR(MATCH($D55,INDIRECT(\"'\"&$B54&\"'!6:6\",TRUE),0)+64)&MATCH(H$3,INDIRECT(\"'\"&$B54&\"'!B:B\",TRUE),0)&\":\"&CHAR(MATCH($D55,INDIRECT(\"'\"&$B54&\"'!6:6\",TRUE),0)+64)&MATCH(H$3&\"_slut\",INDIRECT(\"'\"&$B54&\"'!B:B\",TRUE),0),TRUE),\"X\"),0)","v":0},{"$f":"IF(H59=0,0,COUNTIF(INDIRECT(\"'\"&$B54&\"'!\"&CHAR(MATCH($D55,INDIRECT(\"'\"&$B54&\"'!6:6\",TRUE),0)+64)&MATCH(H$3,INDIRECT(\"'\"&$B54&\"'!B:B\",TRUE),0)&\":\"&CHAR(MATCH($D55,INDIRECT(\"'\"&$B54&\"'!6:6\",TRUE),0)+64)&MATCH(H$3&\"_slut\",INDIRECT(\"'\"&$B54&\"'!B:B\",TRUE),0),TRUE),\"X\")/H$61)","v":0},{"$f":"IF(H59=0,0,COUNTIF(INDIRECT(\"'\"&$B54&\"'!\"&CHAR(MATCH($D55,INDIRECT(\"'\"&$B54&\"'!6:6\",TRUE),0)+64)&MATCH(H$3,INDIRECT(\"'\"&$B54&\"'!B:B\",TRUE),0)&\":\"&CHAR(MATCH($D55,INDIRECT(\"'\"&$B54&\"'!6:6\",TRUE),0)+64)&MATCH(H$3&\"_slut\",INDIRECT(\"'\"&$B54&\"'!B:B\",TRUE),0),TRUE),\"X\")/SUM(H54:H58))","v":0},{"$f":"IFERROR(COUNTIF(INDIRECT(\"'\"&$B54&\"'!\"&CHAR(MATCH($D55,INDIRECT(\"'\"&$B54&\"'!6:6\",TRUE),0)+64)&MATCH(K$3,INDIRECT(\"'\"&$B54&\"'!B:B\",TRUE),0)&\":\"&CHAR(MATCH($D55,INDIRECT(\"'\"&$B54&\"'!6:6\",TRUE),0)+64)&MATCH(K$3&\"_slut\",INDIRECT(\"'\"&$B54&\"'!B:B\",TRUE),0),TRUE),\"X\"),0)","v":0},{"$f":"IF(K59=0,0,COUNTIF(INDIRECT(\"'\"&$B54&\"'!\"&CHAR(MATCH($D55,INDIRECT(\"'\"&$B54&\"'!6:6\",TRUE),0)+64)&MATCH(K$3,INDIRECT(\"'\"&$B54&\"'!B:B\",TRUE),0)&\":\"&CHAR(MATCH($D55,INDIRECT(\"'\"&$B54&\"'!6:6\",TRUE),0)+64)&MATCH(K$3&\"_slut\",INDIRECT(\"'\"&$B54&\"'!B:B\",TRUE),0),TRUE),\"X\")/K$61)","v":0},{"$f":"IF(K59=0,0,COUNTIF(INDIRECT(\"'\"&$B54&\"'!\"&CHAR(MATCH($D55,INDIRECT(\"'\"&$B54&\"'!6:6\",TRUE),0)+64)&MATCH(K$3,INDIRECT(\"'\"&$B54&\"'!B:B\",TRUE),0)&\":\"&CHAR(MATCH($D55,INDIRECT(\"'\"&$B54&\"'!6:6\",TRUE),0)+64)&MATCH(K$3&\"_slut\",INDIRECT(\"'\"&$B54&\"'!B:B\",TRUE),0),TRUE),\"X\")/SUM(K54:K58))","v":0},{"$f":"IFERROR(COUNTIF(INDIRECT(\"'\"&$B54&\"'!\"&CHAR(MATCH($D55,INDIRECT(\"'\"&$B54&\"'!6:6\",TRUE),0)+64)&MATCH(N$3,INDIRECT(\"'\"&$B54&\"'!B:B\",TRUE),0)&\":\"&CHAR(MATCH($D55,INDIRECT(\"'\"&$B54&\"'!6:6\",TRUE),0)+64)&MATCH(N$3&\"_slut\",INDIRECT(\"'\"&$B54&\"'!B:B\",TRUE),0),TRUE),\"X\"),0)","v":0},{"$f":"IF(N59=0,0,COUNTIF(INDIRECT(\"'\"&$B54&\"'!\"&CHAR(MATCH($D55,INDIRECT(\"'\"&$B54&\"'!6:6\",TRUE),0)+64)&MATCH(N$3,INDIRECT(\"'\"&$B54&\"'!B:B\",TRUE),0)&\":\"&CHAR(MATCH($D55,INDIRECT(\"'\"&$B54&\"'!6:6\",TRUE),0)+64)&MATCH(N$3&\"_slut\",INDIRECT(\"'\"&$B54&\"'!B:B\",TRUE),0),TRUE),\"X\")/N$61)","v":0},{"$f":"IF(N59=0,0,COUNTIF(INDIRECT(\"'\"&$B54&\"'!\"&CHAR(MATCH($D55,INDIRECT(\"'\"&$B54&\"'!6:6\",TRUE),0)+64)&MATCH(N$3,INDIRECT(\"'\"&$B54&\"'!B:B\",TRUE),0)&\":\"&CHAR(MATCH($D55,INDIRECT(\"'\"&$B54&\"'!6:6\",TRUE),0)+64)&MATCH(N$3&\"_slut\",INDIRECT(\"'\"&$B54&\"'!B:B\",TRUE),0),TRUE),\"X\")/SUM(N54:N58))","v":0}]
[null,null,{"$f":"B54","v":"Intern opfølgning"},"Nej",{"$f":"IFERROR(COUNTIF(INDIRECT(\"'\"&$B54&\"'!\"&CHAR(MATCH($D56,INDIRECT(\"'\"&$B54&\"'!6:6\",TRUE),0)+64)&MATCH(E$3,INDIRECT(\"'\"&$B54&\"'!B:B\",TRUE),0)&\":\"&CHAR(MATCH($D56,INDIRECT(\"'\"&$B54&\"'!6:6\",TRUE),0)+64)&MATCH(E$3&\"_slut\",INDIRECT(\"'\"&$B54&\"'!B:B\",TRUE),0),TRUE),\"X\"),0)","v":0},{"$f":"IF(E59=0,0,COUNTIF(INDIRECT(\"'\"&$B54&\"'!\"&CHAR(MATCH($D56,INDIRECT(\"'\"&$B54&\"'!6:6\",TRUE),0)+64)&MATCH(E$3,INDIRECT(\"'\"&$B54&\"'!B:B\",TRUE),0)&\":\"&CHAR(MATCH($D56,INDIRECT(\"'\"&$B54&\"'!6:6\",TRUE),0)+64)&MATCH(E$3&\"_slut\",INDIRECT(\"'\"&$B54&\"'!B:B\",TRUE),0),TRUE),\"X\")/E$61)","v":0},{"$f":"IF(E59=0,0,COUNTIF(INDIRECT(\"'\"&$B54&\"'!\"&CHAR(MATCH($D56,INDIRECT(\"'\"&$B54&\"'!6:6\",TRUE),0)+64)&MATCH(E$3,INDIRECT(\"'\"&$B54&\"'!B:B\",TRUE),0)&\":\"&CHAR(MATCH($D56,INDIRECT(\"'\"&$B54&\"'!6:6\",TRUE),0)+64)&MATCH(E$3&\"_slut\",INDIRECT(\"'\"&$B54&\"'!B:B\",TRUE),0),TRUE),\"X\")/SUM(E54:E58))","v":0},{"$f":"IFERROR(COUNTIF(INDIRECT(\"'\"&$B54&\"'!\"&CHAR(MATCH($D56,INDIRECT(\"'\"&$B54&\"'!6:6\",TRUE),0)+64)&MATCH(H$3,INDIRECT(\"'\"&$B54&\"'!B:B\",TRUE),0)&\":\"&CHAR(MATCH($D56,INDIRECT(\"'\"&$B54&\"'!6:6\",TRUE),0)+64)&MATCH(H$3&\"_slut\",INDIRECT(\"'\"&$B54&\"'!B:B\",TRUE),0),TRUE),\"X\"),0)","v":0},{"$f":"IF(H59=0,0,COUNTIF(INDIRECT(\"'\"&$B54&\"'!\"&CHAR(MATCH($D56,INDIRECT(\"'\"&$B54&\"'!6:6\",TRUE),0)+64)&MATCH(H$3,INDIRECT(\"'\"&$B54&\"'!B:B\",TRUE),0)&\":\"&CHAR(MATCH($D56,INDIRECT(\"'\"&$B54&\"'!6:6\",TRUE),0)+64)&MATCH(H$3&\"_slut\",INDIRECT(\"'\"&$B54&\"'!B:B\",TRUE),0),TRUE),\"X\")/H$61)","v":0},{"$f":"IF(H59=0,0,COUNTIF(INDIRECT(\"'\"&$B54&\"'!\"&CHAR(MATCH($D56,INDIRECT(\"'\"&$B54&\"'!6:6\",TRUE),0)+64)&MATCH(H$3,INDIRECT(\"'\"&$B54&\"'!B:B\",TRUE),0)&\":\"&CHAR(MATCH($D56,INDIRECT(\"'\"&$B54&\"'!6:6\",TRUE),0)+64)&MATCH(H$3&\"_slut\",INDIRECT(\"'\"&$B54&\"'!B:B\",TRUE),0),TRUE),\"X\")/SUM(H54:H58))","v":0},{"$f":"IFERROR(COUNTIF(INDIRECT(\"'\"&$B54&\"'!\"&CHAR(MATCH($D56,INDIRECT(\"'\"&$B54&\"'!6:6\",TRUE),0)+64)&MATCH(K$3,INDIRECT(\"'\"&$B54&\"'!B:B\",TRUE),0)&\":\"&CHAR(MATCH($D56,INDIRECT(\"'\"&$B54&\"'!6:6\",TRUE),0)+64)&MATCH(K$3&\"_slut\",INDIRECT(\"'\"&$B54&\"'!B:B\",TRUE),0),TRUE),\"X\"),0)","v":0},{"$f":"IF(K59=0,0,COUNTIF(INDIRECT(\"'\"&$B54&\"'!\"&CHAR(MATCH($D56,INDIRECT(\"'\"&$B54&\"'!6:6\",TRUE),0)+64)&MATCH(K$3,INDIRECT(\"'\"&$B54&\"'!B:B\",TRUE),0)&\":\"&CHAR(MATCH($D56,INDIRECT(\"'\"&$B54&\"'!6:6\",TRUE),0)+64)&MATCH(K$3&\"_slut\",INDIRECT(\"'\"&$B54&\"'!B:B\",TRUE),0),TRUE),\"X\")/K$61)","v":0},{"$f":"IF(K59=0,0,COUNTIF(INDIRECT(\"'\"&$B54&\"'!\"&CHAR(MATCH($D56,INDIRECT(\"'\"&$B54&\"'!6:6\",TRUE),0)+64)&MATCH(K$3,INDIRECT(\"'\"&$B54&\"'!B:B\",TRUE),0)&\":\"&CHAR(MATCH($D56,INDIRECT(\"'\"&$B54&\"'!6:6\",TRUE),0)+64)&MATCH(K$3&\"_slut\",INDIRECT(\"'\"&$B54&\"'!B:B\",TRUE),0),TRUE),\"X\")/SUM(K54:K58))","v":0},{"$f":"IFERROR(COUNTIF(INDIRECT(\"'\"&$B54&\"'!\"&CHAR(MATCH($D56,INDIRECT(\"'\"&$B54&\"'!6:6\",TRUE),0)+64)&MATCH(N$3,INDIRECT(\"'\"&$B54&\"'!B:B\",TRUE),0)&\":\"&CHAR(MATCH($D56,INDIRECT(\"'\"&$B54&\"'!6:6\",TRUE),0)+64)&MATCH(N$3&\"_slut\",INDIRECT(\"'\"&$B54&\"'!B:B\",TRUE),0),TRUE),\"X\"),0)","v":0},{"$f":"IF(N59=0,0,COUNTIF(INDIRECT(\"'\"&$B54&\"'!\"&CHAR(MATCH($D56,INDIRECT(\"'\"&$B54&\"'!6:6\",TRUE),0)+64)&MATCH(N$3,INDIRECT(\"'\"&$B54&\"'!B:B\",TRUE),0)&\":\"&CHAR(MATCH($D56,INDIRECT(\"'\"&$B54&\"'!6:6\",TRUE),0)+64)&MATCH(N$3&\"_slut\",INDIRECT(\"'\"&$B54&\"'!B:B\",TRUE),0),TRUE),\"X\")/N$61)","v":0},{"$f":"IF(N59=0,0,COUNTIF(INDIRECT(\"'\"&$B54&\"'!\"&CHAR(MATCH($D56,INDIRECT(\"'\"&$B54&\"'!6:6\",TRUE),0)+64)&MATCH(N$3,INDIRECT(\"'\"&$B54&\"'!B:B\",TRUE),0)&\":\"&CHAR(MATCH($D56,INDIRECT(\"'\"&$B54&\"'!6:6\",TRUE),0)+64)&MATCH(N$3&\"_slut\",INDIRECT(\"'\"&$B54&\"'!B:B\",TRUE),0),TRUE),\"X\")/SUM(N54:N58))","v":0}]
[null,null,{"$f":"B54","v":"Intern opfølgning"},"Ikke relevant",{"$f":"IFERROR(COUNTIF(INDIRECT(\"'\"&$B54&\"'!\"&CHAR(MATCH($D57,INDIRECT(\"'\"&$B54&\"'!6:6\",TRUE),0)+64)&MATCH(E$3,INDIRECT(\"'\"&$B54&\"'!B:B\",TRUE),0)&\":\"&CHAR(MATCH($D57,INDIRECT(\"'\"&$B54&\"'!6:6\",TRUE),0)+64)&MATCH(E$3&\"_slut\",INDIRECT(\"'\"&$B54&\"'!B:B\",TRUE),0),TRUE),\"X\"),0)","v":0},{"$f":"IF(E59=0,0,COUNTIF(INDIRECT(\"'\"&$B54&\"'!\"&CHAR(MATCH($D57,INDIRECT(\"'\"&$B54&\"'!6:6\",TRUE),0)+64)&MATCH(E$3,INDIRECT(\"'\"&$B54&\"'!B:B\",TRUE),0)&\":\"&CHAR(MATCH($D57,INDIRECT(\"'\"&$B54&\"'!6:6\",TRUE),0)+64)&MATCH(E$3&\"_slut\",INDIRECT(\"'\"&$B54&\"'!B:B\",TRUE),0),TRUE),\"X\")/E$61)","v":0},{"$f":"IF(E59=0,0,COUNTIF(INDIRECT(\"'\"&$B54&\"'!\"&CHAR(MATCH($D57,INDIRECT(\"'\"&$B54&\"'!6:6\",TRUE),0)+64)&MATCH(E$3,INDIRECT(\"'\"&$B54&\"'!B:B\",TRUE),0)&\":\"&CHAR(MATCH($D57,INDIRECT(\"'\"&$B54&\"'!6:6\",TRUE),0)+64)&MATCH(E$3&\"_slut\",INDIRECT(\"'\"&$B54&\"'!B:B\",TRUE),0),TRUE),\"X\")/SUM(E54:E58))","v":0},{"$f":"IFERROR(COUNTIF(INDIRECT(\"'\"&$B54&\"'!\"&CHAR(MATCH($D57,INDIRECT(\"'\"&$B54&\"'!6:6\",TRUE),0)+64)&MATCH(H$3,INDIRECT(\"'\"&$B54&\"'!B:B\",TRUE),0)&\":\"&CHAR(MATCH($D57,INDIRECT(\"'\"&$B54&\"'!6:6\",TRUE),0)+64)&MATCH(H$3&\"_slut\",INDIRECT(\"'\"&$B54&\"'!B:B\",TRUE),0),TRUE),\"X\"),0)","v":0},{"$f":"IF(H59=0,0,COUNTIF(INDIRECT(\"'\"&$B54&\"'!\"&CHAR(MATCH($D57,INDIRECT(\"'\"&$B54&\"'!6:6\",TRUE),0)+64)&MATCH(H$3,INDIRECT(\"'\"&$B54&\"'!B:B\",TRUE),0)&\":\"&CHAR(MATCH($D57,INDIRECT(\"'\"&$B54&\"'!6:6\",TRUE),0)+64)&MATCH(H$3&\"_slut\",INDIRECT(\"'\"&$B54&\"'!B:B\",TRUE),0),TRUE),\"X\")/H$61)","v":0},{"$f":"IF(H59=0,0,COUNTIF(INDIRECT(\"'\"&$B54&\"'!\"&CHAR(MATCH($D57,INDIRECT(\"'\"&$B54&\"'!6:6\",TRUE),0)+64)&MATCH(H$3,INDIRECT(\"'\"&$B54&\"'!B:B\",TRUE),0)&\":\"&CHAR(MATCH($D57,INDIRECT(\"'\"&$B54&\"'!6:6\",TRUE),0)+64)&MATCH(H$3&\"_slut\",INDIRECT(\"'\"&$B54&\"'!B:B\",TRUE),0),TRUE),\"X\")/SUM(H54:H58))","v":0},{"$f":"IFERROR(COUNTIF(INDIRECT(\"'\"&$B54&\"'!\"&CHAR(MATCH($D57,INDIRECT(\"'\"&$B54&\"'!6:6\",TRUE),0)+64)&MATCH(K$3,INDIRECT(\"'\"&$B54&\"'!B:B\",TRUE),0)&\":\"&CHAR(MATCH($D57,INDIRECT(\"'\"&$B54&\"'!6:6\",TRUE),0)+64)&MATCH(K$3&\"_slut\",INDIRECT(\"'\"&$B54&\"'!B:B\",TRUE),0),TRUE),\"X\"),0)","v":0},{"$f":"IF(K59=0,0,COUNTIF(INDIRECT(\"'\"&$B54&\"'!\"&CHAR(MATCH($D57,INDIRECT(\"'\"&$B54&\"'!6:6\",TRUE),0)+64)&MATCH(K$3,INDIRECT(\"'\"&$B54&\"'!B:B\",TRUE),0)&\":\"&CHAR(MATCH($D57,INDIRECT(\"'\"&$B54&\"'!6:6\",TRUE),0)+64)&MATCH(K$3&\"_slut\",INDIRECT(\"'\"&$B54&\"'!B:B\",TRUE),0),TRUE),\"X\")/K$61)","v":0},{"$f":"IF(K59=0,0,COUNTIF(INDIRECT(\"'\"&$B54&\"'!\"&CHAR(MATCH($D57,INDIRECT(\"'\"&$B54&\"'!6:6\",TRUE),0)+64)&MATCH(K$3,INDIRECT(\"'\"&$B54&\"'!B:B\",TRUE),0)&\":\"&CHAR(MATCH($D57,INDIRECT(\"'\"&$B54&\"'!6:6\",TRUE),0)+64)&MATCH(K$3&\"_slut\",INDIRECT(\"'\"&$B54&\"'!B:B\",TRUE),0),TRUE),\"X\")/SUM(K54:K58))","v":0},{"$f":"IFERROR(COUNTIF(INDIRECT(\"'\"&$B54&\"'!\"&CHAR(MATCH($D57,INDIRECT(\"'\"&$B54&\"'!6:6\",TRUE),0)+64)&MATCH(N$3,INDIRECT(\"'\"&$B54&\"'!B:B\",TRUE),0)&\":\"&CHAR(MATCH($D57,INDIRECT(\"'\"&$B54&\"'!6:6\",TRUE),0)+64)&MATCH(N$3&\"_slut\",INDIRECT(\"'\"&$B54&\"'!B:B\",TRUE),0),TRUE),\"X\"),0)","v":0},{"$f":"IF(N59=0,0,COUNTIF(INDIRECT(\"'\"&$B54&\"'!\"&CHAR(MATCH($D57,INDIRECT(\"'\"&$B54&\"'!6:6\",TRUE),0)+64)&MATCH(N$3,INDIRECT(\"'\"&$B54&\"'!B:B\",TRUE),0)&\":\"&CHAR(MATCH($D57,INDIRECT(\"'\"&$B54&\"'!6:6\",TRUE),0)+64)&MATCH(N$3&\"_slut\",INDIRECT(\"'\"&$B54&\"'!B:B\",TRUE),0),TRUE),\"X\")/N$61)","v":0},{"$f":"IF(N59=0,0,COUNTIF(INDIRECT(\"'\"&$B54&\"'!\"&CHAR(MATCH($D57,INDIRECT(\"'\"&$B54&\"'!6:6\",TRUE),0)+64)&MATCH(N$3,INDIRECT(\"'\"&$B54&\"'!B:B\",TRUE),0)&\":\"&CHAR(MATCH($D57,INDIRECT(\"'\"&$B54&\"'!6:6\",TRUE),0)+64)&MATCH(N$3&\"_slut\",INDIRECT(\"'\"&$B54&\"'!B:B\",TRUE),0),TRUE),\"X\")/SUM(N54:N58))","v":0}]
[null,null,{"$f":"B54","v":"Intern opfølgning"},"Ikke sat",{"$f":"IF(ISERROR(MATCH(E$3,INDIRECT(\"'\"&$B54&\"'!B:B\",TRUE),0)),0,COUNTA(INDIRECT(\"'\"&$B54&\"'!E\"&MATCH(E$3,INDIRECT(\"'\"&$B54&\"'!B:B\",TRUE),0)&\":E\"&MATCH(E$3&\"_slut\",INDIRECT(\"'\"&$B54&\"'!B:B\",TRUE),0),TRUE))-E54-E55-E56-E57)","v":1},{"$f":"IF(E59=0,0,E59/E$61-F54-F55-F56-F57)","v":3.2258064516129031E-2},{"$f":"IF(E59=0,0,1-G54-G55-G56-G57)","v":1},{"$f":"IF(ISERROR(MATCH(H$3,INDIRECT(\"'\"&$B54&\"'!B:B\",TRUE),0)),0,COUNTA(INDIRECT(\"'\"&$B54&\"'!E\"&MATCH(H$3,INDIRECT(\"'\"&$B54&\"'!B:B\",TRUE),0)&\":E\"&MATCH(H$3&\"_slut\",INDIRECT(\"'\"&$B54&\"'!B:B\",TRUE),0),TRUE))-H54-H55-H56-H57)","v":3},{"$f":"IF(H59=0,0,H59/H$61-I54-I55-I56-I57)","v":8.3333333333333329E-2},{"$f":"IF(H59=0,0,1-J54-J55-J56-J57)","v":1},{"$f":"IF(ISERROR(MATCH(K$3,INDIRECT(\"'\"&$B54&\"'!B:B\",TRUE),0)),0,COUNTA(INDIRECT(\"'\"&$B54&\"'!E\"&MATCH(K$3,INDIRECT(\"'\"&$B54&\"'!B:B\",TRUE),0)&\":E\"&MATCH(K$3&\"_slut\",INDIRECT(\"'\"&$B54&\"'!B:B\",TRUE),0),TRUE))-K54-K55-K56-K57)","v":2},{"$f":"IF(K59=0,0,K59/K$61-L54-L55-L56-L57)","v":7.407407407407407E-2},{"$f":"IF(K59=0,0,1-M54-M55-M56-M57)","v":1},{"$f":"IF(ISERROR(MATCH(N$3,INDIRECT(\"'\"&$B54&\"'!B:B\",TRUE),0)),0,COUNTA(INDIRECT(\"'\"&$B54&\"'!E\"&MATCH(N$3,INDIRECT(\"'\"&$B54&\"'!B:B\",TRUE),0)&\":E\"&MATCH(N$3&\"_slut\",INDIRECT(\"'\"&$B54&\"'!B:B\",TRUE),0),TRUE))-N54-N55-N56-N57)","v":3},{"$f":"IF(N59=0,0,N59/N$61-O54-O55-O56-O57)","v":0.1875},{"$f":"IF(N59=0,0,1-P54-P55-P56-P57)","v":1}]
[null,null,{"$f":"B54","v":"Intern opfølgning"},"TOTAL",{"$f":"SUM(E54:E58)","v":1},{"$f":"SUM(F54:F57)","v":0},{"$f":"SUM(G54:G57)","v":0},{"$f":"SUM(H54:H58)","v":3},{"$f":"SUM(I54:I57)","v":0},0,{"$f":"SUM(K54:K58)","v":2},{"$f":"SUM(L54:L57)","v":0},0,{"$f":"SUM(N54:N58)","v":3},{"$f":"SUM(O54:O57)","v":0},0]
[]
[null,"Total",null,null,{"$f":"SUMIF($D5:$D60,\"TOTAL\",E5:E60)","v":31},{"$f":"SUMIF($D5:$D60,\"TOTAL\",F5:F60)","v":0},null,{"$f":"SUMIF($D5:$D60,\"TOTAL\",H5:H60)","v":36},{"$f":"SUMIF($D5:$D60,\"TOTAL\",I5:I60)","v":0},null,{"$f":"SUMIF($D5:$D60,\"TOTAL\",K5:K60)","v":27},{"$f":"SUMIF($D5:$D60,\"TOTAL\",L5:L60)","v":0},null,{"$f":"SUMIF($D5:$D60,\"TOTAL\",N5:N60)","v":16},{"$f":"SUMIF($D5:$D60,\"TOTAL\",O5:O60)","v":0}]
[]
[]
[]
[]
[]
[null," "]

{"sheet":"Graf_Oversigt","index":1,"n_rows":37,"n_cols":34,"rows_kept":37,"cut":false,"hidden":true,"merged":[[1,2,1,7],[1,8,1,13],[1,14,1,19],[1,20,1,25],[1,26,1,31],[25,2,25,7],[25,8,25,13],[25,14,25,19],[25,20,25,25],[25,26,25,31],[13,2,13,7],[13,8,13,13],[13,14,13,19],[13,20,13,25],[13,26,13,31]]}
[null,null,null,null,null,null,null,null,null,null,null,null,null,null,null,null,null,null,null,null,null,null,null,null,null,null,null,null,null,null,null,null,null,"list_x"]
[null,"Type","PLAN",null,null,null,null,null,"DO",null,null,null,null,null,"CHECK",null,null,null,null,null,"ACT",null,null,null,null,null,"SUM",null,null,null,null,null,null,"X"]
[null,"Antal","Ja","Delvist","Nej","Ikke relevant","Ikke sat","TOTAL","Ja","Delvist","Nej","Ikke relevant","Ikke sat","TOTAL","Ja","Delvist","Nej","Ikke relevant","Ikke sat","TOTAL","Ja","Delvist","Nej","Ikke relevant","Ikke sat","TOTAL","Ja","Delvist","Nej","Ikke relevant","Ikke sat","TOTAL"]
[null,"Risikovurdering",{"$f":"SUMIFS(Oversigt!$E:$E,Oversigt!$C:$C,$B4,Oversigt!$D:$D,C$3)","v":0},{"$f":"SUMIFS(Oversigt!$E:$E,Oversigt!$C:$C,$B4,Oversigt!$D:$D,D$3)","v":0},{"$f":"SUMIFS(Oversigt!$E:$E,Oversigt!$C:$C,$B4,Oversigt!$D:$D,E$3)","v":0},{"$f":"SUMIFS(Oversigt!$E:$E,Oversigt!$C:$C,$B4,Oversigt!$D:$D,F$3)","v":0},{"$f":"SUMIFS(Oversigt!$E:$E,Oversigt!$C:$C,$B4,Oversigt!$D:$D,G$3)","v":2},{"$f":"SUMIFS(Oversigt!$E:$E,Oversigt!$C:$C,$B4,Oversigt!$D:$D,H$3)","v":2},{"$f":"SUMIFS(Oversigt!$H:$H,Oversigt!$C:$C,$B4,Oversigt!$D:$D,I$3)","v":0},{"$f":"SUMIFS(Oversigt!$H:$H,Oversigt!$C:$C,$B4,Oversigt!$D:$D,J$3)","v":0},{"$f":"SUMIFS(Oversigt!$H:$H,Oversigt!$C:$C,$B4,Oversigt!$D:$D,K$3)","v":0},{"$f":"SUMIFS(Oversigt!$H:$H,Oversigt!$C:$C,$B4,Oversigt!$D:$D,L$3)","v":0},{"$f":"SUMIFS(Oversigt!$H:$H,Oversigt!$C:$C,$B4,Oversigt!$D:$D,M$3)","v":5},{"$f":"SUMIFS(Oversigt!$H:$H,Oversigt!$C:$C,$B4,Oversigt!$D:$D,N$3)","v":5},{"$f":"SUMIFS(Oversigt!$K:$K,Oversigt!$C:$C,$B4,Oversigt!$D:$D,O$3)","v":0},{"$f":"SUMIFS(Oversigt!$K:$K,Oversigt!$C:$C,$B4,Oversigt!$D:$D,P$3)","v":0},{"$f":"SUMIFS(Oversigt!$K:$K,Oversigt!$C:$C,$B4,Oversigt!$D:$D,Q$3)","v":0},{"$f":"SUMIFS(Oversigt!$K:$K,Oversigt!$C:$C,$B4,Oversigt!$D:$D,R$3)","v":0},{"$f":"SUMIFS(Oversigt!$K:$K,Oversigt!$C:$C,$B4,Oversigt!$D:$D,S$3)","v":3},{"$f":"SUMIFS(Oversigt!$K:$K,Oversigt!$C:$C,$B4,Oversigt!$D:$D,T$3)","v":3},{"$f":"SUMIFS(Oversigt!$N:$N,Oversigt!$C:$C,$B4,Oversigt!$D:$D,U$3)","v":0},{"$f":"SUMIFS(Oversigt!$N:$N,Oversigt!$C:$C,$B4,Oversigt!$D:$D,V$3)","v":0},{"$f":"SUMIFS(Oversigt!$N:$N,Oversigt!$C:$C,$B4,Oversigt!$D:$D,W$3)","v":0},{"$f":"SUMIFS(Oversigt!$N:$N,Oversigt!$C:$C,$B4,Oversigt!$D:$D,X$3)","v":0},{"$f":"SUMIFS(Oversigt!$N:$N,Oversigt!$C:$C,$B4,Oversigt!$D:$D,Y$3)","v":1},{"$f":"SUMIFS(Oversigt!$N:$N,Oversigt!$C:$C,$B4,Oversigt!$D:$D,Z$3)","v":1},{"$f":"SUMIFS(Oversigt!$E:$E,Oversigt!$C:$C,$B4,Oversigt!$D:$D,AA$3)+SUMIFS(Oversigt!$H:$H,Oversigt!$C:$C,$B4,Oversigt!$D:$D,AA$3)+SUMIFS(Oversigt!$K:$K,Oversigt!$C:$C,$B4,Oversigt!$D:$D,AA$3)+SUMIFS(Oversigt!$N:$N,Oversigt!$C:$C,$B4,Oversigt!$D:$D,AA$3)","v":0},{"$f":"SUMIFS(Oversigt!$E:$E,Oversigt!$C:$C,$B4,Oversigt!$D:$D,AB$3)+SUMIFS(Oversigt!$H:$H,Oversigt!$C:$C,$B4,Oversigt!$D:$D,AB$3)+SUMIFS(Oversigt!$K:$K,Oversigt!$C:$C,$B4,Oversigt!$D:$D,AB$3)+SUMIFS(Oversigt!$N:$N,Oversigt!$C:$C,$B4,Oversigt!$D:$D,AB$3)","v":0},{"$f":"SUMIFS(Oversigt!$E:$E,Oversigt!$C:$C,$B4,Oversigt!$D:$D,AC$3)+SUMIFS(Oversigt!$H:$H,Oversigt!$C:$C,$B4,Oversigt!$D:$D,AC$3)+SUMIFS(Oversigt!$K:$K,Oversigt!$C:$C,$B4,Oversigt!$D:$D,AC$3)+SUMIFS(Oversigt!$N:$N,Oversigt!$C:$C,$B4,Oversigt!$D:$D,AC$3)","v":0},{"$f":"SUMIFS(Oversigt!$E:$E,Oversigt!$C:$C,$B4,Oversigt!$D:$D,AD$3)+SUMIFS(Oversigt!$H:$H,Oversigt!$C:$C,$B4,Oversigt!$D:$D,AD$3)+SUMIFS(Oversigt!$K:$K,Oversigt!$C:$C,$B4,Oversigt!$D:$D,AD$3)+SUMIFS(Oversigt!$N:$N,Oversigt!$C:$C,$B4,Oversigt!$D:$D,AD$3)","v":0},{"$f":"SUMIFS(Oversigt!$E:$E,Oversigt!$C:$C,$B4,Oversigt!$D:$D,AE$3)+SUMIFS(Oversigt!$H:$H,Oversigt!$C:$C,$B4,Oversigt!$D:$D,AE$3)+SUMIFS(Oversigt!$K:$K,Oversigt!$C:$C,$B4,Oversigt!$D:$D,AE$3)+SUMIFS(Oversigt!$N:$N,Oversigt!$C:$C,$B4,Oversigt!$D:$D,AE$3)","v":11},{"$f":"SUMIFS(Oversigt!$E:$E,Oversigt!$C:$C,$B4,Oversigt!$D:$D,AF$3)+SUMIFS(Oversigt!$H:$H,Oversigt!$C:$C,$B4,Oversigt!$D:$D,AF$3)+SUMIFS(Oversigt!$K:$K,Oversigt!$C:$C,$B4,Oversigt!$D:$D,AF$3)+SUMIFS(Oversigt!$N:$N,Oversigt!$C:$C,$B4,Oversigt!$D:$D,AF$3)","v":11}]
[null,"Risikohåndtering",{"$f":"SUMIFS(Oversigt!$E:$E,Oversigt!$C:$C,$B5,Oversigt!$D:$D,C$3)","v":0},{"$f":"SUMIFS(Oversigt!$E:$E,Oversigt!$C:$C,$B5,Oversigt!$D:$D,D$3)","v":0},{"$f":"SUMIFS(Oversigt!$E:$E,Oversigt!$C:$C,$B5,Oversigt!$D:$D,E$3)","v":0},{"$f":"SUMIFS(Oversigt!$E:$E,Oversigt!$C:$C,$B5,Oversigt!$D:$D,F$3)","v":0},{"$f":"SUMIFS(Oversigt!$E:$E,Oversigt!$C:$C,$B5,Oversigt!$D:$D,G$3)","v":3},{"$f":"SUMIFS(Oversigt!$E:$E,Oversigt!$C:$C,$B5,Oversigt!$D:$D,H$3)","v":3},{"$f":"SUMIFS(Oversigt!$H:$H,Oversigt!$C:$C,$B5,Oversigt!$D:$D,I$3)","v":0},{"$f":"SUMIFS(Oversigt!$H:$H,Oversigt!$C:$C,$B5,Oversigt!$D:$D,J$3)","v":0},{"$f":"SUMIFS(Oversigt!$H:$H,Oversigt!$C:$C,$B5,Oversigt!$D:$D,K$3)","v":0},{"$f":"SUMIFS(Oversigt!$H:$H,Oversigt!$C:$C,$B5,Oversigt!$D:$D,L$3)","v":0},{"$f":"SUMIFS(Oversigt!$H:$H,Oversigt!$C:$C,$B5,Oversigt!$D:$D,M$3)","v":2},{"$f":"SUMIFS(Oversigt!$H:$H,Oversigt!$C:$C,$B5,Oversigt!$D:$D,N$3)","v":2},{"$f":"SUMIFS(Oversigt!$K:$K,Oversigt!$C:$C,$B5,Oversigt!$D:$D,O$3)","v":0},{"$f":"SUMIFS(Oversigt!$K:$K,Oversigt!$C:$C,$B5,Oversigt!$D:$D,P$3)","v":0},{"$f":"SUMIFS(Oversigt!$K:$K,Oversigt!$C:$C,$B5,Oversigt!$D:$D,Q$3)","v":0},{"$f":"SUMIFS(Oversigt!$K:$K,Oversigt!$C:$C,$B5,Oversigt!$D:$D,R$3)","v":0},{"$f":"SUMIFS(Oversigt!$K:$K,Oversigt!$C:$C,$B5,Oversigt!$D:$D,S$3)","v":3},{"$f":"SUMIFS(Oversigt!$K:$K,Oversigt!$C:$C,$B5,Oversigt!$D:$D,T$3)","v":3},{"$f":"SUMIFS(Oversigt!$N:$N,Oversigt!$C:$C,$B5,Oversigt!$D:$D,U$3)","v":0},{"$f":"SUMIFS(Oversigt!$N:$N,Oversigt!$C:$C,$B5,Oversigt!$D:$D,V$3)","v":0},{"$f":"SUMIFS(Oversigt!$N:$N,Oversigt!$C:$C,$B5,Oversigt!$D:$D,W$3)","v":0},{"$f":"SUMIFS(Oversigt!$N:$N,Oversigt!$C:$C,$B5,Oversigt!$D:$D,X$3)","v":0},{"$f":"SUMIFS(Oversigt!$N:$N,Oversigt!$C:$C,$B5,Oversigt!$D:$D,Y$3)","v":2},{"$f":"SUMIFS(Oversigt!$N:$N,Oversigt!$C:$C,$B5,Oversigt!$D:$D,Z$3)","v":2},{"$f":"SUMIFS(Oversigt!$E:$E,Oversigt!$C:$C,$B5,Oversigt!$D:$D,AA$3)+SUMIFS(Oversigt!$H:$H,Oversigt!$C:$C,$B5,Oversigt!$D:$D,AA$3)+SUMIFS(Oversigt!$K:$K,Oversigt!$C:$C,$B5,Oversigt!$D:$D,AA$3)+SUMIFS(Oversigt!$N:$N,Oversigt!$C:$C,$B5,Oversigt!$D:$D,AA$3)","v":0},{"$f":"SUMIFS(Oversigt!$E:$E,Oversigt!$C:$C,$B5,Oversigt!$D:$D,AB$3)+SUMIFS(Oversigt!$H:$H,Oversigt!$C:$C,$B5,Oversigt!$D:$D,AB$3)+SUMIFS(Oversigt!$K:$K,Oversigt!$C:$C,$B5,Oversigt!$D:$D,AB$3)+SUMIFS(Oversigt!$N:$N,Oversigt!$C:$C,$B5,Oversigt!$D:$D,AB$3)","v":0},{"$f":"SUMIFS(Oversigt!$E:$E,Oversigt!$C:$C,$B5,Oversigt!$D:$D,AC$3)+SUMIFS(Oversigt!$H:$H,Oversigt!$C:$C,$B5,Oversigt!$D:$D,AC$3)+SUMIFS(Oversigt!$K:$K,Oversigt!$C:$C,$B5,Oversigt!$D:$D,AC$3)+SUMIFS(Oversigt!$N:$N,Oversigt!$C:$C,$B5,Oversigt!$D:$D,AC$3)","v":0},{"$f":"SUMIFS(Oversigt!$E:$E,Oversigt!$C:$C,$B5,Oversigt!$D:$D,AD$3)+SUMIFS(Oversigt!$H:$H,Oversigt!$C:$C,$B5,Oversigt!$D:$D,AD$3)+SUMIFS(Oversigt!$K:$K,Oversigt!$C:$C,$B5,Oversigt!$D:$D,AD$3)+SUMIFS(Oversigt!$N:$N,Oversigt!$C:$C,$B5,Oversigt!$D:$D,AD$3)","v":0},{"$f":"SUMIFS(Oversigt!$E:$E,Oversigt!$C:$C,$B5,Oversigt!$D:$D,AE$3)+SUMIFS(Oversigt!$H:$H,Oversigt!$C:$C,$B5,Oversigt!$D:$D,AE$3)+SUMIFS(Oversigt!$K:$K,Oversigt!$C:$C,$B5,Oversigt!$D:$D,AE$3)+SUMIFS(Oversigt!$N:$N,Oversigt!$C:$C,$B5,Oversigt!$D:$D,AE$3)","v":10},{"$f":"SUMIFS(Oversigt!$E:$E,Oversigt!$C:$C,$B5,Oversigt!$D:$D,AF$3)+SUMIFS(Oversigt!$H:$H,Oversigt!$C:$C,$B5,Oversigt!$D:$D,AF$3)+SUMIFS(Oversigt!$K:$K,Oversigt!$C:$C,$B5,Oversigt!$D:$D,AF$3)+SUMIFS(Oversigt!$N:$N,Oversigt!$C:$C,$B5,Oversigt!$D:$D,AF$3)","v":10}]
[null,"ISMS",{"$f":"SUMIFS(Oversigt!$E:$E,Oversigt!$C:$C,$B6,Oversigt!$D:$D,C$3)","v":0},{"$f":"SUMIFS(Oversigt!$E:$E,Oversigt!$C:$C,$B6,Oversigt!$D:$D,D$3)","v":0},{"$f":"SUMIFS(Oversigt!$E:$E,Oversigt!$C:$C,$B6,Oversigt!$D:$D,E$3)","v":0},{"$f":"SUMIFS(Oversigt!$E:$E,Oversigt!$C:$C,$B6,Oversigt!$D:$D,F$3)","v":0},{"$f":"SUMIFS(Oversigt!$E:$E,Oversigt!$C:$C,$B6,Oversigt!$D:$D,G$3)","v":4},{"$f":"SUMIFS(Oversigt!$E:$E,Oversigt!$C:$C,$B6,Oversigt!$D:$D,H$3)","v":4},{"$f":"SUMIFS(Oversigt!$H:$H,Oversigt!$C:$C,$B6,Oversigt!$D:$D,I$3)","v":0},{"$f":"SUMIFS(Oversigt!$H:$H,Oversigt!$C:$C,$B6,Oversigt!$D:$D,J$3)","v":0},{"$f":"SUMIFS(Oversigt!$H:$H,Oversigt!$C:$C,$B6,Oversigt!$D:$D,K$3)","v":0},{"$f":"SUMIFS(Oversigt!$H:$H,Oversigt!$C:$C,$B6,Oversigt!$D:$D,L$3)","v":0},{"$f":"SUMIFS(Oversigt!$H:$H,Oversigt!$C:$C,$B6,Oversigt!$D:$D,M$3)","v":7},{"$f":"SUMIFS(Oversigt!$H:$H,Oversigt!$C:$C,$B6,Oversigt!$D:$D,N$3)","v":7},{"$f":"SUMIFS(Oversigt!$K:$K,Oversigt!$C:$C,$B6,Oversigt!$D:$D,O$3)","v":0},{"$f":"SUMIFS(Oversigt!$K:$K,Oversigt!$C:$C,$B6,Oversigt!$D:$D,P$3)","v":0},{"$f":"SUMIFS(Oversigt!$K:$K,Oversigt!$C:$C,$B6,Oversigt!$D:$D,Q$3)","v":0},{"$f":"SUMIFS(Oversigt!$K:$K,Oversigt!$C:$C,$B6,Oversigt!$D:$D,R$3)","v":0},{"$f":"SUMIFS(Oversigt!$K:$K,Oversigt!$C:$C,$B6,Oversigt!$D:$D,S$3)","v":3},{"$f":"SUMIFS(Oversigt!$K:$K,Oversigt!$C:$C,$B6,Oversigt!$D:$D,T$3)","v":3},{"$f":"SUMIFS(Oversigt!$N:$N,Oversigt!$C:$C,$B6,Oversigt!$D:$D,U$3)","v":0},{"$f":"SUMIFS(Oversigt!$N:$N,Oversigt!$C:$C,$B6,Oversigt!$D:$D,V$3)","v":0},{"$f":"SUMIFS(Oversigt!$N:$N,Oversigt!$C:$C,$B6,Oversigt!$D:$D,W$3)","v":0},{"$f":"SUMIFS(Oversigt!$N:$N,Oversigt!$C:$C,$B6,Oversigt!$D:$D,X$3)","v":0},{"$f":"SUMIFS(Oversigt!$N:$N,Oversigt!$C:$C,$B6,Oversigt!$D:$D,Y$3)","v":1},{"$f":"SUMIFS(Oversigt!$N:$N,Oversigt!$C:$C,$B6,Oversigt!$D:$D,Z$3)","v":1},{"$f":"SUMIFS(Oversigt!$E:$E,Oversigt!$C:$C,$B6,Oversigt!$D:$D,AA$3)+SUMIFS(Oversigt!$H:$H,Oversigt!$C:$C,$B6,Oversigt!$D:$D,AA$3)+SUMIFS(Oversigt!$K:$K,Oversigt!$C:$C,$B6,Oversigt!$D:$D,AA$3)+SUMIFS(Oversigt!$N:$N,Oversigt!$C:$C,$B6,Oversigt!$D:$D,AA$3)","v":0},{"$f":"SUMIFS(Oversigt!$E:$E,Oversigt!$C:$C,$B6,Oversigt!$D:$D,AB$3)+SUMIFS(Oversigt!$H:$H,Oversigt!$C:$C,$B6,Oversigt!$D:$D,AB$3)+SUMIFS(Oversigt!$K:$K,Oversigt!$C:$C,$B6,Oversigt!$D:$D,AB$3)+SUMIFS(Oversigt!$N:$N,Oversigt!$C:$C,$B6,Oversigt!$D:$D,AB$3)","v":0},{"$f":"SUMIFS(Oversigt!$E:$E,Oversigt!$C:$C,$B6,Oversigt!$D:$D,AC$3)+SUMIFS(Oversigt!$H:$H,Oversigt!$C:$C,$B6,Oversigt!$D:$D,AC$3)+SUMIFS(Oversigt!$K:$K,Oversigt!$C:$C,$B6,Oversigt!$D:$D,AC$3)+SUMIFS(Oversigt!$N:$N,Oversigt!$C:$C,$B6,Oversigt!$D:$D,AC$3)","v":0},{"$f":"SUMIFS(Oversigt!$E:$E,Oversigt!$C:$C,$B6,Oversigt!$D:$D,AD$3)+SUMIFS(Oversigt!$H:$H,Oversigt!$C:$C,$B6,Oversigt!$D:$D,AD$3)+SUMIFS(Oversigt!$K:$K,Oversigt!$C:$C,$B6,Oversigt!$D:$D,AD$3)+SUMIFS(Oversigt!$N:$N,Oversigt!$C:$C,$B6,Oversigt!$D:$D,AD$3)","v":0},{"$f":"SUMIFS(Oversigt!$E:$E,Oversigt!$C:$C,$B6,Oversigt!$D:$D,AE$3)+SUMIFS(Oversigt!$H:$H,Oversigt!$C:$C,$B6,Oversigt!$D:$D,AE$3)+SUMIFS(Oversigt!$K:$K,Oversigt!$C:$C,$B6,Oversigt!$D:$D,AE$3)+SUMIFS(Oversigt!$N:$N,Oversigt!$C:$C,$B6,Oversigt!$D:$D,AE$3)","v":15},{"$f":"SUMIFS(Oversigt!$E:$E,Oversigt!$C:$C,$B6,Oversigt!$D:$D,AF$3)+SUMIFS(Oversigt!$H:$H,Oversigt!$C:$C,$B6,Oversigt!$D:$D,AF$3)+SUMIFS(Oversigt!$K:$K,Oversigt!$C:$C,$B6,Oversigt!$D:$D,AF$3)+SUMIFS(Oversigt!$N:$N,Oversigt!$C:$C,$B6,Oversigt!$D:$D,AF$3)","v":15}]
[null,"Politik",{"$f":"SUMIFS(Oversigt!$E:$E,Oversigt!$C:$C,$B7,Oversigt!$D:$D,C$3)","v":0},{"$f":"SUMIFS(Oversigt!$E:$E,Oversigt!$C:$C,$B7,Oversigt!$D:$D,D$3)","v":0},{"$f":"SUMIFS(Oversigt!$E:$E,Oversigt!$C:$C,$B7,Oversigt!$D:$D,E$3)","v":0},{"$f":"SUMIFS(Oversigt!$E:$E,Oversigt!$C:$C,$B7,Oversigt!$D:$D,F$3)","v":0},{"$f":"SUMIFS(Oversigt!$E:$E,Oversigt!$C:$C,$B7,Oversigt!$D:$D,G$3)","v":3},{"$f":"SUMIFS(Oversigt!$E:$E,Oversigt!$C:$C,$B7,Oversigt!$D:$D,H$3)","v":3},{"$f":"SUMIFS(Oversigt!$H:$H,Oversigt!$C:$C,$B7,Oversigt!$D:$D,I$3)","v":0},{"$f":"SUMIFS(Oversigt!$H:$H,Oversigt!$C:$C,$B7,Oversigt!$D:$D,J$3)","v":0},{"$f":"SUMIFS(Oversigt!$H:$H,Oversigt!$C:$C,$B7,Oversigt!$D:$D,K$3)","v":0},{"$f":"SUMIFS(Oversigt!$H:$H,Oversigt!$C:$C,$B7,Oversigt!$D:$D,L$3)","v":0},{"$f":"SUMIFS(Oversigt!$H:$H,Oversigt!$C:$C,$B7,Oversigt!$D:$D,M$3)","v":3},{"$f":"SUMIFS(Oversigt!$H:$H,Oversigt!$C:$C,$B7,Oversigt!$D:$D,N$3)","v":3},{"$f":"SUMIFS(Oversigt!$K:$K,Oversigt!$C:$C,$B7,Oversigt!$D:$D,O$3)","v":0},{"$f":"SUMIFS(Oversigt!$K:$K,Oversigt!$C:$C,$B7,Oversigt!$D:$D,P$3)","v":0},{"$f":"SUMIFS(Oversigt!$K:$K,Oversigt!$C:$C,$B7,Oversigt!$D:$D,Q$3)","v":0},{"$f":"SUMIFS(Oversigt!$K:$K,Oversigt!$C:$C,$B7,Oversigt!$D:$D,R$3)","v":0},{"$f":"SUMIFS(Oversigt!$K:$K,Oversigt!$C:$C,$B7,Oversigt!$D:$D,S$3)","v":2},{"$f":"SUMIFS(Oversigt!$K:$K,Oversigt!$C:$C,$B7,Oversigt!$D:$D,T$3)","v":2},{"$f":"SUMIFS(Oversigt!$N:$N,Oversigt!$C:$C,$B7,Oversigt!$D:$D,U$3)","v":0},{"$f":"SUMIFS(Oversigt!$N:$N,Oversigt!$C:$C,$B7,Oversigt!$D:$D,V$3)","v":0},{"$f":"SUMIFS(Oversigt!$N:$N,Oversigt!$C:$C,$B7,Oversigt!$D:$D,W$3)","v":0},{"$f":"SUMIFS(Oversigt!$N:$N,Oversigt!$C:$C,$B7,Oversigt!$D:$D,X$3)","v":0},{"$f":"SUMIFS(Oversigt!$N:$N,Oversigt!$C:$C,$B7,Oversigt!$D:$D,Y$3)","v":2},{"$f":"SUMIFS(Oversigt!$N:$N,Oversigt!$C:$C,$B7,Oversigt!$D:$D,Z$3)","v":2},{"$f":"SUMIFS(Oversigt!$E:$E,Oversigt!$C:$C,$B7,Oversigt!$D:$D,AA$3)+SUMIFS(Oversigt!$H:$H,Oversigt!$C:$C,$B7,Oversigt!$D:$D,AA$3)+SUMIFS(Oversigt!$K:$K,Oversigt!$C:$C,$B7,Oversigt!$D:$D,AA$3)+SUMIFS(Oversigt!$N:$N,Oversigt!$C:$C,$B7,Oversigt!$D:$D,AA$3)","v":0},{"$f":"SUMIFS(Oversigt!$E:$E,Oversigt!$C:$C,$B7,Oversigt!$D:$D,AB$3)+SUMIFS(Oversigt!$H:$H,Oversigt!$C:$C,$B7,Oversigt!$D:$D,AB$3)+SUMIFS(Oversigt!$K:$K,Oversigt!$C:$C,$B7,Oversigt!$D:$D,AB$3)+SUMIFS(Oversigt!$N:$N,Oversigt!$C:$C,$B7,Oversigt!$D:$D,AB$3)","v":0},{"$f":"SUMIFS(Oversigt!$E:$E,Oversigt!$C:$C,$B7,Oversigt!$D:$D,AC$3)+SUMIFS(Oversigt!$H:$H,Oversigt!$C:$C,$B7,Oversigt!$D:$D,AC$3)+SUMIFS(Oversigt!$K:$K,Oversigt!$C:$C,$B7,Oversigt!$D:$D,AC$3)+SUMIFS(Oversigt!$N:$N,Oversigt!$C:$C,$B7,Oversigt!$D:$D,AC$3)","v":0},{"$f":"SUMIFS(Oversigt!$E:$E,Oversigt!$C:$C,$B7,Oversigt!$D:$D,AD$3)+SUMIFS(Oversigt!$H:$H,Oversigt!$C:$C,$B7,Oversigt!$D:$D,AD$3)+SUMIFS(Oversigt!$K:$K,Oversigt!$C:$C,$B7,Oversigt!$D:$D,AD$3)+SUMIFS(Oversigt!$N:$N,Oversigt!$C:$C,$B7,Oversigt!$D:$D,AD$3)","v":0},{"$f":"SUMIFS(Oversigt!$E:$E,Oversigt!$C:$C,$B7,Oversigt!$D:$D,AE$3)+SUMIFS(Oversigt!$H:$H,Oversigt!$C:$C,$B7,Oversigt!$D:$D,AE$3)+SUMIFS(Oversigt!$K:$K,Oversigt!$C:$C,$B7,Oversigt!$D:$D,AE$3)+SUMIFS(Oversigt!$N:$N,Oversigt!$C:$C,$B7,Oversigt!$D:$D,AE$3)","v":10},{"$f":"SUMIFS(Oversigt!$E:$E,Oversigt!$C:$C,$B7,Oversigt!$D:$D,AF$3)+SUMIFS(Oversigt!$H:$H,Oversigt!$C:$C,$B7,Oversigt!$D:$D,AF$3)+SUMIFS(Oversigt!$K:$K,Oversigt!$C:$C,$B7,Oversigt!$D:$D,AF$3)+SUMIFS(Oversigt!$N:$N,Oversigt!$C:$C,$B7,Oversigt!$D:$D,AF$3)","v":10}]
[null,"Ledelsesforankring",{"$f":"SUMIFS(Oversigt!$E:$E,Oversigt!$C:$C,$B8,Oversigt!$D:$D,C$3)","v":0},{"$f":"SUMIFS(Oversigt!$E:$E,Oversigt!$C:$C,$B8,Oversigt!$D:$D,D$3)","v":0},{"$f":"SUMIFS(Oversigt!$E:$E,Oversigt!$C:$C,$B8,Oversigt!$D:$D,E$3)","v":0},{"$f":"SUMIFS(Oversigt!$E:$E,Oversigt!$C:$C,$B8,Oversigt!$D:$D,F$3)","v":0},{"$f":"SUMIFS(Oversigt!$E:$E,Oversigt!$C:$C,$B8,Oversigt!$D:$D,G$3)","v":0},{"$f":"SUMIFS(Oversigt!$E:$E,Oversigt!$C:$C,$B8,Oversigt!$D:$D,H$3)","v":0},{"$f":"SUMIFS(Oversigt!$H:$H,Oversigt!$C:$C,$B8,Oversigt!$D:$D,I$3)","v":0},{"$f":"SUMIFS(Oversigt!$H:$H,Oversigt!$C:$C,$B8,Oversigt!$D:$D,J$3)","v":0},{"$f":"SUMIFS(Oversigt!$H:$H,Oversigt!$C:$C,$B8,Oversigt!$D:$D,K$3)","v":0},{"$f":"SUMIFS(Oversigt!$H:$H,Oversigt!$C:$C,$B8,Oversigt!$D:$D,L$3)","v":0},{"$f":"SUMIFS(Oversigt!$H:$H,Oversigt!$C:$C,$B8,Oversigt!$D:$D,M$3)","v":4},{"$f":"SUMIFS(Oversigt!$H:$H,Oversigt!$C:$C,$B8,Oversigt!$D:$D,N$3)","v":4},{"$f":"SUMIFS(Oversigt!$K:$K,Oversigt!$C:$C,$B8,Oversigt!$D:$D,O$3)","v":0},{"$f":"SUMIFS(Oversigt!$K:$K,Oversigt!$C:$C,$B8,Oversigt!$D:$D,P$3)","v":0},{"$f":"SUMIFS(Oversigt!$K:$K,Oversigt!$C:$C,$B8,Oversigt!$D:$D,Q$3)","v":0},{"$f":"SUMIFS(Oversigt!$K:$K,Oversigt!$C:$C,$B8,Oversigt!$D:$D,R$3)","v":0},{"$f":"SUMIFS(Oversigt!$K:$K,Oversigt!$C:$C,$B8,Oversigt!$D:$D,S$3)","v":3},{"$f":"SUMIFS(Oversigt!$K:$K,Oversigt!$C:$C,$B8,Oversigt!$D:$D,T$3)","v":3},{"$f":"SUMIFS(Oversigt!$N:$N,Oversigt!$C:$C,$B8,Oversigt!$D:$D,U$3)","v":0},{"$f":"SUMIFS(Oversigt!$N:$N,Oversigt!$C:$C,$B8,Oversigt!$D:$D,V$3)","v":0},{"$f":"SUMIFS(Oversigt!$N:$N,Oversigt!$C:$C,$B8,Oversigt!$D:$D,W$3)","v":0},{"$f":"SUMIFS(Oversigt!$N:$N,Oversigt!$C:$C,$B8,Oversigt!$D:$D,X$3)","v":0},{"$f":"SUMIFS(Oversigt!$N:$N,Oversigt!$C:$C,$B8,Oversigt!$D:$D,Y$3)","v":2},{"$f":"SUMIFS(Oversigt!$N:$N,Oversigt!$C:$C,$B8,Oversigt!$D:$D,Z$3)","v":2},{"$f":"SUMIFS(Oversigt!$E:$E,Oversigt!$C:$C,$B8,Oversigt!$D:$D,AA$3)+SUMIFS(Oversigt!$H:$H,Oversigt!$C:$C,$B8,Oversigt!$D:$D,AA$3)+SUMIFS(Oversigt!$K:$K,Oversigt!$C:$C,$B8,Oversigt!$D:$D,AA$3)+SUMIFS(Oversigt!$N:$N,Oversigt!$C:$C,$B8,Oversigt!$D:$D,AA$3)","v":0},{"$f":"SUMIFS(Oversigt!$E:$E,Oversigt!$C:$C,$B8,Oversigt!$D:$D,AB$3)+SUMIFS(Oversigt!$H:$H,Oversigt!$C:$C,$B8,Oversigt!$D:$D,AB$3)+SUMIFS(Oversigt!$K:$K,Oversigt!$C:$C,$B8,Oversigt!$D:$D,AB$3)+SUMIFS(Oversigt!$N:$N,Oversigt!$C:$C,$B8,Oversigt!$D:$D,AB$3)","v":0},{"$f":"SUMIFS(Oversigt!$E:$E,Oversigt!$C:$C,$B8,Oversigt!$D:$D,AC$3)+SUMIFS(Oversigt!$H:$H,Oversigt!$C:$C,$B8,Oversigt!$D:$D,AC$3)+SUMIFS(Oversigt!$K:$K,Oversigt!$C:$C,$B8,Oversigt!$D:$D,AC$3)+SUMIFS(Oversigt!$N:$N,Oversigt!$C:$C,$B8,Oversigt!$D:$D,AC$3)","v":0},{"$f":"SUMIFS(Oversigt!$E:$E,Oversigt!$C:$C,$B8,Oversigt!$D:$D,AD$3)+SUMIFS(Oversigt!$H:$H,Oversigt!$C:$C,$B8,Oversigt!$D:$D,AD$3)+SUMIFS(Oversigt!$K:$K,Oversigt!$C:$C,$B8,Oversigt!$D:$D,AD$3)+SUMIFS(Oversigt!$N:$N,Oversigt!$C:$C,$B8,Oversigt!$D:$D,AD$3)","v":0},{"$f":"SUMIFS(Oversigt!$E:$E,Oversigt!$C:$C,$B8,Oversigt!$D:$D,AE$3)+SUMIFS(Oversigt!$H:$H,Oversigt!$C:$C,$B8,Oversigt!$D:$D,AE$3)+SUMIFS(Oversigt!$K:$K,Oversigt!$C:$C,$B8,Oversigt!$D:$D,AE$3)+SUMIFS(Oversigt!$N:$N,Oversigt!$C:$C,$B8,Oversigt!$D:$D,AE$3)","v":9},{"$f":"SUMIFS(Oversigt!$E:$E,Oversigt!$C:$C,$B8,Oversigt!$D:$D,AF$3)+SUMIFS(Oversigt!$H:$H,Oversigt!$C:$C,$B8,Oversigt!$D:$D,AF$3)+SUMIFS(Oversigt!$K:$K,Oversigt!$C:$C,$B8,Oversigt!$D:$D,AF$3)+SUMIFS(Oversigt!$N:$N,Oversigt!$C:$C,$B8,Oversigt!$D:$D,AF$3)","v":9}]
[null,"Leverandørstyring",{"$f":"SUMIFS(Oversigt!$E:$E,Oversigt!$C:$C,$B9,Oversigt!$D:$D,C$3)","v":0},{"$f":"SUMIFS(Oversigt!$E:$E,Oversigt!$C:$C,$B9,Oversigt!$D:$D,D$3)","v":0},{"$f":"SUMIFS(Oversigt!$E:$E,Oversigt!$C:$C,$B9,Oversigt!$D:$D,E$3)","v":0},{"$f":"SUMIFS(Oversigt!$E:$E,Oversigt!$C:$C,$B9,Oversigt!$D:$D,F$3)","v":0},{"$f":"SUMIFS(Oversigt!$E:$E,Oversigt!$C:$C,$B9,Oversigt!$D:$D,G$3)","v":9},{"$f":"SUMIFS(Oversigt!$E:$E,Oversigt!$C:$C,$B9,Oversigt!$D:$D,H$3)","v":9},{"$f":"SUMIFS(Oversigt!$H:$H,Oversigt!$C:$C,$B9,Oversigt!$D:$D,I$3)","v":0},{"$f":"SUMIFS(Oversigt!$H:$H,Oversigt!$C:$C,$B9,Oversigt!$D:$D,J$3)","v":0},{"$f":"SUMIFS(Oversigt!$H:$H,Oversigt!$C:$C,$B9,Oversigt!$D:$D,K$3)","v":0},{"$f":"SUMIFS(Oversigt!$H:$H,Oversigt!$C:$C,$B9,Oversigt!$D:$D,L$3)","v":0},{"$f":"SUMIFS(Oversigt!$H:$H,Oversigt!$C:$C,$B9,Oversigt!$D:$D,M$3)","v":8},{"$f":"SUMIFS(Oversigt!$H:$H,Oversigt!$C:$C,$B9,Oversigt!$D:$D,N$3)","v":8},{"$f":"SUMIFS(Oversigt!$K:$K,Oversigt!$C:$C,$B9,Oversigt!$D:$D,O$3)","v":0},{"$f":"SUMIFS(Oversigt!$K:$K,Oversigt!$C:$C,$B9,Oversigt!$D:$D,P$3)","v":0},{"$f":"SUMIFS(Oversigt!$K:$K,Oversigt!$C:$C,$B9,Oversigt!$D:$D,Q$3)","v":0},{"$f":"SUMIFS(Oversigt!$K:$K,Oversigt!$C:$C,$B9,Oversigt!$D:$D,R$3)","v":0},{"$f":"SUMIFS(Oversigt!$K:$K,Oversigt!$C:$C,$B9,Oversigt!$D:$D,S$3)","v":7},{"$f":"SUMIFS(Oversigt!$K:$K,Oversigt!$C:$C,$B9,Oversigt!$D:$D,T$3)","v":7},{"$f":"SUMIFS(Oversigt!$N:$N,Oversigt!$C:$C,$B9,Oversigt!$D:$D,U$3)","v":0},{"$f":"SUMIFS(Oversigt!$N:$N,Oversigt!$C:$C,$B9,Oversigt!$D:$D,V$3)","v":0},{"$f":"SUMIFS(Oversigt!$N:$N,Oversigt!$C:$C,$B9,Oversigt!$D:$D,W$3)","v":0},{"$f":"SUMIFS(Oversigt!$N:$N,Oversigt!$C:$C,$B9,Oversigt!$D:$D,X$3)","v":0},{"$f":"SUMIFS(Oversigt!$N:$N,Oversigt!$C:$C,$B9,Oversigt!$D:$D,Y$3)","v":2},{"$f":"SUMIFS(Oversigt!$N:$N,Oversigt!$C:$C,$B9,Oversigt!$D:$D,Z$3)","v":2},{"$f":"SUMIFS(Oversigt!$E:$E,Oversigt!$C:$C,$B9,Oversigt!$D:$D,AA$3)+SUMIFS(Oversigt!$H:$H,Oversigt!$C:$C,$B9,Oversigt!$D:$D,AA$3)+SUMIFS(Oversigt!$K:$K,Oversigt!$C:$C,$B9,Oversigt!$D:$D,AA$3)+SUMIFS(Oversigt!$N:$N,Oversigt!$C:$C,$B9,Oversigt!$D:$D,AA$3)","v":0},{"$f":"SUMIFS(Oversigt!$E:$E,Oversigt!$C:$C,$B9,Oversigt!$D:$D,AB$3)+SUMIFS(Oversigt!$H:$H,Oversigt!$C:$C,$B9,Oversigt!$D:$D,AB$3)+SUMIFS(Oversigt!$K:$K,Oversigt!$C:$C,$B9,Oversigt!$D:$D,AB$3)+SUMIFS(Oversigt!$N:$N,Oversigt!$C:$C,$B9,Oversigt!$D:$D,AB$3)","v":0},{"$f":"SUMIFS(Oversigt!$E:$E,Oversigt!$C:$C,$B9,Oversigt!$D:$D,AC$3)+SUMIFS(Oversigt!$H:$H,Oversigt!$C:$C,$B9,Oversigt!$D:$D,AC$3)+SUMIFS(Oversigt!$K:$K,Oversigt!$C:$C,$B9,Oversigt!$D:$D,AC$3)+SUMIFS(Oversigt!$N:$N,Oversigt!$C:$C,$B9,Oversigt!$D:$D,AC$3)","v":0},{"$f":"SUMIFS(Oversigt!$E:$E,Oversigt!$C:$C,$B9,Oversigt!$D:$D,AD$3)+SUMIFS(Oversigt!$H:$H,Oversigt!$C:$C,$B9,Oversigt!$D:$D,AD$3)+SUMIFS(Oversigt!$K:$K,Oversigt!$C:$C,$B9,Oversigt!$D:$D,AD$3)+SUMIFS(Oversigt!$N:$N,Oversigt!$C:$C,$B9,Oversigt!$D:$D,AD$3)","v":0},{"$f":"SUMIFS(Oversigt!$E:$E,Oversigt!$C:$C,$B9,Oversigt!$D:$D,AE$3)+SUMIFS(Oversigt!$H:$H,Oversigt!$C:$C,$B9,Oversigt!$D:$D,AE$3)+SUMIFS(Oversigt!$K:$K,Oversigt!$C:$C,$B9,Oversigt!$D:$D,AE$3)+SUMIFS(Oversigt!$N:$N,Oversigt!$C:$C,$B9,Oversigt!$D:$D,AE$3)","v":26},{"$f":"SUMIFS(Oversigt!$E:$E,Oversigt!$C:$C,$B9,Oversigt!$D:$D,AF$3)+SUMIFS(Oversigt!$H:$H,Oversigt!$C:$C,$B9,Oversigt!$D:$D,AF$3)+SUMIFS(Oversigt!$K:$K,Oversigt!$C:$C,$B9,Oversigt!$D:$D,AF$3)+SUMIFS(Oversigt!$N:$N,Oversigt!$C:$C,$B9,Oversigt!$D:$D,AF$3)","v":26}]
[null,"It-beredskab",{"$f":"SUMIFS(Oversigt!$E:$E,Oversigt!$C:$C,$B10,Oversigt!$D:$D,C$3)","v":0},{"$f":"SUMIFS(Oversigt!$E:$E,Oversigt!$C:$C,$B10,Oversigt!$D:$D,D$3)","v":0},{"$f":"SUMIFS(Oversigt!$E:$E,Oversigt!$C:$C,$B10,Oversigt!$D:$D,E$3)","v":0},{"$f":"SUMIFS(Oversigt!$E:$E,Oversigt!$C:$C,$B10,Oversigt!$D:$D,F$3)","v":0},{"$f":"SUMIFS(Oversigt!$E:$E,Oversigt!$C:$C,$B10,Oversigt!$D:$D,G$3)","v":8},{"$f":"SUMIFS(Oversigt!$E:$E,Oversigt!$C:$C,$B10,Oversigt!$D:$D,H$3)","v":8},{"$f":"SUMIFS(Oversigt!$H:$H,Oversigt!$C:$C,$B10,Oversigt!$D:$D,I$3)","v":0},{"$f":"SUMIFS(Oversigt!$H:$H,Oversigt!$C:$C,$B10,Oversigt!$D:$D,J$3)","v":0},{"$f":"SUMIFS(Oversigt!$H:$H,Oversigt!$C:$C,$B10,Oversigt!$D:$D,K$3)","v":0},{"$f":"SUMIFS(Oversigt!$H:$H,Oversigt!$C:$C,$B10,Oversigt!$D:$D,L$3)","v":0},{"$f":"SUMIFS(Oversigt!$H:$H,Oversigt!$C:$C,$B10,Oversigt!$D:$D,M$3)","v":4},{"$f":"SUMIFS(Oversigt!$H:$H,Oversigt!$C:$C,$B10,Oversigt!$D:$D,N$3)","v":4},{"$f":"SUMIFS(Oversigt!$K:$K,Oversigt!$C:$C,$B10,Oversigt!$D:$D,O$3)","v":0},{"$f":"SUMIFS(Oversigt!$K:$K,Oversigt!$C:$C,$B10,Oversigt!$D:$D,P$3)","v":0},{"$f":"SUMIFS(Oversigt!$K:$K,Oversigt!$C:$C,$B10,Oversigt!$D:$D,Q$3)","v":0},{"$f":"SUMIFS(Oversigt!$K:$K,Oversigt!$C:$C,$B10,Oversigt!$D:$D,R$3)","v":0},{"$f":"SUMIFS(Oversigt!$K:$K,Oversigt!$C:$C,$B10,Oversigt!$D:$D,S$3)","v":2},{"$f":"SUMIFS(Oversigt!$K:$K,Oversigt!$C:$C,$B10,Oversigt!$D:$D,T$3)","v":2},{"$f":"SUMIFS(Oversigt!$N:$N,Oversigt!$C:$C,$B10,Oversigt!$D:$D,U$3)","v":0},{"$f":"SUMIFS(Oversigt!$N:$N,Oversigt!$C:$C,$B10,Oversigt!$D:$D,V$3)","v":0},{"$f":"SUMIFS(Oversigt!$N:$N,Oversigt!$C:$C,$B10,Oversigt!$D:$D,W$3)","v":0},{"$f":"SUMIFS(Oversigt!$N:$N,Oversigt!$C:$C,$B10,Oversigt!$D:$D,X$3)","v":0},{"$f":"SUMIFS(Oversigt!$N:$N,Oversigt!$C:$C,$B10,Oversigt!$D:$D,Y$3)","v":2},{"$f":"SUMIFS(Oversigt!$N:$N,Oversigt!$C:$C,$B10,Oversigt!$D:$D,Z$3)","v":2},{"$f":"SUMIFS(Oversigt!$E:$E,Oversigt!$C:$C,$B10,Oversigt!$D:$D,AA$3)+SUMIFS(Oversigt!$H:$H,Oversigt!$C:$C,$B10,Oversigt!$D:$D,AA$3)+SUMIFS(Oversigt!$K:$K,Oversigt!$C:$C,$B10,Oversigt!$D:$D,AA$3)+SUMIFS(Oversigt!$N:$N,Oversigt!$C:$C,$B10,Oversigt!$D:$D,AA$3)","v":0},{"$f":"SUMIFS(Oversigt!$E:$E,Oversigt!$C:$C,$B10,Oversigt!$D:$D,AB$3)+SUMIFS(Oversigt!$H:$H,Oversigt!$C:$C,$B10,Oversigt!$D:$D,AB$3)+SUMIFS(Oversigt!$K:$K,Oversigt!$C:$C,$B10,Oversigt!$D:$D,AB$3)+SUMIFS(Oversigt!$N:$N,Oversigt!$C:$C,$B10,Oversigt!$D:$D,AB$3)","v":0},{"$f":"SUMIFS(Oversigt!$E:$E,Oversigt!$C:$C,$B10,Oversigt!$D:$D,AC$3)+SUMIFS(Oversigt!$H:$H,Oversigt!$C:$C,$B10,Oversigt!$D:$D,AC$3)+SUMIFS(Oversigt!$K:$K,Oversigt!$C:$C,$B10,Oversigt!$D:$D,AC$3)+SUMIFS(Oversigt!$N:$N,Oversigt!$C:$C,$B10,Oversigt!$D:$D,AC$3)","v":0},{"$f":"SUMIFS(Oversigt!$E:$E,Oversigt!$C:$C,$B10,Oversigt!$D:$D,AD$3)+SUMIFS(Oversigt!$H:$H,Oversigt!$C:$C,$B10,Oversigt!$D:$D,AD$3)+SUMIFS(Oversigt!$K:$K,Oversigt!$C:$C,$B10,Oversigt!$D:$D,AD$3)+SUMIFS(Oversigt!$N:$N,Oversigt!$C:$C,$B10,Oversigt!$D:$D,AD$3)","v":0},{"$f":"SUMIFS(Oversigt!$E:$E,Oversigt!$C:$C,$B10,Oversigt!$D:$D,AE$3)+SUMIFS(Oversigt!$H:$H,Oversigt!$C:$C,$B10,Oversigt!$D:$D,AE$3)+SUMIFS(Oversigt!$K:$K,Oversigt!$C:$C,$B10,Oversigt!$D:$D,AE$3)+SUMIFS(Oversigt!$N:$N,Oversigt!$C:$C,$B10,Oversigt!$D:$D,AE$3)","v":16},{"$f":"SUMIFS(Oversigt!$E:$E,Oversigt!$C:$C,$B10,Oversigt!$D:$D,AF$3)+SUMIFS(Oversigt!$H:$H,Oversigt!$C:$C,$B10,Oversigt!$D:$D,AF$3)+SUMIFS(Oversigt!$K:$K,Oversigt!$C:$C,$B10,Oversigt!$D:$D,AF$3)+SUMIFS(Oversigt!$N:$N,Oversigt!$C:$C,$B10,Oversigt!$D:$D,AF$3)","v":16}]
[null,"Måling",{"$f":"SUMIFS(Oversigt!$E:$E,Oversigt!$C:$C,$B11,Oversigt!$D:$D,C$3)","v":0},{"$f":"SUMIFS(Oversigt!$E:$E,Oversigt!$C:$C,$B11,Oversigt!$D:$D,D$3)","v":0},{"$f":"SUMIFS(Oversigt!$E:$E,Oversigt!$C:$C,$B11,Oversigt!$D:$D,E$3)","v":0},{"$f":"SUMIFS(Oversigt!$E:$E,Oversigt!$C:$C,$B11,Oversigt!$D:$D,F$3)","v":0},{"$f":"SUMIFS(Oversigt!$E:$E,Oversigt!$C:$C,$B11,Oversigt!$D:$D,G$3)","v":1},{"$f":"SUMIFS(Oversigt!$E:$E,Oversigt!$C:$C,$B11,Oversigt!$D:$D,H$3)","v":1},{"$f":"SUMIFS(Oversigt!$H:$H,Oversigt!$C:$C,$B11,Oversigt!$D:$D,I$3)","v":0},{"$f":"SUMIFS(Oversigt!$H:$H,Oversigt!$C:$C,$B11,Oversigt!$D:$D,J$3)","v":0},{"$f":"SUMIFS(Oversigt!$H:$H,Oversigt!$C:$C,$B11,Oversigt!$D:$D,K$3)","v":0},{"$f":"SUMIFS(Oversigt!$H:$H,Oversigt!$C:$C,$B11,Oversigt!$D:$D,L$3)","v":0},{"$f":"SUMIFS(Oversigt!$H:$H,Oversigt!$C:$C,$B11,Oversigt!$D:$D,M$3)","v":0},{"$f":"SUMIFS(Oversigt!$H:$H,Oversigt!$C:$C,$B11,Oversigt!$D:$D,N$3)","v":0},{"$f":"SUMIFS(Oversigt!$K:$K,Oversigt!$C:$C,$B11,Oversigt!$D:$D,O$3)","v":0},{"$f":"SUMIFS(Oversigt!$K:$K,Oversigt!$C:$C,$B11,Oversigt!$D:$D,P$3)","v":0},{"$f":"SUMIFS(Oversigt!$K:$K,Oversigt!$C:$C,$B11,Oversigt!$D:$D,Q$3)","v":0},{"$f":"SUMIFS(Oversigt!$K:$K,Oversigt!$C:$C,$B11,Oversigt!$D:$D,R$3)","v":0},{"$f":"SUMIFS(Oversigt!$K:$K,Oversigt!$C:$C,$B11,Oversigt!$D:$D,S$3)","v":2},{"$f":"SUMIFS(Oversigt!$K:$K,Oversigt!$C:$C,$B11,Oversigt!$D:$D,T$3)","v":2},{"$f":"SUMIFS(Oversigt!$N:$N,Oversigt!$C:$C,$B11,Oversigt!$D:$D,U$3)","v":0},{"$f":"SUMIFS(Oversigt!$N:$N,Oversigt!$C:$C,$B11,Oversigt!$D:$D,V$3)","v":0},{"$f":"SUMIFS(Oversigt!$N:$N,Oversigt!$C:$C,$B11,Oversigt!$D:$D,W$3)","v":0},{"$f":"SUMIFS(Oversigt!$N:$N,Oversigt!$C:$C,$B11,Oversigt!$D:$D,X$3)","v":0},{"$f":"SUMIFS(Oversigt!$N:$N,Oversigt!$C:$C,$B11,Oversigt!$D:$D,Y$3)","v":1},{"$f":"SUMIFS(Oversigt!$N:$N,Oversigt!$C:$C,$B11,Oversigt!$D:$D,Z$3)","v":1},{"$f":"SUMIFS(Oversigt!$E:$E,Oversigt!$C:$C,$B11,Oversigt!$D:$D,AA$3)+SUMIFS(Oversigt!$H:$H,Oversigt!$C:$C,$B11,Oversigt!$D:$D,AA$3)+SUMIFS(Oversigt!$K:$K,Oversigt!$C:$C,$B11,Oversigt!$D:$D,AA$3)+SUMIFS(Oversigt!$N:$N,Oversigt!$C:$C,$B11,Oversigt!$D:$D,AA$3)","v":0},{"$f":"SUMIFS(Oversigt!$E:$E,Oversigt!$C:$C,$B11,Oversigt!$D:$D,AB$3)+SUMIFS(Oversigt!$H:$H,Oversigt!$C:$C,$B11,Oversigt!$D:$D,AB$3)+SUMIFS(Oversigt!$K:$K,Oversigt!$C:$C,$B11,Oversigt!$D:$D,AB$3)+SUMIFS(Oversigt!$N:$N,Oversigt!$C:$C,$B11,Oversigt!$D:$D,AB$3)","v":0},{"$f":"SUMIFS(Oversigt!$E:$E,Oversigt!$C:$C,$B11,Oversigt!$D:$D,AC$3)+SUMIFS(Oversigt!$H:$H,Oversigt!$C:$C,$B11,Oversigt!$D:$D,AC$3)+SUMIFS(Oversigt!$K:$K,Oversigt!$C:$C,$B11,Oversigt!$D:$D,AC$3)+SUMIFS(Oversigt!$N:$N,Oversigt!$C:$C,$B11,Oversigt!$D:$D,AC$3)","v":0},{"$f":"SUMIFS(Oversigt!$E:$E,Oversigt!$C:$C,$B11,Oversigt!$D:$D,AD$3)+SUMIFS(Oversigt!$H:$H,Oversigt!$C:$C,$B11,Oversigt!$D:$D,AD$3)+SUMIFS(Oversigt!$K:$K,Oversigt!$C:$C,$B11,Oversigt!$D:$D,AD$3)+SUMIFS(Oversigt!$N:$N,Oversigt!$C:$C,$B11,Oversigt!$D:$D,AD$3)","v":0},{"$f":"SUMIFS(Oversigt!$E:$E,Oversigt!$C:$C,$B11,Oversigt!$D:$D,AE$3)+SUMIFS(Oversigt!$H:$H,Oversigt!$C:$C,$B11,Oversigt!$D:$D,AE$3)+SUMIFS(Oversigt!$K:$K,Oversigt!$C:$C,$B11,Oversigt!$D:$D,AE$3)+SUMIFS(Oversigt!$N:$N,Oversigt!$C:$C,$B11,Oversigt!$D:$D,AE$3)","v":4},{"$f":"SUMIFS(Oversigt!$E:$E,Oversigt!$C:$C,$B11,Oversigt!$D:$D,AF$3)+SUMIFS(Oversigt!$H:$H,Oversigt!$C:$C,$B11,Oversigt!$D:$D,AF$3)+SUMIFS(Oversigt!$K:$K,Oversigt!$C:$C,$B11,Oversigt!$D:$D,AF$3)+SUMIFS(Oversigt!$N:$N,Oversigt!$C:$C,$B11,Oversigt!$D:$D,AF$3)","v":4}]
[null,"Intern opfølgning",{"$f":"SUMIFS(Oversigt!$E:$E,Oversigt!$C:$C,$B12,Oversigt!$D:$D,C$3)","v":0},{"$f":"SUMIFS(Oversigt!$E:$E,Oversigt!$C:$C,$B12,Oversigt!$D:$D,D$3)","v":0},{"$f":"SUMIFS(Oversigt!$E:$E,Oversigt!$C:$C,$B12,Oversigt!$D:$D,E$3)","v":0},{"$f":"SUMIFS(Oversigt!$E:$E,Oversigt!$C:$C,$B12,Oversigt!$D:$D,F$3)","v":0},{"$f":"SUMIFS(Oversigt!$E:$E,Oversigt!$C:$C,$B12,Oversigt!$D:$D,G$3)","v":1},{"$f":"SUMIFS(Oversigt!$E:$E,Oversigt!$C:$C,$B12,Oversigt!$D:$D,H$3)","v":1},{"$f":"SUMIFS(Oversigt!$H:$H,Oversigt!$C:$C,$B12,Oversigt!$D:$D,I$3)","v":0},{"$f":"SUMIFS(Oversigt!$H:$H,Oversigt!$C:$C,$B12,Oversigt!$D:$D,J$3)","v":0},{"$f":"SUMIFS(Oversigt!$H:$H,Oversigt!$C:$C,$B12,Oversigt!$D:$D,K$3)","v":0},{"$f":"SUMIFS(Oversigt!$H:$H,Oversigt!$C:$C,$B12,Oversigt!$D:$D,L$3)","v":0},{"$f":"SUMIFS(Oversigt!$H:$H,Oversigt!$C:$C,$B12,Oversigt!$D:$D,M$3)","v":3},{"$f":"SUMIFS(Oversigt!$H:$H,Oversigt!$C:$C,$B12,Oversigt!$D:$D,N$3)","v":3},{"$f":"SUMIFS(Oversigt!$K:$K,Oversigt!$C:$C,$B12,Oversigt!$D:$D,O$3)","v":0},{"$f":"SUMIFS(Oversigt!$K:$K,Oversigt!$C:$C,$B12,Oversigt!$D:$D,P$3)","v":0},{"$f":"SUMIFS(Oversigt!$K:$K,Oversigt!$C:$C,$B12,Oversigt!$D:$D,Q$3)","v":0},{"$f":"SUMIFS(Oversigt!$K:$K,Oversigt!$C:$C,$B12,Oversigt!$D:$D,R$3)","v":0},{"$f":"SUMIFS(Oversigt!$K:$K,Oversigt!$C:$C,$B12,Oversigt!$D:$D,S$3)","v":2},{"$f":"SUMIFS(Oversigt!$K:$K,Oversigt!$C:$C,$B12,Oversigt!$D:$D,T$3)","v":2},{"$f":"SUMIFS(Oversigt!$N:$N,Oversigt!$C:$C,$B12,Oversigt!$D:$D,U$3)","v":0},{"$f":"SUMIFS(Oversigt!$N:$N,Oversigt!$C:$C,$B12,Oversigt!$D:$D,V$3)","v":0},{"$f":"SUMIFS(Oversigt!$N:$N,Oversigt!$C:$C,$B12,Oversigt!$D:$D,W$3)","v":0},{"$f":"SUMIFS(Oversigt!$N:$N,Oversigt!$C:$C,$B12,Oversigt!$D:$D,X$3)","v":0},{"$f":"SUMIFS(Oversigt!$N:$N,Oversigt!$C:$C,$B12,Oversigt!$D:$D,Y$3)","v":3},{"$f":"SUMIFS(Oversigt!$N:$N,Oversigt!$C:$C,$B12,Oversigt!$D:$D,Z$3)","v":3},{"$f":"SUMIFS(Oversigt!$E:$E,Oversigt!$C:$C,$B12,Oversigt!$D:$D,AA$3)+SUMIFS(Oversigt!$H:$H,Oversigt!$C:$C,$B12,Oversigt!$D:$D,AA$3)+SUMIFS(Oversigt!$K:$K,Oversigt!$C:$C,$B12,Oversigt!$D:$D,AA$3)+SUMIFS(Oversigt!$N:$N,Oversigt!$C:$C,$B12,Oversigt!$D:$D,AA$3)","v":0},{"$f":"SUMIFS(Oversigt!$E:$E,Oversigt!$C:$C,$B12,Oversigt!$D:$D,AB$3)+SUMIFS(Oversigt!$H:$H,Oversigt!$C:$C,$B12,Oversigt!$D:$D,AB$3)+SUMIFS(Oversigt!$K:$K,Oversigt!$C:$C,$B12,Oversigt!$D:$D,AB$3)+SUMIFS(Oversigt!$N:$N,Oversigt!$C:$C,$B12,Oversigt!$D:$D,AB$3)","v":0},{"$f":"SUMIFS(Oversigt!$E:$E,Oversigt!$C:$C,$B12,Oversigt!$D:$D,AC$3)+SUMIFS(Oversigt!$H:$H,Oversigt!$C:$C,$B12,Oversigt!$D:$D,AC$3)+SUMIFS(Oversigt!$K:$K,Oversigt!$C:$C,$B12,Oversigt!$D:$D,AC$3)+SUMIFS(Oversigt!$N:$N,Oversigt!$C:$C,$B12,Oversigt!$D:$D,AC$3)","v":0},{"$f":"SUMIFS(Oversigt!$E:$E,Oversigt!$C:$C,$B12,Oversigt!$D:$D,AD$3)+SUMIFS(Oversigt!$H:$H,Oversigt!$C:$C,$B12,Oversigt!$D:$D,AD$3)+SUMIFS(Oversigt!$K:$K,Oversigt!$C:$C,$B12,Oversigt!$D:$D,AD$3)+SUMIFS(Oversigt!$N:$N,Oversigt!$C:$C,$B12,Oversigt!$D:$D,AD$3)","v":0},{"$f":"SUMIFS(Oversigt!$E:$E,Oversigt!$C:$C,$B12,Oversigt!$D:$D,AE$3)+SUMIFS(Oversigt!$H:$H,Oversigt!$C:$C,$B12,Oversigt!$D:$D,AE$3)+SUMIFS(Oversigt!$K:$K,Oversigt!$C:$C,$B12,Oversigt!$D:$D,AE$3)+SUMIFS(Oversigt!$N:$N,Oversigt!$C:$C,$B12,Oversigt!$D:$D,AE$3)","v":9},{"$f":"SUMIFS(Oversigt!$E:$E,Oversigt!$C:$C,$B12,Oversigt!$D:$D,AF$3)+SUMIFS(Oversigt!$H:$H,Oversigt!$C:$C,$B12,Oversigt!$D:$D,AF$3)+SUMIFS(Oversigt!$K:$K,Oversigt!$C:$C,$B12,Oversigt!$D:$D,AF$3)+SUMIFS(Oversigt!$N:$N,Oversigt!$C:$C,$B12,Oversigt!$D:$D,AF$3)","v":9}]
[]
[null,"Type","PLAN",null,null,null,null,null,"DO",null,null,null,null,null,"CHECK",null,null,null,null,null,"ACT",null,null,null,null,null,"Alle"]
[null,"Vægt","Ja","Delvist","Nej","Ikke relevant","Ikke sat","TOTAL","Ja","Delvist","Nej","Ikke relevant","Ikke sat","TOTAL","Ja","Delvist","Nej","Ikke relevant","Ikke sat","TOTAL","Ja","Delvist","Nej","Ikke relevant","Ikke sat","TOTAL","Ja","Delvist","Nej","Ikke relevant","Ikke sat","TOTAL"]
[null,"Risikovurdering",{"$f":"SUMIFS(Oversigt!$F:$F,Oversigt!$C:$C,$B16,Oversigt!$D:$D,C$3)","v":0},{"$f":"SUMIFS(Oversigt!$F:$F,Oversigt!$C:$C,$B16,Oversigt!$D:$D,D$3)","v":0},{"$f":"SUMIFS(Oversigt!$F:$F,Oversigt!$C:$C,$B16,Oversigt!$D:$D,E$3)","v":0},{"$f":"SUMIFS(Oversigt!$F:$F,Oversigt!$C:$C,$B16,Oversigt!$D:$D,F$3)","v":0},{"$f":"SUMIFS(Oversigt!$F:$F,Oversigt!$C:$C,$B16,Oversigt!$D:$D,G$3)","v":6.4516129032258063E-2},{"$f":"SUMIFS(Oversigt!$F:$F,Oversigt!$C:$C,$B16,Oversigt!$D:$D,H$3)","v":0},{"$f":"SUMIFS(Oversigt!$I:$I,Oversigt!$C:$C,$B16,Oversigt!$D:$D,I$3)","v":0},{"$f":"SUMIFS(Oversigt!$I:$I,Oversigt!$C:$C,$B16,Oversigt!$D:$D,J$3)","v":0},{"$f":"SUMIFS(Oversigt!$I:$I,Oversigt!$C:$C,$B16,Oversigt!$D:$D,K$3)","v":0},{"$f":"SUMIFS(Oversigt!$I:$I,Oversigt!$C:$C,$B16,Oversigt!$D:$D,L$3)","v":0},{"$f":"SUMIFS(Oversigt!$I:$I,Oversigt!$C:$C,$B16,Oversigt!$D:$D,M$3)","v":0.1388888888888889},{"$f":"SUMIFS(Oversigt!$I:$I,Oversigt!$C:$C,$B16,Oversigt!$D:$D,N$3)","v":0},{"$f":"SUMIFS(Oversigt!$L:$L,Oversigt!$C:$C,$B16,Oversigt!$D:$D,O$3)","v":0},{"$f":"SUMIFS(Oversigt!$L:$L,Oversigt!$C:$C,$B16,Oversigt!$D:$D,P$3)","v":0},{"$f":"SUMIFS(Oversigt!$L:$L,Oversigt!$C:$C,$B16,Oversigt!$D:$D,Q$3)","v":0},{"$f":"SUMIFS(Oversigt!$L:$L,Oversigt!$C:$C,$B16,Oversigt!$D:$D,R$3)","v":0},{"$f":"SUMIFS(Oversigt!$L:$L,Oversigt!$C:$C,$B16,Oversigt!$D:$D,S$3)","v":0.1111111111111111},{"$f":"SUMIFS(Oversigt!$L:$L,Oversigt!$C:$C,$B16,Oversigt!$D:$D,T$3)","v":0},{"$f":"SUMIFS(Oversigt!$O:$O,Oversigt!$C:$C,$B16,Oversigt!$D:$D,U$3)","v":0},{"$f":"SUMIFS(Oversigt!$O:$O,Oversigt!$C:$C,$B16,Oversigt!$D:$D,V$3)","v":0},{"$f":"SUMIFS(Oversigt!$O:$O,Oversigt!$C:$C,$B16,Oversigt!$D:$D,W$3)","v":0},{"$f":"SUMIFS(Oversigt!$O:$O,Oversigt!$C:$C,$B16,Oversigt!$D:$D,X$3)","v":0},{"$f":"SUMIFS(Oversigt!$O:$O,Oversigt!$C:$C,$B16,Oversigt!$D:$D,Y$3)","v":6.25E-2},{"$f":"SUMIFS(Oversigt!$O:$O,Oversigt!$C:$C,$B16,Oversigt!$D:$D,Z$3)","v":0},{"$f":"AVERAGE(C16,I16,O16,U16)","v":0},{"$f":"AVERAGE(D16,J16,P16,V16)","v":0},0,0,9.4254032258064516E-2,0]
[null,"Risikohåndtering",{"$f":"SUMIFS(Oversigt!$F:$F,Oversigt!$C:$C,$B17,Oversigt!$D:$D,C$3)","v":0},{"$f":"SUMIFS(Oversigt!$F:$F,Oversigt!$C:$C,$B17,Oversigt!$D:$D,D$3)","v":0},{"$f":"SUMIFS(Oversigt!$F:$F,Oversigt!$C:$C,$B17,Oversigt!$D:$D,E$3)","v":0},{"$f":"SUMIFS(Oversigt!$F:$F,Oversigt!$C:$C,$B17,Oversigt!$D:$D,F$3)","v":0},{"$f":"SUMIFS(Oversigt!$F:$F,Oversigt!$C:$C,$B17,Oversigt!$D:$D,G$3)","v":9.6774193548387094E-2},{"$f":"SUMIFS(Oversigt!$F:$F,Oversigt!$C:$C,$B17,Oversigt!$D:$D,H$3)","v":0},{"$f":"SUMIFS(Oversigt!$I:$I,Oversigt!$C:$C,$B17,Oversigt!$D:$D,I$3)","v":0},{"$f":"SUMIFS(Oversigt!$I:$I,Oversigt!$C:$C,$B17,Oversigt!$D:$D,J$3)","v":0},{"$f":"SUMIFS(Oversigt!$I:$I,Oversigt!$C:$C,$B17,Oversigt!$D:$D,K$3)","v":0},{"$f":"SUMIFS(Oversigt!$I:$I,Oversigt!$C:$C,$B17,Oversigt!$D:$D,L$3)","v":0},{"$f":"SUMIFS(Oversigt!$I:$I,Oversigt!$C:$C,$B17,Oversigt!$D:$D,M$3)","v":5.5555555555555552E-2},{"$f":"SUMIFS(Oversigt!$I:$I,Oversigt!$C:$C,$B17,Oversigt!$D:$D,N$3)","v":0},{"$f":"SUMIFS(Oversigt!$L:$L,Oversigt!$C:$C,$B17,Oversigt!$D:$D,O$3)","v":0},{"$f":"SUMIFS(Oversigt!$L:$L,Oversigt!$C:$C,$B17,Oversigt!$D:$D,P$3)","v":0},{"$f":"SUMIFS(Oversigt!$L:$L,Oversigt!$C:$C,$B17,Oversigt!$D:$D,Q$3)","v":0},{"$f":"SUMIFS(Oversigt!$L:$L,Oversigt!$C:$C,$B17,Oversigt!$D:$D,R$3)","v":0},{"$f":"SUMIFS(Oversigt!$L:$L,Oversigt!$C:$C,$B17,Oversigt!$D:$D,S$3)","v":0.1111111111111111},{"$f":"SUMIFS(Oversigt!$L:$L,Oversigt!$C:$C,$B17,Oversigt!$D:$D,T$3)","v":0},{"$f":"SUMIFS(Oversigt!$O:$O,Oversigt!$C:$C,$B17,Oversigt!$D:$D,U$3)","v":0},{"$f":"SUMIFS(Oversigt!$O:$O,Oversigt!$C:$C,$B17,Oversigt!$D:$D,V$3)","v":0},{"$f":"SUMIFS(Oversigt!$O:$O,Oversigt!$C:$C,$B17,Oversigt!$D:$D,W$3)","v":0},{"$f":"SUMIFS(Oversigt!$O:$O,Oversigt!$C:$C,$B17,Oversigt!$D:$D,X$3)","v":0},{"$f":"SUMIFS(Oversigt!$O:$O,Oversigt!$C:$C,$B17,Oversigt!$D:$D,Y$3)","v":0.125},{"$f":"SUMIFS(Oversigt!$O:$O,Oversigt!$C:$C,$B17,Oversigt!$D:$D,Z$3)","v":0},{"$f":"AVERAGE(C17,I17,O17,U17)","v":0},0,0,0,9.7110215053763438E-2,0]
[null,"ISMS",{"$f":"SUMIFS(Oversigt!$F:$F,Oversigt!$C:$C,$B18,Oversigt!$D:$D,C$3)","v":0},{"$f":"SUMIFS(Oversigt!$F:$F,Oversigt!$C:$C,$B18,Oversigt!$D:$D,D$3)","v":0},{"$f":"SUMIFS(Oversigt!$F:$F,Oversigt!$C:$C,$B18,Oversigt!$D:$D,E$3)","v":0},{"$f":"SUMIFS(Oversigt!$F:$F,Oversigt!$C:$C,$B18,Oversigt!$D:$D,F$3)","v":0},{"$f":"SUMIFS(Oversigt!$F:$F,Oversigt!$C:$C,$B18,Oversigt!$D:$D,G$3)","v":0.12903225806451613},{"$f":"SUMIFS(Oversigt!$F:$F,Oversigt!$C:$C,$B18,Oversigt!$D:$D,H$3)","v":0},{"$f":"SUMIFS(Oversigt!$I:$I,Oversigt!$C:$C,$B18,Oversigt!$D:$D,I$3)","v":0},{"$f":"SUMIFS(Oversigt!$I:$I,Oversigt!$C:$C,$B18,Oversigt!$D:$D,J$3)","v":0},{"$f":"SUMIFS(Oversigt!$I:$I,Oversigt!$C:$C,$B18,Oversigt!$D:$D,K$3)","v":0},{"$f":"SUMIFS(Oversigt!$I:$I,Oversigt!$C:$C,$B18,Oversigt!$D:$D,L$3)","v":0},{"$f":"SUMIFS(Oversigt!$I:$I,Oversigt!$C:$C,$B18,Oversigt!$D:$D,M$3)","v":0.19444444444444445},{"$f":"SUMIFS(Oversigt!$I:$I,Oversigt!$C:$C,$B18,Oversigt!$D:$D,N$3)","v":0},{"$f":"SUMIFS(Oversigt!$L:$L,Oversigt!$C:$C,$B18,Oversigt!$D:$D,O$3)","v":0},{"$f":"SUMIFS(Oversigt!$L:$L,Oversigt!$C:$C,$B18,Oversigt!$D:$D,P$3)","v":0},{"$f":"SUMIFS(Oversigt!$L:$L,Oversigt!$C:$C,$B18,Oversigt!$D:$D,Q$3)","v":0},{"$f":"SUMIFS(Oversigt!$L:$L,Oversigt!$C:$C,$B18,Oversigt!$D:$D,R$3)","v":0},{"$f":"SUMIFS(Oversigt!$L:$L,Oversigt!$C:$C,$B18,Oversigt!$D:$D,S$3)","v":0.1111111111111111},{"$f":"SUMIFS(Oversigt!$L:$L,Oversigt!$C:$C,$B18,Oversigt!$D:$D,T$3)","v":0},{"$f":"SUMIFS(Oversigt!$O:$O,Oversigt!$C:$C,$B18,Oversigt!$D:$D,U$3)","v":0},{"$f":"SUMIFS(Oversigt!$O:$O,Oversigt!$C:$C,$B18,Oversigt!$D:$D,V$3)","v":0},{"$f":"SUMIFS(Oversigt!$O:$O,Oversigt!$C:$C,$B18,Oversigt!$D:$D,W$3)","v":0},{"$f":"SUMIFS(Oversigt!$O:$O,Oversigt!$C:$C,$B18,Oversigt!$D:$D,X$3)","v":0},{"$f":"SUMIFS(Oversigt!$O:$O,Oversigt!$C:$C,$B18,Oversigt!$D:$D,Y$3)","v":6.25E-2},{"$f":"SUMIFS(Oversigt!$O:$O,Oversigt!$C:$C,$B18,Oversigt!$D:$D,Z$3)","v":0},0,0,0,0,0.12427195340501791,0]
[null,"Politik",{"$f":"SUMIFS(Oversigt!$F:$F,Oversigt!$C:$C,$B19,Oversigt!$D:$D,C$3)","v":0},{"$f":"SUMIFS(Oversigt!$F:$F,Oversigt!$C:$C,$B19,Oversigt!$D:$D,D$3)","v":0},{"$f":"SUMIFS(Oversigt!$F:$F,Oversigt!$C:$C,$B19,Oversigt!$D:$D,E$3)","v":0},{"$f":"SUMIFS(Oversigt!$F:$F,Oversigt!$C:$C,$B19,Oversigt!$D:$D,F$3)","v":0},{"$f":"SUMIFS(Oversigt!$F:$F,Oversigt!$C:$C,$B19,Oversigt!$D:$D,G$3)","v":9.6774193548387094E-2},{"$f":"SUMIFS(Oversigt!$F:$F,Oversigt!$C:$C,$B19,Oversigt!$D:$D,H$3)","v":0},{"$f":"SUMIFS(Oversigt!$I:$I,Oversigt!$C:$C,$B19,Oversigt!$D:$D,I$3)","v":0},{"$f":"SUMIFS(Oversigt!$I:$I,Oversigt!$C:$C,$B19,Oversigt!$D:$D,J$3)","v":0},{"$f":"SUMIFS(Oversigt!$I:$I,Oversigt!$C:$C,$B19,Oversigt!$D:$D,K$3)","v":0},{"$f":"SUMIFS(Oversigt!$I:$I,Oversigt!$C:$C,$B19,Oversigt!$D:$D,L$3)","v":0},{"$f":"SUMIFS(Oversigt!$I:$I,Oversigt!$C:$C,$B19,Oversigt!$D:$D,M$3)","v":8.3333333333333329E-2},{"$f":"SUMIFS(Oversigt!$I:$I,Oversigt!$C:$C,$B19,Oversigt!$D:$D,N$3)","v":0},{"$f":"SUMIFS(Oversigt!$L:$L,Oversigt!$C:$C,$B19,Oversigt!$D:$D,O$3)","v":0},{"$f":"SUMIFS(Oversigt!$L:$L,Oversigt!$C:$C,$B19,Oversigt!$D:$D,P$3)","v":0},{"$f":"SUMIFS(Oversigt!$L:$L,Oversigt!$C:$C,$B19,Oversigt!$D:$D,Q$3)","v":0},{"$f":"SUMIFS(Oversigt!$L:$L,Oversigt!$C:$C,$B19,Oversigt!$D:$D,R$3)","v":0},{"$f":"SUMIFS(Oversigt!$L:$L,Oversigt!$C:$C,$B19,Oversigt!$D:$D,S$3)","v":7.407407407407407E-2},{"$f":"SUMIFS(Oversigt!$L:$L,Oversigt!$C:$C,$B19,Oversigt!$D:$D,T$3)","v":0},{"$f":"SUMIFS(Oversigt!$O:$O,Oversigt!$C:$C,$B19,Oversigt!$D:$D,U$3)","v":0},{"$f":"SUMIFS(Oversigt!$O:$O,Oversigt!$C:$C,$B19,Oversigt!$D:$D,V$3)","v":0},{"$f":"SUMIFS(Oversigt!$O:$O,Oversigt!$C:$C,$B19,Oversigt!$D:$D,W$3)","v":0},{"$f":"SUMIFS(Oversigt!$O:$O,Oversigt!$C:$C,$B19,Oversigt!$D:$D,X$3)","v":0},{"$f":"SUMIFS(Oversigt!$O:$O,Oversigt!$C:$C,$B19,Oversigt!$D:$D,Y$3)","v":0.125},{"$f":"SUMIFS(Oversigt!$O:$O,Oversigt!$C:$C,$B19,Oversigt!$D:$D,Z$3)","v":0},0,0,0,0,9.4795400238948627E-2,0]
[null,"Ledelsesforankring",{"$f":"SUMIFS(Oversigt!$F:$F,Oversigt!$C:$C,$B20,Oversigt!$D:$D,C$3)","v":0},{"$f":"SUMIFS(Oversigt!$F:$F,Oversigt!$C:$C,$B20,Oversigt!$D:$D,D$3)","v":0},{"$f":"SUMIFS(Oversigt!$F:$F,Oversigt!$C:$C,$B20,Oversigt!$D:$D,E$3)","v":0},{"$f":"SUMIFS(Oversigt!$F:$F,Oversigt!$C:$C,$B20,Oversigt!$D:$D,F$3)","v":0},{"$f":"SUMIFS(Oversigt!$F:$F,Oversigt!$C:$C,$B20,Oversigt!$D:$D,G$3)","v":0},{"$f":"SUMIFS(Oversigt!$F:$F,Oversigt!$C:$C,$B20,Oversigt!$D:$D,H$3)","v":0},{"$f":"SUMIFS(Oversigt!$I:$I,Oversigt!$C:$C,$B20,Oversigt!$D:$D,I$3)","v":0},{"$f":"SUMIFS(Oversigt!$I:$I,Oversigt!$C:$C,$B20,Oversigt!$D:$D,J$3)","v":0},{"$f":"SUMIFS(Oversigt!$I:$I,Oversigt!$C:$C,$B20,Oversigt!$D:$D,K$3)","v":0},{"$f":"SUMIFS(Oversigt!$I:$I,Oversigt!$C:$C,$B20,Oversigt!$D:$D,L$3)","v":0},{"$f":"SUMIFS(Oversigt!$I:$I,Oversigt!$C:$C,$B20,Oversigt!$D:$D,M$3)","v":0.1111111111111111},{"$f":"SUMIFS(Oversigt!$I:$I,Oversigt!$C:$C,$B20,Oversigt!$D:$D,N$3)","v":0},{"$f":"SUMIFS(Oversigt!$L:$L,Oversigt!$C:$C,$B20,Oversigt!$D:$D,O$3)","v":0},{"$f":"SUMIFS(Oversigt!$L:$L,Oversigt!$C:$C,$B20,Oversigt!$D:$D,P$3)","v":0},{"$f":"SUMIFS(Oversigt!$L:$L,Oversigt!$C:$C,$B20,Oversigt!$D:$D,Q$3)","v":0},{"$f":"SUMIFS(Oversigt!$L:$L,Oversigt!$C:$C,$B20,Oversigt!$D:$D,R$3)","v":0},{"$f":"SUMIFS(Oversigt!$L:$L,Oversigt!$C:$C,$B20,Oversigt!$D:$D,S$3)","v":0.1111111111111111},{"$f":"SUMIFS(Oversigt!$L:$L,Oversigt!$C:$C,$B20,Oversigt!$D:$D,T$3)","v":0},{"$f":"SUMIFS(Oversigt!$O:$O,Oversigt!$C:$C,$B20,Oversigt!$D:$D,U$3)","v":0},{"$f":"SUMIFS(Oversigt!$O:$O,Oversigt!$C:$C,$B20,Oversigt!$D:$D,V$3)","v":0},{"$f":"SUMIFS(Oversigt!$O:$O,Oversigt!$C:$C,$B20,Oversigt!$D:$D,W$3)","v":0},{"$f":"SUMIFS(Oversigt!$O:$O,Oversigt!$C:$C,$B20,Oversigt!$D:$D,X$3)","v":0},{"$f":"SUMIFS(Oversigt!$O:$O,Oversigt!$C:$C,$B20,Oversigt!$D:$D,Y$3)","v":0.125},{"$f":"SUMIFS(Oversigt!$O:$O,Oversigt!$C:$C,$B20,Oversigt!$D:$D,Z$3)","v":0},0,0,0,0,8.6805555555555552E-2,0]
[null,"Leverandørstyring",{"$f":"SUMIFS(Oversigt!$F:$F,Oversigt!$C:$C,$B21,Oversigt!$D:$D,C$3)","v":0},{"$f":"SUMIFS(Oversigt!$F:$F,Oversigt!$C:$C,$B21,Oversigt!$D:$D,D$3)","v":0},{"$f":"SUMIFS(Oversigt!$F:$F,Oversigt!$C:$C,$B21,Oversigt!$D:$D,E$3)","v":0},{"$f":"SUMIFS(Oversigt!$F:$F,Oversigt!$C:$C,$B21,Oversigt!$D:$D,F$3)","v":0},{"$f":"SUMIFS(Oversigt!$F:$F,Oversigt!$C:$C,$B21,Oversigt!$D:$D,G$3)","v":0.29032258064516131},{"$f":"SUMIFS(Oversigt!$F:$F,Oversigt!$C:$C,$B21,Oversigt!$D:$D,H$3)","v":0},{"$f":"SUMIFS(Oversigt!$I:$I,Oversigt!$C:$C,$B21,Oversigt!$D:$D,I$3)","v":0},{"$f":"SUMIFS(Oversigt!$I:$I,Oversigt!$C:$C,$B21,Oversigt!$D:$D,J$3)","v":0},{"$f":"SUMIFS(Oversigt!$I:$I,Oversigt!$C:$C,$B21,Oversigt!$D:$D,K$3)","v":0},{"$f":"SUMIFS(Oversigt!$I:$I,Oversigt!$C:$C,$B21,Oversigt!$D:$D,L$3)","v":0},{"$f":"SUMIFS(Oversigt!$I:$I,Oversigt!$C:$C,$B21,Oversigt!$D:$D,M$3)","v":0.22222222222222221},{"$f":"SUMIFS(Oversigt!$I:$I,Oversigt!$C:$C,$B21,Oversigt!$D:$D,N$3)","v":0},{"$f":"SUMIFS(Oversigt!$L:$L,Oversigt!$C:$C,$B21,Oversigt!$D:$D,O$3)","v":0},{"$f":"SUMIFS(Oversigt!$L:$L,Oversigt!$C:$C,$B21,Oversigt!$D:$D,P$3)","v":0},{"$f":"SUMIFS(Oversigt!$L:$L,Oversigt!$C:$C,$B21,Oversigt!$D:$D,Q$3)","v":0},{"$f":"SUMIFS(Oversigt!$L:$L,Oversigt!$C:$C,$B21,Oversigt!$D:$D,R$3)","v":0},{"$f":"SUMIFS(Oversigt!$L:$L,Oversigt!$C:$C,$B21,Oversigt!$D:$D,S$3)","v":0.25925925925925924},{"$f":"SUMIFS(Oversigt!$L:$L,Oversigt!$C:$C,$B21,Oversigt!$D:$D,T$3)","v":0},{"$f":"SUMIFS(Oversigt!$O:$O,Oversigt!$C:$C,$B21,Oversigt!$D:$D,U$3)","v":0},{"$f":"SUMIFS(Oversigt!$O:$O,Oversigt!$C:$C,$B21,Oversigt!$D:$D,V$3)","v":0},{"$f":"SUMIFS(Oversigt!$O:$O,Oversigt!$C:$C,$B21,Oversigt!$D:$D,W$3)","v":0},{"$f":"SUMIFS(Oversigt!$O:$O,Oversigt!$C:$C,$B21,Oversigt!$D:$D,X$3)","v":0},{"$f":"SUMIFS(Oversigt!$O:$O,Oversigt!$C:$C,$B21,Oversigt!$D:$D,Y$3)","v":0.125},{"$f":"SUMIFS(Oversigt!$O:$O,Oversigt!$C:$C,$B21,Oversigt!$D:$D,Z$3)","v":0},0,0,0,0,0.22420101553166072,0]
[null,"It-beredskab",{"$f":"SUMIFS(Oversigt!$F:$F,Oversigt!$C:$C,$B22,Oversigt!$D:$D,C$3)","v":0},{"$f":"SUMIFS(Oversigt!$F:$F,Oversigt!$C:$C,$B22,Oversigt!$D:$D,D$3)","v":0},{"$f":"SUMIFS(Oversigt!$F:$F,Oversigt!$C:$C,$B22,Oversigt!$D:$D,E$3)","v":0},{"$f":"SUMIFS(Oversigt!$F:$F,Oversigt!$C:$C,$B22,Oversigt!$D:$D,F$3)","v":0},{"$f":"SUMIFS(Oversigt!$F:$F,Oversigt!$C:$C,$B22,Oversigt!$D:$D,G$3)","v":0.25806451612903225},{"$f":"SUMIFS(Oversigt!$F:$F,Oversigt!$C:$C,$B22,Oversigt!$D:$D,H$3)","v":0},{"$f":"SUMIFS(Oversigt!$I:$I,Oversigt!$C:$C,$B22,Oversigt!$D:$D,I$3)","v":0},{"$f":"SUMIFS(Oversigt!$I:$I,Oversigt!$C:$C,$B22,Oversigt!$D:$D,J$3)","v":0},{"$f":"SUMIFS(Oversigt!$I:$I,Oversigt!$C:$C,$B22,Oversigt!$D:$D,K$3)","v":0},{"$f":"SUMIFS(Oversigt!$I:$I,Oversigt!$C:$C,$B22,Oversigt!$D:$D,L$3)","v":0},{"$f":"SUMIFS(Oversigt!$I:$I,Oversigt!$C:$C,$B22,Oversigt!$D:$D,M$3)","v":0.1111111111111111},{"$f":"SUMIFS(Oversigt!$I:$I,Oversigt!$C:$C,$B22,Oversigt!$D:$D,N$3)","v":0},{"$f":"SUMIFS(Oversigt!$L:$L,Oversigt!$C:$C,$B22,Oversigt!$D:$D,O$3)","v":0},{"$f":"SUMIFS(Oversigt!$L:$L,Oversigt!$C:$C,$B22,Oversigt!$D:$D,P$3)","v":0},{"$f":"SUMIFS(Oversigt!$L:$L,Oversigt!$C:$C,$B22,Oversigt!$D:$D,Q$3)","v":0},{"$f":"SUMIFS(Oversigt!$L:$L,Oversigt!$C:$C,$B22,Oversigt!$D:$D,R$3)","v":0},{"$f":"SUMIFS(Oversigt!$L:$L,Oversigt!$C:$C,$B22,Oversigt!$D:$D,S$3)","v":7.407407407407407E-2},{"$f":"SUMIFS(Oversigt!$L:$L,Oversigt!$C:$C,$B22,Oversigt!$D:$D,T$3)","v":0},{"$f":"SUMIFS(Oversigt!$O:$O,Oversigt!$C:$C,$B22,Oversigt!$D:$D,U$3)","v":0},{"$f":"SUMIFS(Oversigt!$O:$O,Oversigt!$C:$C,$B22,Oversigt!$D:$D,V$3)","v":0},{"$f":"SUMIFS(Oversigt!$O:$O,Oversigt!$C:$C,$B22,Oversigt!$D:$D,W$3)","v":0},{"$f":"SUMIFS(Oversigt!$O:$O,Oversigt!$C:$C,$B22,Oversigt!$D:$D,X$3)","v":0},{"$f":"SUMIFS(Oversigt!$O:$O,Oversigt!$C:$C,$B22,Oversigt!$D:$D,Y$3)","v":0.125},{"$f":"SUMIFS(Oversigt!$O:$O,Oversigt!$C:$C,$B22,Oversigt!$D:$D,Z$3)","v":0},0,0,0,0,0.14206242532855434,0]
[null,"Måling",{"$f":"SUMIFS(Oversigt!$F:$F,Oversigt!$C:$C,$B23,Oversigt!$D:$D,C$3)","v":0},{"$f":"SUMIFS(Oversigt!$F:$F,Oversigt!$C:$C,$B23,Oversigt!$D:$D,D$3)","v":0},{"$f":"SUMIFS(Oversigt!$F:$F,Oversigt!$C:$C,$B23,Oversigt!$D:$D,E$3)","v":0},{"$f":"SUMIFS(Oversigt!$F:$F,Oversigt!$C:$C,$B23,Oversigt!$D:$D,F$3)","v":0},{"$f":"SUMIFS(Oversigt!$F:$F,Oversigt!$C:$C,$B23,Oversigt!$D:$D,G$3)","v":3.2258064516129031E-2},{"$f":"SUMIFS(Oversigt!$F:$F,Oversigt!$C:$C,$B23,Oversigt!$D:$D,H$3)","v":0},{"$f":"SUMIFS(Oversigt!$I:$I,Oversigt!$C:$C,$B23,Oversigt!$D:$D,I$3)","v":0},{"$f":"SUMIFS(Oversigt!$I:$I,Oversigt!$C:$C,$B23,Oversigt!$D:$D,J$3)","v":0},{"$f":"SUMIFS(Oversigt!$I:$I,Oversigt!$C:$C,$B23,Oversigt!$D:$D,K$3)","v":0},{"$f":"SUMIFS(Oversigt!$I:$I,Oversigt!$C:$C,$B23,Oversigt!$D:$D,L$3)","v":0},{"$f":"SUMIFS(Oversigt!$I:$I,Oversigt!$C:$C,$B23,Oversigt!$D:$D,M$3)","v":0},{"$f":"SUMIFS(Oversigt!$I:$I,Oversigt!$C:$C,$B23,Oversigt!$D:$D,N$3)","v":0},{"$f":"SUMIFS(Oversigt!$L:$L,Oversigt!$C:$C,$B23,Oversigt!$D:$D,O$3)","v":0},{"$f":"SUMIFS(Oversigt!$L:$L,Oversigt!$C:$C,$B23,Oversigt!$D:$D,P$3)","v":0},{"$f":"SUMIFS(Oversigt!$L:$L,Oversigt!$C:$C,$B23,Oversigt!$D:$D,Q$3)","v":0},{"$f":"SUMIFS(Oversigt!$L:$L,Oversigt!$C:$C,$B23,Oversigt!$D:$D,R$3)","v":0},{"$f":"SUMIFS(Oversigt!$L:$L,Oversigt!$C:$C,$B23,Oversigt!$D:$D,S$3)","v":7.407407407407407E-2},{"$f":"SUMIFS(Oversigt!$L:$L,Oversigt!$C:$C,$B23,Oversigt!$D:$D,T$3)","v":0},{"$f":"SUMIFS(Oversigt!$O:$O,Oversigt!$C:$C,$B23,Oversigt!$D:$D,U$3)","v":0},{"$f":"SUMIFS(Oversigt!$O:$O,Oversigt!$C:$C,$B23,Oversigt!$D:$D,V$3)","v":0},{"$f":"SUMIFS(Oversigt!$O:$O,Oversigt!$C:$C,$B23,Oversigt!$D:$D,W$3)","v":0},{"$f":"SUMIFS(Oversigt!$O:$O,Oversigt!$C:$C,$B23,Oversigt!$D:$D,X$3)","v":0},{"$f":"SUMIFS(Oversigt!$O:$O,Oversigt!$C:$C,$B23,Oversigt!$D:$D,Y$3)","v":6.25E-2},{"$f":"SUMIFS(Oversigt!$O:$O,Oversigt!$C:$C,$B23,Oversigt!$D:$D,Z$3)","v":0},0,0,0,0,4.2208034647550775E-2,0]
[null,"Intern opfølgning",{"$f":"SUMIFS(Oversigt!$F:$F,Oversigt!$C:$C,$B24,Oversigt!$D:$D,C$3)","v":0},{"$f":"SUMIFS(Oversigt!$F:$F,Oversigt!$C:$C,$B24,Oversigt!$D:$D,D$3)","v":0},{"$f":"SUMIFS(Oversigt!$F:$F,Oversigt!$C:$C,$B24,Oversigt!$D:$D,E$3)","v":0},{"$f":"SUMIFS(Oversigt!$F:$F,Oversigt!$C:$C,$B24,Oversigt!$D:$D,F$3)","v":0},{"$f":"SUMIFS(Oversigt!$F:$F,Oversigt!$C:$C,$B24,Oversigt!$D:$D,G$3)","v":3.2258064516129031E-2},{"$f":"SUMIFS(Oversigt!$F:$F,Oversigt!$C:$C,$B24,Oversigt!$D:$D,H$3)","v":0},{"$f":"SUMIFS(Oversigt!$I:$I,Oversigt!$C:$C,$B24,Oversigt!$D:$D,I$3)","v":0},{"$f":"SUMIFS(Oversigt!$I:$I,Oversigt!$C:$C,$B24,Oversigt!$D:$D,J$3)","v":0},{"$f":"SUMIFS(Oversigt!$I:$I,Oversigt!$C:$C,$B24,Oversigt!$D:$D,K$3)","v":0},{"$f":"SUMIFS(Oversigt!$I:$I,Oversigt!$C:$C,$B24,Oversigt!$D:$D,L$3)","v":0},{"$f":"SUMIFS(Oversigt!$I:$I,Oversigt!$C:$C,$B24,Oversigt!$D:$D,M$3)","v":8.3333333333333329E-2},{"$f":"SUMIFS(Oversigt!$I:$I,Oversigt!$C:$C,$B24,Oversigt!$D:$D,N$3)","v":0},{"$f":"SUMIFS(Oversigt!$L:$L,Oversigt!$C:$C,$B24,Oversigt!$D:$D,O$3)","v":0},{"$f":"SUMIFS(Oversigt!$L:$L,Oversigt!$C:$C,$B24,Oversigt!$D:$D,P$3)","v":0},{"$f":"SUMIFS(Oversigt!$L:$L,Oversigt!$C:$C,$B24,Oversigt!$D:$D,Q$3)","v":0},{"$f":"SUMIFS(Oversigt!$L:$L,Oversigt!$C:$C,$B24,Oversigt!$D:$D,R$3)","v":0},{"$f":"SUMIFS(Oversigt!$L:$L,Oversigt!$C:$C,$B24,Oversigt!$D:$D,S$3)","v":7.407407407407407E-2},{"$f":"SUMIFS(Oversigt!$L:$L,Oversigt!$C:$C,$B24,Oversigt!$D:$D,T$3)","v":0},{"$f":"SUMIFS(Oversigt!$O:$O,Oversigt!$C:$C,$B24,Oversigt!$D:$D,U$3)","v":0},{"$f":"SUMIFS(Oversigt!$O:$O,Oversigt!$C:$C,$B24,Oversigt!$D:$D,V$3)","v":0},{"$f":"SUMIFS(Oversigt!$O:$O,Oversigt!$C:$C,$B24,Oversigt!$D:$D,W$3)","v":0},{"$f":"SUMIFS(Oversigt!$O:$O,Oversigt!$C:$C,$B24,Oversigt!$D:$D,X$3)","v":0},{"$f":"SUMIFS(Oversigt!$O:$O,Oversigt!$C:$C,$B24,Oversigt!$D:$D,Y$3)","v":0.1875},{"$f":"SUMIFS(Oversigt!$O:$O,Oversigt!$C:$C,$B24,Oversigt!$D:$D,Z$3)","v":0},0,0,0,0,9.4291367980884111E-2,0]
[]
[null,"Type","PLAN",null,null,null,null,null,"DO",null,null,null,null,null,"CHECK",null,null,null,null,null,"ACT",null,null,null,null,null,"Alle"]
[null,"Proces","Ja","Delvist","Nej","Ikke relevant","Ikke sat","TOTAL","Ja","Delvist","Nej","Ikke relevant","Ikke sat","TOTAL","Ja","Delvist","Nej","Ikke relevant","Ikke sat","TOTAL","Ja","Delvist","Nej","Ikke relevant","Ikke sat","TOTAL","Ja","Delvist","Nej","Ikke relevant","Ikke sat","TOTAL"]
[null,"Risikovurdering",{"$f":"SUMIFS(Oversigt!$G:$G,Oversigt!$C:$C,$B28,Oversigt!$D:$D,C$3)","v":0},{"$f":"SUMIFS(Oversigt!$G:$G,Oversigt!$C:$C,$B28,Oversigt!$D:$D,D$3)","v":0},{"$f":"SUMIFS(Oversigt!$G:$G,Oversigt!$C:$C,$B28,Oversigt!$D:$D,E$3)","v":0},{"$f":"SUMIFS(Oversigt!$G:$G,Oversigt!$C:$C,$B28,Oversigt!$D:$D,F$3)","v":0},{"$f":"SUMIFS(Oversigt!$G:$G,Oversigt!$C:$C,$B28,Oversigt!$D:$D,G$3)","v":1},{"$f":"SUMIFS(Oversigt!$G:$G,Oversigt!$C:$C,$B28,Oversigt!$D:$D,H$3)","v":0},{"$f":"SUMIFS(Oversigt!$J:$J,Oversigt!$C:$C,$B28,Oversigt!$D:$D,I$3)","v":0},{"$f":"SUMIFS(Oversigt!$J:$J,Oversigt!$C:$C,$B28,Oversigt!$D:$D,J$3)","v":0},{"$f":"SUMIFS(Oversigt!$J:$J,Oversigt!$C:$C,$B28,Oversigt!$D:$D,K$3)","v":0},{"$f":"SUMIFS(Oversigt!$J:$J,Oversigt!$C:$C,$B28,Oversigt!$D:$D,L$3)","v":0},{"$f":"SUMIFS(Oversigt!$J:$J,Oversigt!$C:$C,$B28,Oversigt!$D:$D,M$3)","v":1},{"$f":"SUMIFS(Oversigt!$J:$J,Oversigt!$C:$C,$B28,Oversigt!$D:$D,N$3)","v":0},{"$f":"SUMIFS(Oversigt!$M:$M,Oversigt!$C:$C,$B28,Oversigt!$D:$D,O$3)","v":0},{"$f":"SUMIFS(Oversigt!$M:$M,Oversigt!$C:$C,$B28,Oversigt!$D:$D,P$3)","v":0},{"$f":"SUMIFS(Oversigt!$M:$M,Oversigt!$C:$C,$B28,Oversigt!$D:$D,Q$3)","v":0},{"$f":"SUMIFS(Oversigt!$M:$M,Oversigt!$C:$C,$B28,Oversigt!$D:$D,R$3)","v":0},{"$f":"SUMIFS(Oversigt!$M:$M,Oversigt!$C:$C,$B28,Oversigt!$D:$D,S$3)","v":1},{"$f":"SUMIFS(Oversigt!$M:$M,Oversigt!$C:$C,$B28,Oversigt!$D:$D,T$3)","v":0},{"$f":"SUMIFS(Oversigt!$P:$P,Oversigt!$C:$C,$B28,Oversigt!$D:$D,U$3)","v":0},{"$f":"SUMIFS(Oversigt!$P:$P,Oversigt!$C:$C,$B28,Oversigt!$D:$D,V$3)","v":0},{"$f":"SUMIFS(Oversigt!$P:$P,Oversigt!$C:$C,$B28,Oversigt!$D:$D,W$3)","v":0},{"$f":"SUMIFS(Oversigt!$P:$P,Oversigt!$C:$C,$B28,Oversigt!$D:$D,X$3)","v":0},{"$f":"SUMIFS(Oversigt!$P:$P,Oversigt!$C:$C,$B28,Oversigt!$D:$D,Y$3)","v":1},{"$f":"SUMIFS(Oversigt!$P:$P,Oversigt!$C:$C,$B28,Oversigt!$D:$D,Z$3)","v":0},{"$f":"AVERAGE(C28,I28,O28,U28)","v":0},{"$f":"AVERAGE(D28,J28,P28,V28)","v":0},{"$f":"AVERAGE(E28,K28,Q28,W28)","v":0},{"$f":"AVERAGE(F28,L28,R28,X28)","v":0},{"$f":"AVERAGE(G28,M28,S28,Y28)","v":1},{"$f":"AVERAGE(H28,N28,T28,Z28)","v":0}]
[null,"Risikohåndtering",{"$f":"SUMIFS(Oversigt!$G:$G,Oversigt!$C:$C,$B29,Oversigt!$D:$D,C$3)","v":0},{"$f":"SUMIFS(Oversigt!$G:$G,Oversigt!$C:$C,$B29,Oversigt!$D:$D,D$3)","v":0},{"$f":"SUMIFS(Oversigt!$G:$G,Oversigt!$C:$C,$B29,Oversigt!$D:$D,E$3)","v":0},{"$f":"SUMIFS(Oversigt!$G:$G,Oversigt!$C:$C,$B29,Oversigt!$D:$D,F$3)","v":0},{"$f":"SUMIFS(Oversigt!$G:$G,Oversigt!$C:$C,$B29,Oversigt!$D:$D,G$3)","v":1},{"$f":"SUMIFS(Oversigt!$G:$G,Oversigt!$C:$C,$B29,Oversigt!$D:$D,H$3)","v":0},{"$f":"SUMIFS(Oversigt!$J:$J,Oversigt!$C:$C,$B29,Oversigt!$D:$D,I$3)","v":0},{"$f":"SUMIFS(Oversigt!$J:$J,Oversigt!$C:$C,$B29,Oversigt!$D:$D,J$3)","v":0},{"$f":"SUMIFS(Oversigt!$J:$J,Oversigt!$C:$C,$B29,Oversigt!$D:$D,K$3)","v":0},{"$f":"SUMIFS(Oversigt!$J:$J,Oversigt!$C:$C,$B29,Oversigt!$D:$D,L$3)","v":0},{"$f":"SUMIFS(Oversigt!$J:$J,Oversigt!$C:$C,$B29,Oversigt!$D:$D,M$3)","v":1},{"$f":"SUMIFS(Oversigt!$J:$J,Oversigt!$C:$C,$B29,Oversigt!$D:$D,N$3)","v":0},{"$f":"SUMIFS(Oversigt!$M:$M,Oversigt!$C:$C,$B29,Oversigt!$D:$D,O$3)","v":0},{"$f":"SUMIFS(Oversigt!$M:$M,Oversigt!$C:$C,$B29,Oversigt!$D:$D,P$3)","v":0},{"$f":"SUMIFS(Oversigt!$M:$M,Oversigt!$C:$C,$B29,Oversigt!$D:$D,Q$3)","v":0},{"$f":"SUMIFS(Oversigt!$M:$M,Oversigt!$C:$C,$B29,Oversigt!$D:$D,R$3)","v":0},{"$f":"SUMIFS(Oversigt!$M:$M,Oversigt!$C:$C,$B29,Oversigt!$D:$D,S$3)","v":1},{"$f":"SUMIFS(Oversigt!$M:$M,Oversigt!$C:$C,$B29,Oversigt!$D:$D,T$3)","v":0},{"$f":"SUMIFS(Oversigt!$P:$P,Oversigt!$C:$C,$B29,Oversigt!$D:$D,U$3)","v":0},{"$f":"SUMIFS(Oversigt!$P:$P,Oversigt!$C:$C,$B29,Oversigt!$D:$D,V$3)","v":0},{"$f":"SUMIFS(Oversigt!$P:$P,Oversigt!$C:$C,$B29,Oversigt!$D:$D,W$3)","v":0},{"$f":"SUMIFS(Oversigt!$P:$P,Oversigt!$C:$C,$B29,Oversigt!$D:$D,X$3)","v":0},{"$f":"SUMIFS(Oversigt!$P:$P,Oversigt!$C:$C,$B29,Oversigt!$D:$D,Y$3)","v":1},{"$f":"SUMIFS(Oversigt!$P:$P,Oversigt!$C:$C,$B29,Oversigt!$D:$D,Z$3)","v":0},{"$f":"AVERAGE(C29,I29,O29,U29)","v":0},0,0,0,1,0]
[null,"ISMS",{"$f":"SUMIFS(Oversigt!$G:$G,Oversigt!$C:$C,$B30,Oversigt!$D:$D,C$3)","v":0},{"$f":"SUMIFS(Oversigt!$G:$G,Oversigt!$C:$C,$B30,Oversigt!$D:$D,D$3)","v":0},{"$f":"SUMIFS(Oversigt!$G:$G,Oversigt!$C:$C,$B30,Oversigt!$D:$D,E$3)","v":0},{"$f":"SUMIFS(Oversigt!$G:$G,Oversigt!$C:$C,$B30,Oversigt!$D:$D,F$3)","v":0},{"$f":"SUMIFS(Oversigt!$G:$G,Oversigt!$C:$C,$B30,Oversigt!$D:$D,G$3)","v":1},{"$f":"SUMIFS(Oversigt!$G:$G,Oversigt!$C:$C,$B30,Oversigt!$D:$D,H$3)","v":0},{"$f":"SUMIFS(Oversigt!$J:$J,Oversigt!$C:$C,$B30,Oversigt!$D:$D,I$3)","v":0},{"$f":"SUMIFS(Oversigt!$J:$J,Oversigt!$C:$C,$B30,Oversigt!$D:$D,J$3)","v":0},{"$f":"SUMIFS(Oversigt!$J:$J,Oversigt!$C:$C,$B30,Oversigt!$D:$D,K$3)","v":0},{"$f":"SUMIFS(Oversigt!$J:$J,Oversigt!$C:$C,$B30,Oversigt!$D:$D,L$3)","v":0},{"$f":"SUMIFS(Oversigt!$J:$J,Oversigt!$C:$C,$B30,Oversigt!$D:$D,M$3)","v":1},{"$f":"SUMIFS(Oversigt!$J:$J,Oversigt!$C:$C,$B30,Oversigt!$D:$D,N$3)","v":0},{"$f":"SUMIFS(Oversigt!$M:$M,Oversigt!$C:$C,$B30,Oversigt!$D:$D,O$3)","v":0},{"$f":"SUMIFS(Oversigt!$M:$M,Oversigt!$C:$C,$B30,Oversigt!$D:$D,P$3)","v":0},{"$f":"SUMIFS(Oversigt!$M:$M,Oversigt!$C:$C,$B30,Oversigt!$D:$D,Q$3)","v":0},{"$f":"SUMIFS(Oversigt!$M:$M,Oversigt!$C:$C,$B30,Oversigt!$D:$D,R$3)","v":0},{"$f":"SUMIFS(Oversigt!$M:$M,Oversigt!$C:$C,$B30,Oversigt!$D:$D,S$3)","v":1},{"$f":"SUMIFS(Oversigt!$M:$M,Oversigt!$C:$C,$B30,Oversigt!$D:$D,T$3)","v":0},{"$f":"SUMIFS(Oversigt!$P:$P,Oversigt!$C:$C,$B30,Oversigt!$D:$D,U$3)","v":0},{"$f":"SUMIFS(Oversigt!$P:$P,Oversigt!$C:$C,$B30,Oversigt!$D:$D,V$3)","v":0},{"$f":"SUMIFS(Oversigt!$P:$P,Oversigt!$C:$C,$B30,Oversigt!$D:$D,W$3)","v":0},{"$f":"SUMIFS(Oversigt!$P:$P,Oversigt!$C:$C,$B30,Oversigt!$D:$D,X$3)","v":0},{"$f":"SUMIFS(Oversigt!$P:$P,Oversigt!$C:$C,$B30,Oversigt!$D:$D,Y$3)","v":1},{"$f":"SUMIFS(Oversigt!$P:$P,Oversigt!$C:$C,$B30,Oversigt!$D:$D,Z$3)","v":0},0,0,0,0,1,0]
[null,"Politik",{"$f":"SUMIFS(Oversigt!$G:$G,Oversigt!$C:$C,$B31,Oversigt!$D:$D,C$3)","v":0},{"$f":"SUMIFS(Oversigt!$G:$G,Oversigt!$C:$C,$B31,Oversigt!$D:$D,D$3)","v":0},{"$f":"SUMIFS(Oversigt!$G:$G,Oversigt!$C:$C,$B31,Oversigt!$D:$D,E$3)","v":0},{"$f":"SUMIFS(Oversigt!$G:$G,Oversigt!$C:$C,$B31,Oversigt!$D:$D,F$3)","v":0},{"$f":"SUMIFS(Oversigt!$G:$G,Oversigt!$C:$C,$B31,Oversigt!$D:$D,G$3)","v":1},{"$f":"SUMIFS(Oversigt!$G:$G,Oversigt!$C:$C,$B31,Oversigt!$D:$D,H$3)","v":0},{"$f":"SUMIFS(Oversigt!$J:$J,Oversigt!$C:$C,$B31,Oversigt!$D:$D,I$3)","v":0},{"$f":"SUMIFS(Oversigt!$J:$J,Oversigt!$C:$C,$B31,Oversigt!$D:$D,J$3)","v":0},{"$f":"SUMIFS(Oversigt!$J:$J,Oversigt!$C:$C,$B31,Oversigt!$D:$D,K$3)","v":0},{"$f":"SUMIFS(Oversigt!$J:$J,Oversigt!$C:$C,$B31,Oversigt!$D:$D,L$3)","v":0},{"$f":"SUMIFS(Oversigt!$J:$J,Oversigt!$C:$C,$B31,Oversigt!$D:$D,M$3)","v":1},{"$f":"SUMIFS(Oversigt!$J:$J,Oversigt!$C:$C,$B31,Oversigt!$D:$D,N$3)","v":0},{"$f":"SUMIFS(Oversigt!$M:$M,Oversigt!$C:$C,$B31,Oversigt!$D:$D,O$3)","v":0},{"$f":"SUMIFS(Oversigt!$M:$M,Oversigt!$C:$C,$B31,Oversigt!$D:$D,P$3)","v":0},{"$f":"SUMIFS(Oversigt!$M:$M,Oversigt!$C:$C,$B31,Oversigt!$D:$D,Q$3)","v":0},{"$f":"SUMIFS(Oversigt!$M:$M,Oversigt!$C:$C,$B31,Oversigt!$D:$D,R$3)","v":0},{"$f":"SUMIFS(Oversigt!$M:$M,Oversigt!$C:$C,$B31,Oversigt!$D:$D,S$3)","v":1},{"$f":"SUMIFS(Oversigt!$M:$M,Oversigt!$C:$C,$B31,Oversigt!$D:$D,T$3)","v":0},{"$f":"SUMIFS(Oversigt!$P:$P,Oversigt!$C:$C,$B31,Oversigt!$D:$D,U$3)","v":0},{"$f":"SUMIFS(Oversigt!$P:$P,Oversigt!$C:$C,$B31,Oversigt!$D:$D,V$3)","v":0},{"$f":"SUMIFS(Oversigt!$P:$P,Oversigt!$C:$C,$B31,Oversigt!$D:$D,W$3)","v":0},{"$f":"SUMIFS(Oversigt!$P:$P,Oversigt!$C:$C,$B31,Oversigt!$D:$D,X$3)","v":0},{"$f":"SUMIFS(Oversigt!$P:$P,Oversigt!$C:$C,$B31,Oversigt!$D:$D,Y$3)","v":1},{"$f":"SUMIFS(Oversigt!$P:$P,Oversigt!$C:$C,$B31,Oversigt!$D:$D,Z$3)","v":0},0,0,0,0,1,0]
[null,"Ledelsesforankring",{"$f":"SUMIFS(Oversigt!$G:$G,Oversigt!$C:$C,$B32,Oversigt!$D:$D,C$3)","v":0},{"$f":"SUMIFS(Oversigt!$G:$G,Oversigt!$C:$C,$B32,Oversigt!$D:$D,D$3)","v":0},{"$f":"SUMIFS(Oversigt!$G:$G,Oversigt!$C:$C,$B32,Oversigt!$D:$D,E$3)","v":0},{"$f":"SUMIFS(Oversigt!$G:$G,Oversigt!$C:$C,$B32,Oversigt!$D:$D,F$3)","v":0},{"$f":"SUMIFS(Oversigt!$G:$G,Oversigt!$C:$C,$B32,Oversigt!$D:$D,G$3)","v":0},{"$f":"SUMIFS(Oversigt!$G:$G,Oversigt!$C:$C,$B32,Oversigt!$D:$D,H$3)","v":0},{"$f":"SUMIFS(Oversigt!$J:$J,Oversigt!$C:$C,$B32,Oversigt!$D:$D,I$3)","v":0},{"$f":"SUMIFS(Oversigt!$J:$J,Oversigt!$C:$C,$B32,Oversigt!$D:$D,J$3)","v":0},{"$f":"SUMIFS(Oversigt!$J:$J,Oversigt!$C:$C,$B32,Oversigt!$D:$D,K$3)","v":0},{"$f":"SUMIFS(Oversigt!$J:$J,Oversigt!$C:$C,$B32,Oversigt!$D:$D,L$3)","v":0},{"$f":"SUMIFS(Oversigt!$J:$J,Oversigt!$C:$C,$B32,Oversigt!$D:$D,M$3)","v":1},{"$f":"SUMIFS(Oversigt!$J:$J,Oversigt!$C:$C,$B32,Oversigt!$D:$D,N$3)","v":0},{"$f":"SUMIFS(Oversigt!$M:$M,Oversigt!$C:$C,$B32,Oversigt!$D:$D,O$3)","v":0},{"$f":"SUMIFS(Oversigt!$M:$M,Oversigt!$C:$C,$B32,Oversigt!$D:$D,P$3)","v":0},{"$f":"SUMIFS(Oversigt!$M:$M,Oversigt!$C:$C,$B32,Oversigt!$D:$D,Q$3)","v":0},{"$f":"SUMIFS(Oversigt!$M:$M,Oversigt!$C:$C,$B32,Oversigt!$D:$D,R$3)","v":0},{"$f":"SUMIFS(Oversigt!$M:$M,Oversigt!$C:$C,$B32,Oversigt!$D:$D,S$3)","v":1},{"$f":"SUMIFS(Oversigt!$M:$M,Oversigt!$C:$C,$B32,Oversigt!$D:$D,T$3)","v":0},{"$f":"SUMIFS(Oversigt!$P:$P,Oversigt!$C:$C,$B32,Oversigt!$D:$D,U$3)","v":0},{"$f":"SUMIFS(Oversigt!$P:$P,Oversigt!$C:$C,$B32,Oversigt!$D:$D,V$3)","v":0},{"$f":"SUMIFS(Oversigt!$P:$P,Oversigt!$C:$C,$B32,Oversigt!$D:$D,W$3)","v":0},{"$f":"SUMIFS(Oversigt!$P:$P,Oversigt!$C:$C,$B32,Oversigt!$D:$D,X$3)","v":0},{"$f":"SUMIFS(Oversigt!$P:$P,Oversigt!$C:$C,$B32,Oversigt!$D:$D,Y$3)","v":1},{"$f":"SUMIFS(Oversigt!$P:$P,Oversigt!$C:$C,$B32,Oversigt!$D:$D,Z$3)","v":0},0,0,0,0,0.75,0]
[null,"Leverandørstyring",{"$f":"SUMIFS(Oversigt!$G:$G,Oversigt!$C:$C,$B33,Oversigt!$D:$D,C$3)","v":0},{"$f":"SUMIFS(Oversigt!$G:$G,Oversigt!$C:$C,$B33,Oversigt!$D:$D,D$3)","v":0},{"$f":"SUMIFS(Oversigt!$G:$G,Oversigt!$C:$C,$B33,Oversigt!$D:$D,E$3)","v":0},{"$f":"SUMIFS(Oversigt!$G:$G,Oversigt!$C:$C,$B33,Oversigt!$D:$D,F$3)","v":0},{"$f":"SUMIFS(Oversigt!$G:$G,Oversigt!$C:$C,$B33,Oversigt!$D:$D,G$3)","v":1},{"$f":"SUMIFS(Oversigt!$G:$G,Oversigt!$C:$C,$B33,Oversigt!$D:$D,H$3)","v":0},{"$f":"SUMIFS(Oversigt!$J:$J,Oversigt!$C:$C,$B33,Oversigt!$D:$D,I$3)","v":0},{"$f":"SUMIFS(Oversigt!$J:$J,Oversigt!$C:$C,$B33,Oversigt!$D:$D,J$3)","v":0},{"$f":"SUMIFS(Oversigt!$J:$J,Oversigt!$C:$C,$B33,Oversigt!$D:$D,K$3)","v":0},{"$f":"SUMIFS(Oversigt!$J:$J,Oversigt!$C:$C,$B33,Oversigt!$D:$D,L$3)","v":0},{"$f":"SUMIFS(Oversigt!$J:$J,Oversigt!$C:$C,$B33,Oversigt!$D:$D,M$3)","v":1},{"$f":"SUMIFS(Oversigt!$J:$J,Oversigt!$C:$C,$B33,Oversigt!$D:$D,N$3)","v":0},{"$f":"SUMIFS(Oversigt!$M:$M,Oversigt!$C:$C,$B33,Oversigt!$D:$D,O$3)","v":0},{"$f":"SUMIFS(Oversigt!$M:$M,Oversigt!$C:$C,$B33,Oversigt!$D:$D,P$3)","v":0},{"$f":"SUMIFS(Oversigt!$M:$M,Oversigt!$C:$C,$B33,Oversigt!$D:$D,Q$3)","v":0},{"$f":"SUMIFS(Oversigt!$M:$M,Oversigt!$C:$C,$B33,Oversigt!$D:$D,R$3)","v":0},{"$f":"SUMIFS(Oversigt!$M:$M,Oversigt!$C:$C,$B33,Oversigt!$D:$D,S$3)","v":1},{"$f":"SUMIFS(Oversigt!$M:$M,Oversigt!$C:$C,$B33,Oversigt!$D:$D,T$3)","v":0},{"$f":"SUMIFS(Oversigt!$P:$P,Oversigt!$C:$C,$B33,Oversigt!$D:$D,U$3)","v":0},{"$f":"SUMIFS(Oversigt!$P:$P,Oversigt!$C:$C,$B33,Oversigt!$D:$D,V$3)","v":0},{"$f":"SUMIFS(Oversigt!$P:$P,Oversigt!$C:$C,$B33,Oversigt!$D:$D,W$3)","v":0},{"$f":"SUMIFS(Oversigt!$P:$P,Oversigt!$C:$C,$B33,Oversigt!$D:$D,X$3)","v":0},{"$f":"SUMIFS(Oversigt!$P:$P,Oversigt!$C:$C,$B33,Oversigt!$D:$D,Y$3)","v":1},{"$f":"SUMIFS(Oversigt!$P:$P,Oversigt!$C:$C,$B33,Oversigt!$D:$D,Z$3)","v":0},0,0,0,0,1,0]
[null,"It-beredskab",{"$f":"SUMIFS(Oversigt!$G:$G,Oversigt!$C:$C,$B34,Oversigt!$D:$D,C$3)","v":0},{"$f":"SUMIFS(Oversigt!$G:$G,Oversigt!$C:$C,$B34,Oversigt!$D:$D,D$3)","v":0},{"$f":"SUMIFS(Oversigt!$G:$G,Oversigt!$C:$C,$B34,Oversigt!$D:$D,E$3)","v":0},{"$f":"SUMIFS(Oversigt!$G:$G,Oversigt!$C:$C,$B34,Oversigt!$D:$D,F$3)","v":0},{"$f":"SUMIFS(Oversigt!$G:$G,Oversigt!$C:$C,$B34,Oversigt!$D:$D,G$3)","v":1},{"$f":"SUMIFS(Oversigt!$G:$G,Oversigt!$C:$C,$B34,Oversigt!$D:$D,H$3)","v":0},{"$f":"SUMIFS(Oversigt!$J:$J,Oversigt!$C:$C,$B34,Oversigt!$D:$D,I$3)","v":0},{"$f":"SUMIFS(Oversigt!$J:$J,Oversigt!$C:$C,$B34,Oversigt!$D:$D,J$3)","v":0},{"$f":"SUMIFS(Oversigt!$J:$J,Oversigt!$C:$C,$B34,Oversigt!$D:$D,K$3)","v":0},{"$f":"SUMIFS(Oversigt!$J:$J,Oversigt!$C:$C,$B34,Oversigt!$D:$D,L$3)","v":0},{"$f":"SUMIFS(Oversigt!$J:$J,Oversigt!$C:$C,$B34,Oversigt!$D:$D,M$3)","v":1},{"$f":"SUMIFS(Oversigt!$J:$J,Oversigt!$C:$C,$B34,Oversigt!$D:$D,N$3)","v":0},{"$f":"SUMIFS(Oversigt!$M:$M,Oversigt!$C:$C,$B34,Oversigt!$D:$D,O$3)","v":0},{"$f":"SUMIFS(Oversigt!$M:$M,Oversigt!$C:$C,$B34,Oversigt!$D:$D,P$3)","v":0},{"$f":"SUMIFS(Oversigt!$M:$M,Oversigt!$C:$C,$B34,Oversigt!$D:$D,Q$3)","v":0},{"$f":"SUMIFS(Oversigt!$M:$M,Oversigt!$C:$C,$B34,Oversigt!$D:$D,R$3)","v":0},{"$f":"SUMIFS(Oversigt!$M:$M,Oversigt!$C:$C,$B34,Oversigt!$D:$D,S$3)","v":1},{"$f":"SUMIFS(Oversigt!$M:$M,Oversigt!$C:$C,$B34,Oversigt!$D:$D,T$3)","v":0},{"$f":"SUMIFS(Oversigt!$P:$P,Oversigt!$C:$C,$B34,Oversigt!$D:$D,U$3)","v":0},{"$f":"SUMIFS(Oversigt!$P:$P,Oversigt!$C:$C,$B34,Oversigt!$D:$D,V$3)","v":0},{"$f":"SUMIFS(Oversigt!$P:$P,Oversigt!$C:$C,$B34,Oversigt!$D:$D,W$3)","v":0},{"$f":"SUMIFS(Oversigt!$P:$P,Oversigt!$C:$C,$B34,Oversigt!$D:$D,X$3)","v":0},{"$f":"SUMIFS(Oversigt!$P:$P,Oversigt!$C:$C,$B34,Oversigt!$D:$D,Y$3)","v":1},{"$f":"SUMIFS(Oversigt!$P:$P,Oversigt!$C:$C,$B34,Oversigt!$D:$D,Z$3)","v":0},0,0,0,0,1,0]
[null,"Måling",{"$f":"SUMIFS(Oversigt!$G:$G,Oversigt!$C:$C,$B35,Oversigt!$D:$D,C$3)","v":0},{"$f":"SUMIFS(Oversigt!$G:$G,Oversigt!$C:$C,$B35,Oversigt!$D:$D,D$3)","v":0},{"$f":"SUMIFS(Oversigt!$G:$G,Oversigt!$C:$C,$B35,Oversigt!$D:$D,E$3)","v":0},{"$f":"SUMIFS(Oversigt!$G:$G,Oversigt!$C:$C,$B35,Oversigt!$D:$D,F$3)","v":0},{"$f":"SUMIFS(Oversigt!$G:$G,Oversigt!$C:$C,$B35,Oversigt!$D:$D,G$3)","v":1},{"$f":"SUMIFS(Oversigt!$G:$G,Oversigt!$C:$C,$B35,Oversigt!$D:$D,H$3)","v":0},{"$f":"SUMIFS(Oversigt!$J:$J,Oversigt!$C:$C,$B35,Oversigt!$D:$D,I$3)","v":0},{"$f":"SUMIFS(Oversigt!$J:$J,Oversigt!$C:$C,$B35,Oversigt!$D:$D,J$3)","v":0},{"$f":"SUMIFS(Oversigt!$J:$J,Oversigt!$C:$C,$B35,Oversigt!$D:$D,K$3)","v":0},{"$f":"SUMIFS(Oversigt!$J:$J,Oversigt!$C:$C,$B35,Oversigt!$D:$D,L$3)","v":0},{"$f":"SUMIFS(Oversigt!$J:$J,Oversigt!$C:$C,$B35,Oversigt!$D:$D,M$3)","v":0},{"$f":"SUMIFS(Oversigt!$J:$J,Oversigt!$C:$C,$B35,Oversigt!$D:$D,N$3)","v":0},{"$f":"SUMIFS(Oversigt!$M:$M,Oversigt!$C:$C,$B35,Oversigt!$D:$D,O$3)","v":0},{"$f":"SUMIFS(Oversigt!$M:$M,Oversigt!$C:$C,$B35,Oversigt!$D:$D,P$3)","v":0},{"$f":"SUMIFS(Oversigt!$M:$M,Oversigt!$C:$C,$B35,Oversigt!$D:$D,Q$3)","v":0},{"$f":"SUMIFS(Oversigt!$M:$M,Oversigt!$C:$C,$B35,Oversigt!$D:$D,R$3)","v":0},{"$f":"SUMIFS(Oversigt!$M:$M,Oversigt!$C:$C,$B35,Oversigt!$D:$D,S$3)","v":1},{"$f":"SUMIFS(Oversigt!$M:$M,Oversigt!$C:$C,$B35,Oversigt!$D:$D,T$3)","v":0},{"$f":"SUMIFS(Oversigt!$P:$P,Oversigt!$C:$C,$B35,Oversigt!$D:$D,U$3)","v":0},{"$f":"SUMIFS(Oversigt!$P:$P,Oversigt!$C:$C,$B35,Oversigt!$D:$D,V$3)","v":0},{"$f":"SUMIFS(Oversigt!$P:$P,Oversigt!$C:$C,$B35,Oversigt!$D:$D,W$3)","v":0},{"$f":"SUMIFS(Oversigt!$P:$P,Oversigt!$C:$C,$B35,Oversigt!$D:$D,X$3)","v":0},{"$f":"SUMIFS(Oversigt!$P:$P,Oversigt!$C:$C,$B35,Oversigt!$D:$D,Y$3)","v":1},{"$f":"SUMIFS(Oversigt!$P:$P,Oversigt!$C:$C,$B35,Oversigt!$D:$D,Z$3)","v":0},0,0,0,0,0.75,0]
[null,"Intern opfølgning",{"$f":"SUMIFS(Oversigt!$G:$G,Oversigt!$C:$C,$B36,Oversigt!$D:$D,C$3)","v":0},{"$f":"SUMIFS(Oversigt!$G:$G,Oversigt!$C:$C,$B36,Oversigt!$D:$D,D$3)","v":0},{"$f":"SUMIFS(Oversigt!$G:$G,Oversigt!$C:$C,$B36,Oversigt!$D:$D,E$3)","v":0},{"$f":"SUMIFS(Oversigt!$G:$G,Oversigt!$C:$C,$B36,Oversigt!$D:$D,F$3)","v":0},{"$f":"SUMIFS(Oversigt!$G:$G,Oversigt!$C:$C,$B36,Oversigt!$D:$D,G$3)","v":1},{"$f":"SUMIFS(Oversigt!$G:$G,Oversigt!$C:$C,$B36,Oversigt!$D:$D,H$3)","v":0},{"$f":"SUMIFS(Oversigt!$J:$J,Oversigt!$C:$C,$B36,Oversigt!$D:$D,I$3)","v":0},{"$f":"SUMIFS(Oversigt!$J:$J,Oversigt!$C:$C,$B36,Oversigt!$D:$D,J$3)","v":0},{"$f":"SUMIFS(Oversigt!$J:$J,Oversigt!$C:$C,$B36,Oversigt!$D:$D,K$3)","v":0},{"$f":"SUMIFS(Oversigt!$J:$J,Oversigt!$C:$C,$B36,Oversigt!$D:$D,L$3)","v":0},{"$f":"SUMIFS(Oversigt!$J:$J,Oversigt!$C:$C,$B36,Oversigt!$D:$D,M$3)","v":1},{"$f":"SUMIFS(Oversigt!$J:$J,Oversigt!$C:$C,$B36,Oversigt!$D:$D,N$3)","v":0},{"$f":"SUMIFS(Oversigt!$M:$M,Oversigt!$C:$C,$B36,Oversigt!$D:$D,O$3)","v":0},{"$f":"SUMIFS(Oversigt!$M:$M,Oversigt!$C:$C,$B36,Oversigt!$D:$D,P$3)","v":0},{"$f":"SUMIFS(Oversigt!$M:$M,Oversigt!$C:$C,$B36,Oversigt!$D:$D,Q$3)","v":0},{"$f":"SUMIFS(Oversigt!$M:$M,Oversigt!$C:$C,$B36,Oversigt!$D:$D,R$3)","v":0},{"$f":"SUMIFS(Oversigt!$M:$M,Oversigt!$C:$C,$B36,Oversigt!$D:$D,S$3)","v":1},{"$f":"SUMIFS(Oversigt!$M:$M,Oversigt!$C:$C,$B36,Oversigt!$D:$D,T$3)","v":0},{"$f":"SUMIFS(Oversigt!$P:$P,Oversigt!$C:$C,$B36,Oversigt!$D:$D,U$3)","v":0},{"$f":"SUMIFS(Oversigt!$P:$P,Oversigt!$C:$C,$B36,Oversigt!$D:$D,V$3)","v":0},{"$f":"SUMIFS(Oversigt!$P:$P,Oversigt!$C:$C,$B36,Oversigt!$D:$D,W$3)","v":0},{"$f":"SUMIFS(Oversigt!$P:$P,Oversigt!$C:$C,$B36,Oversigt!$D:$D,X$3)","v":0},{"$f":"SUMIFS(Oversigt!$P:$P,Oversigt!$C:$C,$B36,Oversigt!$D:$D,Y$3)","v":1},{"$f":"SUMIFS(Oversigt!$P:$P,Oversigt!$C:$C,$B36,Oversigt!$D:$D,Z$3)","v":0},0,0,0,0,1,0]
[null,"Total",{"$f":"AVERAGE(C28:C36)","v":0},0,0,0,0.88888888888888884,0,0,0,0,0,0.88888888888888884,0,0,0,0,0,1,0,0,0,0,0,1,0,{"$f":"AVERAGE(AA28:AA36)","v":0},0,0,0,{"$f":"AVERAGE(AE28:AE36)","v":0.94444444444444442},{"$f":"AVERAGE(AF28:AF36)","v":0}]

{"sheet":"Vejledning","index":2,"n_rows":61,"n_cols":5,"rows_kept":61,"cut":false,"hidden":false,"merged":[[60,1,77,3],[0,0,0,2],[0,4,1,5],[3,1,14,3],[17,1,46,3],[49,1,57,3]]}
["Vejledning",null,null,null,"Gå til Oversigt"]
[]
[null,"Baggrund"]
[null,"Værktøjet er udviklet til at understøtte arbejdet med implementering af ISO27001 og kan bruges til en selvevaluering af, hvor langt organisationen er i denne proces. \n\nSelvevalueringsværktøjet er baseret på ISO27001, hvis formål er at bidrage med konkrete krav til at etablere, implementere, vedligeholde og forbedre et informationssikkerhedssystem i organisationer. Værktøjet er designet som en hjælp til at holde styr på de forskellige krav fra standarden, samt den implementeringsgrad den pågældende organisation har. \n\nVærktøjet kan benyttes som et levende dokument til løbende forbedring af det interne overblik og forståelsen for organisationens sikkerhedsniveau. Ydermere vil det være en stor hjælp til et ellers tidskrævende og omfattende dokumentationsarbejde ved besøg fra Rigsrevisionen eller It-tilsynet.\n\nVærktøjet er udviklet til de fagpersoner, som står for informationssikkerhedsarbejdet i organisationen. I standarden og dermed også i dette værktøj er der defineret flere roller i arbejdet, som i nogle organisationer udføres af færre personer end beskrevet. Det vigtigste er, at der i organisationen er udpeget en ansvarlig og en udførende for arbejdet."]
[]
[]
[]
[]
[]
[]
[]
[]
[]
[]
[]
[]
[null,"Brug af værktøjet"]
[null,"ISO27001 består af en række forskellige aktiviteter.Standarden bygger på procesorientering, dvs. en fast strukturering - PLAN-DO-CHECK-ACT - af gennemførelsen af de enkelte aktiviteter forstået som processer. Standarden er i værktøjet brudt ned i en række delprocesser, som hver for sig indeholder en række delaktiviter, som er kategoriseret i forhold til PLAN-DO-CHECK-ACT.\n\nDet er altid en mulighed at starte i PLAN som kontrol af, hvad der skal til i forbindelse med den enkelte aktivitet. Er organisationen langt i forbindelse med implementering af styring af informationssikkerhed, er det også muligt at starte i CHECK, og værktøjet understøtter på denne måde en intern revision af den pågældende aktivitet.\n\nVed udfyldelse af værktøjet gennemgår organisationen alle ISMS-processer – eller eventuelle aktiviteter - som ISO27001 indeholder. Ud fra dette fås et samlet overblik over, hvilke områder der er implementeret helt eller delvist, eller hvilke områder der er fravalgt eller vurderet som ikke relevante.\n\nDer er mange områder og krav – og det er derfor vigtigt at være pragmatisk i forbindelse med anvendelsen af værktøjet. Selvom ikke alle krav er opfyldt, er delvis opfyldelse rundt omkring altid en god begyndelse. Implementering af sikkerhed er en fortløbende proces. De vigtigste krav er markeret med rødt.\n\nVærktøjet er inddelt i faneblade som repræsenterer forskellige områder indenfor styring af informationssikkerhed. Inddelingen af områderne følger stort set ISO standardens inddelinger. Dog er der i dette værktøj tilføjet 2 ekstra faneblade vedrørende Leverandørstyring og It-beredskab, som ikke fremgår af ISO27001, men som bidrager med vigtige styringselementer til det samlede styringssystem ligesom de øvrige områder. \n\nDet anbefales at starte med mapperne Risikovurdering og Risikohåndtering, fordi disse områder er grundlæggende for hele det øvrige arbejde. \n\nVærktøjet er dynamisk og giver et overblik over hvor langt i implementeringsprocesserne organisationen er kommet. Det samlede overblik illustreres i øvrigt i fanebladet \"Oversigt\", hvor fordelingen mellem implementerede, delvist implementerede og fravalgte sikringsforanstaltninger netop vises ud fra lagkagemodeller for hvert enkelt område.\n\nDer genereres en samlet score for hvert af områderne: \n\n- Risikovurdering\n- Risikohåndtering\n- ISMS\n- Politik\n- Ledelsesforankring\n- Leverandørstyring\n- It beredskab\n- Måling \n- Intern opfølgning\n\nDer er ikke fastlagt et niveau for den \"\"rigtige\"\" grad af implementering eller vedligeholdelse. Scoringen giver muligheden for at bedømme sig selv samt at få input til, hvor der skal sættes ind."]
[]
[]
[]
[]
[]
[]
[]
[]
[]
[]
[]
[]
[]
[]
[]
[]
[]
[]
[]
[]
[]
[]
[]
[]
[]
[]
[]
[]
[]
[]
[null,"Implementeringsgrad"]
[null,"Hvert område er endvidere inddelt i implementering af ISMS-processer knyttet til:\n- Plan (planlægningen af sikkerhedsarbejdet)\n- Do (selve udførelsen af sikkerhedsarbejdet) \n- Check (revurdering af arbejdet) \n- Act (opfølgning af eventuelle revurderinger)\n\nDet vil derfor også være muligt at se, hvilket led af styringssystemet der er implementeret indenfor hvert område. Det kunne eksempelvis være tilfældet, at en organisation er godt med både i planlægningen og udførelsen på de fleste områder, hvorimod revurderinger og opfølgningsarbejdet bliver nedprioritet. Det kan være helt i tråd med organisationens strategi og budget for styringen af sikkerheden, men det essentielle er, at der skabes klarhed over niveauet, så de rette udviklingspunkter vælges i fremtiden, og organisationens sårbarheder kendes.\n"]
[]
[]
[]
[]
[]
[]
[]
[]
[]
[null,"Værtøjets struktur"]
[null,"Opfølgning\nVed dobbeltklik i cellen i kolonnen Opfølgning popper et vindue op, hvor man kan udfylde en handlingsplan på det pågældende område. Indholdet i pop-op vinduet overføres automatisk til mappen Opfølgning, hvor det pågældende krav samt beskrivelse af handlingsplan opstilles sammen med øvrige udfyldte handlingsplaner.\n\nI mappen Oversigt vil alle resultater efterhånden blive registreret automatisk og danne en oversigt over, hvor langt organisationen i det hele taget er.\n\nSikkerhedsområderne\nResten af værtøjet udgøres af faneblade for hvert sikkerhedsområde, hvori dokumentejer kan udfylde implementeringsgrad for hvert sikkerhedskrav fra ISO27001. Der kan vælges 1 ud af følgende svarmuligheder: \n• Ja\n• Nej\n• Delvist\n• Ikke relevant\n\nUdover at udfylde implementeringsgraden kan der tilføjes bemærkninger til hver ISMS-proces, og der kan noteres hvilke opfølgninger, der er besluttet. \n\nNederst i hvert faneblad fremgår hvilke dokumentationskrav, der stilles i standarden i relation til det pågældende område. \n\nDe felter der er markeret med gul farve i dokumentet indikerer, at et felt skal udfyldes."]

{"sheet":"Opfølgning","index":3,"n_rows":1,"n_cols":5,"rows_kept":1,"cut":false,"hidden":false,"merged":[]}
["Titel","Tekst","Hvad","Hvem","Hvornår"]

{"sheet":"Risikovurdering","index":4,"n_rows":30,"n_cols":12,"rows_kept":30,"cut":false,"hidden":false,"merged":[[29,1,41,11],[24,1,24,11],[25,1,25,2],[27,1,27,2],[25,3,25,11],[26,1,26,2],[0,0,0,2],[18,1,18,11],[19,2,19,3],[20,1,20,11],[23,1,23,11],[3,1,3,8],[4,1,4,11],[6,1,7,1],[6,2,7,2],[5,1,5,4],[8,1,8,11],[14,1,14,11],[9,1,13,1],[9,2,13,3],[15,1,17,1],[15,2,17,3]]}
[{"$f":"MID(CELL(\"filename\",B3),FIND(\"]\",CELL(\"filename\",B3),1)+1,100)","v":"Risikovurdering"},null,null,null,null,null,null,null,null,null,null,"Gå til Oversigt"]
[]
[null,null,null,null,null,null,null,null,null,null,"Udarbejdet den - og af","Godkendt den-  og af"]
[]
[]
[null,null,null,null,null,"Ja","Delvist","Nej","Ikke relevant","Noter - bemærkninger","Dokumentation","Opfølgning"]
[null,"PLAN","Planlægning af proces for risikovurdering","Der er en defineret proces for risikovurdering","Proces for risikoanalyse og -vurdering samt opfølgning og revurdering af tidligere risikovurderinger. Der er fastlagt kriterier for vurdering af konsekvens og for hvor store risici, der accepteres.",null,null,null,null,null,null,{"$f":"IF(COUNTIF(Opfølgning!B:B,E7)>0,COUNTIF(Opfølgning!B:B,E7),\"Dobbeltklik\")","v":"Dobbeltklik"}]
[null,null,null,"Identifikation af risici","Risikovurderingsprocessen anvendes til at identificere risici forbundet med tab af\n- fortrolighed\n- integritet\n- tilgængelighed",null,null,null,null,null,null,{"$f":"IF(COUNTIF(Opfølgning!B:B,E8)>0,COUNTIF(Opfølgning!B:B,E8),\"Dobbeltklik\")","v":"Dobbeltklik"}]
[null,"PLAN_slut"]
[null,"DO","Risikoanalyse og -vurdering",null,"Konsekvenser for forretningen af de identificerede risici er vurderet.",null,null,null,null,null,null,{"$f":"IF(COUNTIF(Opfølgning!B:B,E10)>0,COUNTIF(Opfølgning!B:B,E10),\"Dobbeltklik\")","v":"Dobbeltklik"}]
[null,null,null,null,"Den realistiske sandsynlighed for de identificerede risici er vurderet.",null,null,null,null,null,null,{"$f":"IF(COUNTIF(Opfølgning!B:B,E11)>0,COUNTIF(Opfølgning!B:B,E11),\"Dobbeltklik\")","v":"Dobbeltklik"}]
[null,null,null,null,"Risikoniveauet er fastlagt.",null,null,null,null,null,null,{"$f":"IF(COUNTIF(Opfølgning!B:B,E12)>0,COUNTIF(Opfølgning!B:B,E12),\"Dobbeltklik\")","v":"Dobbeltklik"}]
[null,null,null,null,"De analyserede risici er sammenholdt med de fastsatte kriterier og prioriteret, så der kan udarbejdes en handlingsplan.",null,null,null,null,null,null,{"$f":"IF(COUNTIF(Opfølgning!B:B,E13)>0,COUNTIF(Opfølgning!B:B,E13),\"Dobbeltklik\")","v":"Dobbeltklik"}]
[null,null,null,null,"Ejerne til de vurderede risici er identificeret.",null,null,null,null,null,null,{"$f":"IF(COUNTIF(Opfølgning!B:B,E14)>0,COUNTIF(Opfølgning!B:B,E14),\"Dobbeltklik\")","v":"Dobbeltklik"}]
[null,"DO_slut"]
[null,"CHECK","Revurdering af risici",null,"Processen for risikoananalyse og -vurdering revurderes.",null,null,null,null,null,null,{"$f":"IF(COUNTIF(Opfølgning!B:B,E16)>0,COUNTIF(Opfølgning!B:B,E16),\"Dobbeltklik\")","v":"Dobbeltklik"}]
[null,null,null,null,"Risikovurderinger gennemføres med planlagte intervaller.",null,null,null,null,null,null,{"$f":"IF(COUNTIF(Opfølgning!B:B,E17)>0,COUNTIF(Opfølgning!B:B,E17),\"Dobbeltklik\")","v":"Dobbeltklik"}]
[null,null,null,null,"Risikovurderinger gennemføres i forbindelse med væsentlige ændringer (interne og eksterne forhold, ændringer i trusselsbillede mm.).",null,null,null,null,null,null,{"$f":"IF(COUNTIF(Opfølgning!B:B,E18)>0,COUNTIF(Opfølgning!B:B,E18),\"Dobbeltklik\")","v":"Dobbeltklik"}]
[null,"CHECK_slut"]
[null,"ACT","Forbedringer af processen til risikoanalyse og -vurdering",null,"Processen for risikoanalyse og -vurdering er ændret i forhold til uhensigtsmæssigeheder/mangler mm.",null,null,null,null,null,null,{"$f":"IF(COUNTIF(Opfølgning!B:B,E20)>0,COUNTIF(Opfølgning!B:B,E20),\"Dobbeltklik\")","v":"Dobbeltklik"}]
[null,"ACT_slut"]
[]
[]
[]
[null,"Krav om dokumentation"]
[null,"Dokumentation af processen:"]
[null,"Dokumentation af processen for risikovurdering"]
[null,"Risikovurderingsrapport"]
[]
[null,"Dokumentationen indeholder:\n- identifikation og beskrivelse (titel, dato, forfatter mm.);\n- hensigtsmæssigt format i forhold til anvendelse;\n- revurdering og godkendelse af tilstrækkelighed og hensigtsmæssighed;\n\nDokumentationen er:\n- til at få fat på og anvendelig, når der er brug for det;\n- passende beskyttet (fx i forhold til fortrolighed eller imod ændringer);\n\nDer er taget stilling til:\n- distribution, adgang, genfinding og brug;\n- opbevaring, herunder lovkrav til opbevaring;\n- kontrol af ændringer (fx versionering);\n- bevaring og sletning."]

{"sheet":"Risikohåndtering","index":5,"n_rows":29,"n_cols":12,"rows_kept":29,"cut":false,"hidden":false,"merged":[[28,1,40,11],[24,1,24,2],[10,2,11,3],[10,1,11,1],[13,2,15,3],[13,1,15,1],[17,1,18,1],[24,3,24,11],[25,1,25,2],[12,1,12,11],[26,1,26,2],[23,1,23,11],[22,1,22,11],[19,1,19,11],[16,1,16,11],[17,2,18,3],[0,0,0,2],[3,1,3,8],[4,1,4,11],[5,1,5,4],[9,1,9,11],[6,2,8,3],[6,1,8,1]]}
[{"$f":"MID(CELL(\"filename\",B3),FIND(\"]\",CELL(\"filename\",B3),1)+1,100)","v":"Risikohåndtering"},null,null,null,null,null,null,null,null,null,null,"Gå til Oversigt"]
[]
[null,null,null,null,null,null,null,null,null,null,"Udarbejdet den - og af","Godkendt den-  og af"]
[]
[]
[null,null,null,null,null,"Ja","Delvist","Nej","Ikke relevant","Noter - bemærkninger","Dokumentation","Opfølgning"]
[null,"PLAN","Handlingsplan til håndtering af risici",null,"Der er udarbejdet en plan til håndtering af risici.",null,null,null,null,null,null,{"$f":"IF(COUNTIF(Opfølgning!B:B,E7)>0,COUNTIF(Opfølgning!B:B,E7),\"Dobbeltklik\")","v":"Dobbeltklik"}]
[null,null,null,null,"Risikoejer har godkendt planen til håndtering af risici samt restrisici.",null,null,null,null,null,null,{"$f":"IF(COUNTIF(Opfølgning!B:B,E8)>0,COUNTIF(Opfølgning!B:B,E8),\"Dobbeltklik\")","v":"Dobbeltklik"}]
[null,null,null,null,"Planen har defineret:\n- hvordan resultater af risikovurderingerne skal vurderes samlet set;\n- ansvarsfordeling;\n- behovet for ressourcer;\n- deadlines.",null,null,null,null,null,null,{"$f":"IF(COUNTIF(Opfølgning!B:B,E9)>0,COUNTIF(Opfølgning!B:B,E9),\"Dobbeltklik\")","v":"Dobbeltklik"}]
[null,"PLAN_slut"]
[null,"DO","Håndtering af risici",null,"De nødvendige sikkerhedsforanstaltninger er fastlagt.",null,null,null,null,null,null,{"$f":"IF(COUNTIF(Opfølgning!B:B,E11)>0,COUNTIF(Opfølgning!B:B,E11),\"Dobbeltklik\")","v":"Dobbeltklik"}]
[null,null,null,null,"De besluttede sikkerhedsforanstaltningerer sammenholdt med kontrollerne i Annex A, og til- og fravalg er begrundet.",null,null,null,null,null,null,{"$f":"IF(COUNTIF(Opfølgning!B:B,E12)>0,COUNTIF(Opfølgning!B:B,E12),\"Dobbeltklik\")","v":"Dobbeltklik"}]
[null,"DO_slut"]
[null,"CHECK","Revurdering af risikohåndtering",null,"Sikkerhedsforanstaltningernes effektivitet vurderes i efterfølgende risikovurderinger.",null,null,null,null,null,null,{"$f":"IF(COUNTIF(Opfølgning!B:B,E14)>0,COUNTIF(Opfølgning!B:B,E14),\"Dobbeltklik\")","v":"Dobbeltklik"}]
[null,null,null,null,"SoA-dokumentet revurderes.",null,null,null,null,null,null,{"$f":"IF(COUNTIF(Opfølgning!B:B,E15)>0,COUNTIF(Opfølgning!B:B,E15),\"Dobbeltklik\")","v":"Dobbeltklik"}]
[null,null,null,null,"Det vurderes, om handlingsplanen til håndtering af konkrete risici, herunder implementering af kontroller, er fulgt. ",null,null,null,null,null,null,{"$f":"IF(COUNTIF(Opfølgning!B:B,E16)>0,COUNTIF(Opfølgning!B:B,E16),\"Dobbeltklik\")","v":"Dobbeltklik"}]
[null,"CHECK_slut"]
[null,"ACT","Opfølgning på risikohåndtering",null,"Konsekvenser af afvigelser eller mangelfuldheder håndteres.",null,null,null,null,null,null,{"$f":"IF(COUNTIF(Opfølgning!B:B,E18)>0,COUNTIF(Opfølgning!B:B,E18),\"Dobbeltklik\")","v":"Dobbeltklik"}]
[null,null,null,null,"Håndtering af risici gennemføres, så det bidrager til forbedringer af ISMS.",null,null,null,null,null,null,{"$f":"IF(COUNTIF(Opfølgning!B:B,E19)>0,COUNTIF(Opfølgning!B:B,E19),\"Dobbeltklik\")","v":"Dobbeltklik"}]
[null,"ACT_slut"]
[]
[]
[]
[null,"Krav om dokumentation"]
[null,"Dokumentation af processen:"]
[null,"Proces for risikohåndtering"]
[null,"Statement of Applicability (SoA) - Erklæring om anvendelse"]
[]
[null,"Dokumentationen indeholder:\n- identifikation og beskrivelse (titel, dato, forfatter mm.);\n- hensigtsmæssigt format i forhold til anvendelse;\n- revurdering og godkendelse af tilstrækkelighed og hensigtsmæssighed;\n\nDokumentationen er:\n- til at få fat på og anvendelig, når der er brug for det;\n- passende beskyttet (fx i forhold til fortrolighed eller imod ændringer);\n\nDer er taget stilling til:\n- distribution, adgang, genfinding og brug;\n- opbevaring, herunder lovkrav til opbevaring;\n- kontrol af ændringer (fx versionering);\n- bevaring og sletning."]

{"sheet":"ISMS","index":6,"n_rows":37,"n_cols":12,"rows_kept":37,"cut":false,"hidden":false,"merged":[[30,1,30,2],[29,1,29,3],[36,1,48,11],[23,2,23,3],[22,1,22,11],[28,1,28,11],[29,4,29,6],[29,7,29,9],[32,3,34,3],[31,1,31,2],[32,1,32,2],[33,1,33,2],[34,1,34,2],[10,1,10,11],[11,1,17,1],[11,2,12,2],[13,2,14,3],[15,2,17,3],[18,1,18,11],[19,1,21,1],[19,2,19,3],[21,2,21,3],[24,1,24,11],[20,2,20,3],[0,0,0,2],[3,1,3,8],[4,1,4,11],[5,1,5,4],[6,1,9,1],[7,2,7,3],[8,2,8,3],[6,2,6,3],[9,2,9,3]]}
[{"$f":"MID(CELL(\"filename\",B3),FIND(\"]\",CELL(\"filename\",B3),1)+1,100)","v":"ISMS"},null,null,null,null,null,null,null,null,null,null,"Gå til Oversigt"]
[]
[null,null,null,null,null,null,null,null,null,null,"Udarbejdet den - og af","Godkendt den-  og af"]
[]
[]
[null,null,null,null,null,"Ja","Delvist","Nej","Ikke relevant","Noter - bemærkninger","Dokumentation","Opfølgning"]
[null,"PLAN","Organisationens omverden og interessenter - samt deres behov og forventninger",null,"Organisationens omverden og interessenter er analyseret, og der er kendskab til deres krav til risikoen for tab af tilgængelighed, fortrolighed og integritet",null,null,null,null,null,null,{"$f":"IF(COUNTIF(Opfølgning!B:B,E7)>0,COUNTIF(Opfølgning!B:B,E7),\"Dobbeltklik\")","v":"Dobbeltklik"}]
[null,null,"Afgrænsning af informationssikkerhedssystemet",null,"Informationssikkerhedssystemet dækker de relevante forretningsmæssige områder.",null,null,null,null,null,null,{"$f":"IF(COUNTIF(Opfølgning!B:B,E8)>0,COUNTIF(Opfølgning!B:B,E8),\"Dobbeltklik\")","v":"Dobbeltklik"}]
[null,null,"Roller og ansvar",null,"Relevante roller og funktioner er bemyndiget med ansvar, og det er kommunikeret i organisationen.",null,null,null,null,null,null,{"$f":"IF(COUNTIF(Opfølgning!B:B,E9)>0,COUNTIF(Opfølgning!B:B,E9),\"Dobbeltklik\")","v":"Dobbeltklik"}]
[null,null,"Kompetencer",null,"De nødvendige kompetencer i relation til informationssikkerhed er identificeret.",null,null,null,null,null,null,{"$f":"IF(COUNTIF(Opfølgning!B:B,E10)>0,COUNTIF(Opfølgning!B:B,E10),\"Dobbeltklik\")","v":"Dobbeltklik"}]
[null,"PLAN_slut"]
[null,"DO","Informationssikkerhedssystemet","ISMS","Informationssikkerhedssystemet er dokumenteret, og systemet vedligeholdes og forbedres løbende.",null,null,null,null,null,null,{"$f":"IF(COUNTIF(Opfølgning!B:B,E12)>0,COUNTIF(Opfølgning!B:B,E12),\"Dobbeltklik\")","v":"Dobbeltklik"}]
[null,null,null,"Organisatoriske roller og ansvar","Der er udpeget en informationssikkerhedsansvarlig og en der er udførende i arbejdet, og roller og opgaver er fordelt.",null,null,null,null,null,null,{"$f":"IF(COUNTIF(Opfølgning!B:B,E13)>0,COUNTIF(Opfølgning!B:B,E13),\"Dobbeltklik\")","v":"Dobbeltklik"}]
[null,null,"Kompetencer",null,"Organisationen sikrer, at medarbejdere med relation til informationssikkerheden har de rette kompetencer mht. uddannelse, træning og erfaring.",null,null,null,null,null,null,{"$f":"IF(COUNTIF(Opfølgning!B:B,E14)>0,COUNTIF(Opfølgning!B:B,E14),\"Dobbeltklik\")","v":"Dobbeltklik"}]
[null,null,null,null,"Når det er relevant, gennemføres nødvendig uddannelse og træning.",null,null,null,null,null,null,{"$f":"IF(COUNTIF(Opfølgning!B:B,E15)>0,COUNTIF(Opfølgning!B:B,E15),\"Dobbeltklik\")","v":"Dobbeltklik"}]
[null,null,"Awareness",null,"Medarbejderne er informeret om de medarbejder relevante dele af informationssikkerhedspolitikken. ",null,null,null,null,null,null,{"$f":"IF(COUNTIF(Opfølgning!B:B,E16)>0,COUNTIF(Opfølgning!B:B,E16),\"Dobbeltklik\")","v":"Dobbeltklik"}]
[null,null,null,null,"Medarbejderne ved, hvordan de bidrager til informationssikkerheden.",null,null,null,null,null,null,{"$f":"IF(COUNTIF(Opfølgning!B:B,E17)>0,COUNTIF(Opfølgning!B:B,E17),\"Dobbeltklik\")","v":"Dobbeltklik"}]
[null,null,null,null,"Medarbejderne kender til konsekvenser/sanktioner ved manglende efterlevelse af informationssikkerheden.",null,null,null,null,null,null,{"$f":"IF(COUNTIF(Opfølgning!B:B,E18)>0,COUNTIF(Opfølgning!B:B,E18),\"Dobbeltklik\")","v":"Dobbeltklik"}]
[null,"DO_slut"]
[null,"CHECK","Forståelse af interessenters behov og forventninger",null,"Relevante interessenter og deres krav revurderes periodisk.",null,null,null,null,null,null,{"$f":"IF(COUNTIF(Opfølgning!B:B,E20)>0,COUNTIF(Opfølgning!B:B,E20),\"Dobbeltklik\")","v":"Dobbeltklik"}]
[null,null,"Informationssikkerhedssystemet",null,"Der er implementeret processer til vurdering og rapportering af effekten af informationssikkerhedssystemet, herunder\n-  hvad, hvornår, hvordan og hvem der skal gennemføre overvågning, måling, analyse og vurdering.",null,null,null,null,null,null,{"$f":"IF(COUNTIF(Opfølgning!B:B,E21)>0,COUNTIF(Opfølgning!B:B,E21),\"Dobbeltklik\")","v":"Dobbeltklik"}]
[null,null,"Kompetencer",null,"Effekten af gennemførte kompetenceudviklingsforløb evalueres efterfølgende.",null,null,null,null,null,null,{"$f":"IF(COUNTIF(Opfølgning!B:B,E22)>0,COUNTIF(Opfølgning!B:B,E22),\"Dobbeltklik\")","v":"Dobbeltklik"}]
[null,"CHECK_slut"]
[null,"ACT","Opfølgning på afvigelser fra ISMS-/informationssikkerhedspolitikken",null,"ISMS og informationssikkerheden justeres vedvarende som opfølgning på afvigelser med henblik på at forbedre ISMS/informationssikkerheden.",null,null,null,null,null,null,{"$f":"IF(COUNTIF(Opfølgning!B:B,E24)>0,COUNTIF(Opfølgning!B:B,E24),\"Dobbeltklik\")","v":"Dobbeltklik"}]
[null,"ACT_slut"]
[]
[]
[]
[null,"Krav om dokumentation"]
[null,"Dokumentation af processen:"]
[null,"Afgrænsning af informationssikkerhedssystemet ",null,"Indgå i ISMS-/informationssikkerhedspolitikken."]
[null,"Information om medarbejderes kompetencer, herunder gennemførelse af deres kompetenceudvikling",null,"På overordnet niveau indgå i informationssikkerhedspolitikken. Planer for kompetenceudvikling indgå i årlige handlingsplaner. Information og effekt af kompetenceudvikling indarbejdes i årlig rapportering til ledelsen."]
[null,"Resultatet af evaluering af informationssikkerheden og effekten af informationssikkerhedssystemet",null,"Indgå i rapportering til ledelsen."]
[null,"Afvigelser i forhold til ledelsessystemet og ISMS/informationssikkerhedspolitikken samt opfølgende handlinger"]
[null,"Resultatet af opfølgende handlinger"]
[]
[null,"Dokumentationen indeholder:\n- identifikation og beskrivelse (titel, dato, forfatter mm.);\n- hensigtsmæssigt format i forhold til anvendelse;\n- revurdering og godkendelse af tilstrækkelighed og hensigtsmæssighed;\n\nDokumentationen er:\n- til at få fat på og anvendelig, når der er brug for det;\n- passende beskyttet (fx i forhold til fortrolighed eller imod ændringer);\n\nDer er taget stilling til:\n- distribution, adgang, genfinding og brug;\n- opbevaring, herunder lovkrav til opbevaring;\n- kontrol af ændringer (fx versionering);\n- bevaring og sletning."]

{"sheet":"Ledelsesforankring","index":7,"n_rows":28,"n_cols":12,"rows_kept":28,"cut":false,"hidden":false,"merged":[[27,1,39,11],[25,1,25,2],[12,1,12,11],[13,1,15,1],[16,1,16,11],[13,2,15,3],[19,1,19,11],[22,1,22,11],[23,1,23,11],[24,1,24,2],[24,3,24,11],[25,3,25,4],[17,2,18,3],[17,1,18,1],[8,1,11,1],[8,2,10,2],[8,3,10,3],[11,2,11,3],[0,0,0,2],[3,1,3,8],[4,1,4,11],[5,1,5,4],[7,1,7,11]]}
[{"$f":"MID(CELL(\"filename\",B3),FIND(\"]\",CELL(\"filename\",B3),1)+1,100)","v":"Ledelsesforankring"},null,null,null,null,null,null,null,null,null,null,"Gå til Oversigt"]
[]
[null,null,null,null,null,null,null,null,null,null,"Udarbejdet den - og af","Godkendt den-  og af"]
[]
[]
[null,null,null,null,null,"Ja","Delvist","Nej","Ikke relevant","Noter - bemærkninger","Dokumentation","Opfølgning"]
[null,"PLAN "]
[null,"PLAN_slut"]
[null,"DO","Lederskab","Ledelse og engagement","Ledelsen kommunikerer vigtigheden af informationssikkerhed samt af efterlevelse af informationssikkerhed.",null,null,null,null,null,null,{"$f":"IF(COUNTIF(Opfølgning!B:B,E9)>0,COUNTIF(Opfølgning!B:B,E9),\"Dobbeltklik\")","v":"Dobbeltklik"}]
[null,null,null,null,"Ledelsen instruerer og understøtter medarbejdere til at bidrage til informationssikkerheden.",null,null,null,null,null,null,{"$f":"IF(COUNTIF(Opfølgning!B:B,E10)>0,COUNTIF(Opfølgning!B:B,E10),\"Dobbeltklik\")","v":"Dobbeltklik"}]
[null,null,null,null,"Ledelsen udviser ledelsesopbakning og bakker op omkring sikkerhedsstyringen.",null,null,null,null,null,null,{"$f":"IF(COUNTIF(Opfølgning!B:B,E11)>0,COUNTIF(Opfølgning!B:B,E11),\"Dobbeltklik\")","v":"Dobbeltklik"}]
[null,null,"Ressourcer",null,"Ledelsen sikrer at de nødvendige ressourcer til etablering, implementering, vedligeholdelse og forbedring af informationssikkerheden.",null,null,null,null,null,null,{"$f":"IF(COUNTIF(Opfølgning!B:B,E12)>0,COUNTIF(Opfølgning!B:B,E12),\"Dobbeltklik\")","v":"Dobbeltklik"}]
[null,"DO_slut"]
[null,"CHECK","Lederskab",null,"Ledelsen gennemgår informationssikkerhedsstyringen i planlagte intervaller til sikring af egnethed, tilstrækkelighed og effektivitet.",null,null,null,null,null,null,{"$f":"IF(COUNTIF(Opfølgning!B:B,E14)>0,COUNTIF(Opfølgning!B:B,E14),\"Dobbeltklik\")","v":"Dobbeltklik"}]
[null,null,null,null,"Ledelsesgennemgangen indeholder status på handlingsplaner.",null,null,null,null,null,null,{"$f":"IF(COUNTIF(Opfølgning!B:B,E15)>0,COUNTIF(Opfølgning!B:B,E15),\"Dobbeltklik\")","v":"Dobbeltklik"}]
[null,null,null,null,"Ledelsesgennemgangen indeholder overvejelser om organisationens arbejde med infomationssikkerhed, herunder udvikling i fht sikkerhedshændelser/afvigelser, korrigerende handlinger, overvågnings- og målingsresultater og resultater fra intern revision mv.",null,null,null,null,null,null,{"$f":"IF(COUNTIF(Opfølgning!B:B,E16)>0,COUNTIF(Opfølgning!B:B,E16),\"Dobbeltklik\")","v":"Dobbeltklik"}]
[null,"CHECK_slut"]
[null,"ACT","Ressourcer",null,"Ledelsen bakker op om forbedringer af styringen af informationssikkerheden. ",null,null,null,null,null,null,{"$f":"IF(COUNTIF(Opfølgning!B:B,E18)>0,COUNTIF(Opfølgning!B:B,E18),\"Dobbeltklik\")","v":"Dobbeltklik"}]
[null,null,null,null,"Ledelsesgenemgangen indeholder overvejelser om mulige løbende forbedringer.",null,null,null,null,null,null,{"$f":"IF(COUNTIF(Opfølgning!B:B,E19)>0,COUNTIF(Opfølgning!B:B,E19),\"Dobbeltklik\")","v":"Dobbeltklik"}]
[null,"ACT_slut"]
[]
[]
[]
[null,"Krav om dokumentation"]
[null,"Dokumentation af processen:"]
[null,"Ingen krav om dokumentation"]
[]
[null,"Dokumentationen indeholder:\n- identifikation og beskrivelse (titel, dato, forfatter mm.);\n- hensigtsmæssigt format i forhold til anvendelse;\n- revurdering og godkendelse af tilstrækkelighed og hensigtsmæssighed;\n\nDokumentationen er:\n- til at få fat på og anvendelig, når der er brug for det;\n- passende beskyttet (fx i forhold til fortrolighed eller imod ændringer);\n\nDer er taget stilling til:\n- distribution, adgang, genfinding og brug;\n- opbevaring, herunder lovkrav til opbevaring;\n- kontrol af ændringer (fx versionering);\n- bevaring og sletning."]

{"sheet":"Politik","index":8,"n_rows":45,"n_cols":12,"rows_kept":45,"cut":false,"hidden":false,"merged":[[43,1,43,2],[43,3,43,11],[44,1,44,2],[44,3,44,11],[14,1,15,1],[22,1,22,11],[42,1,42,11],[16,1,16,11],[17,1,18,1],[19,1,19,11],[23,4,23,6],[23,7,23,9],[14,2,14,3],[23,1,23,3],[15,2,15,3],[17,2,17,3],[18,2,18,3],[24,1,24,3],[25,1,25,3],[27,1,39,11],[13,1,13,11],[0,0,0,2],[3,1,3,8],[4,1,4,11],[5,1,5,4],[6,1,8,1],[9,1,9,11],[10,1,12,1],[6,2,6,3],[7,2,8,3],[10,2,12,3]]}
[{"$f":"MID(CELL(\"filename\",B3),FIND(\"]\",CELL(\"filename\",B3),1)+1,100)","v":"Politik"},null,null,null,null,null,null,null,null,null,null,"Gå til Oversigt"]
[]
[null,null,null,null,null,null,null,null,null,null,"Udarbejdet den - og af","Godkendt den-  og af"]
[]
[]
[null,null,null,null,null,"Ja","Delvist","Nej","Ikke relevant","Noter - bemærkninger","Dokumentation","Opfølgning"]
[null,"PLAN","Informationssikkerhedspolitik",null,"Politikken er i overensstemmelse med organisationens mission og mål og udtrykker ambitioner for informationssikkerhed. ",null,null,null,null,null,null,{"$f":"IF(COUNTIF(Opfølgning!B:B,E7)>0,COUNTIF(Opfølgning!B:B,E7),\"Dobbeltklik\")","v":"Dobbeltklik"}]
[null,null,"Mål for informationssikkerheden",null,"Målene for informationssikkerheden stiller relevante krav til sikkerheden.",null,null,null,null,null,null,{"$f":"IF(COUNTIF(Opfølgning!B:B,E8)>0,COUNTIF(Opfølgning!B:B,E8),\"Dobbeltklik\")","v":"Dobbeltklik"}]
[null,null,null,null,"Målene for informationssikkerheden er målbare.",null,null,null,null,null,null,{"$f":"IF(COUNTIF(Opfølgning!B:B,E9)>0,COUNTIF(Opfølgning!B:B,E9),\"Dobbeltklik\")","v":"Dobbeltklik"}]
[null,"PLAN_slut"]
[null,"DO","Informationssikkerhedspolitik",null,"Politikken er umiddelbart tilgængelig for alle interessenter.",null,null,null,null,null,null,{"$f":"IF(COUNTIF(Opfølgning!B:B,E11)>0,COUNTIF(Opfølgning!B:B,E11),\"Dobbeltklik\")","v":"Dobbeltklik"}]
[null,null,null,null,"Politikken og målene for informationssikkerheden er kommunikeret i organisationen. ",null,null,null,null,null,null,{"$f":"IF(COUNTIF(Opfølgning!B:B,E12)>0,COUNTIF(Opfølgning!B:B,E12),\"Dobbeltklik\")","v":"Dobbeltklik"}]
[null,null,null,null,"Der er udarbejdet handlingsplaner i relation til målene for informationssikkerheden.",null,null,null,null,null,null,{"$f":"IF(COUNTIF(Opfølgning!B:B,E13)>0,COUNTIF(Opfølgning!B:B,E13),\"Dobbeltklik\")","v":"Dobbeltklik"}]
[null,"DO_slut"]
[null,"CHECK","Informationssikkerhedspolitik",null,"Informationssikkerhedspolitikken revurderes en gang om året og i forbindelse med større ændringer fx i organisationen.",null,null,null,null,null,null,{"$f":"IF(COUNTIF(Opfølgning!B:B,E15)>0,COUNTIF(Opfølgning!B:B,E15),\"Dobbeltklik\")","v":"Dobbeltklik"}]
[null,null,"Mål for informationssikkerheden",null,"Handlingsplanerne i relation til målene for informationssikkerhed revurderes.",null,null,null,null,null,null,{"$f":"IF(COUNTIF(Opfølgning!B:B,E16)>0,COUNTIF(Opfølgning!B:B,E16),\"Dobbeltklik\")","v":"Dobbeltklik"}]
[null,"CHECK_slut"]
[null,"ACT","Informationssikkerhedspolitik",null,"Hvis der har været afvigelser, tilpasses informationssikkerhedspolitikken for at forbedre informationssikkerheden. ",null,null,null,null,null,null,{"$f":"IF(COUNTIF(Opfølgning!B:B,E18)>0,COUNTIF(Opfølgning!B:B,E18),\"Dobbeltklik\")","v":"Dobbeltklik"}]
[null,null,"Mål for informationssikkerheden",null,"Målene for informationssikkerheden opdateres, når det er relevant.",null,null,null,null,null,null,{"$f":"IF(COUNTIF(Opfølgning!B:B,E19)>0,COUNTIF(Opfølgning!B:B,E19),\"Dobbeltklik\")","v":"Dobbeltklik"}]
[null,"ACT_slut"]
[]
[]
[null,"Krav om dokumentation"]
[null,"Dokumentation af processen:"]
[null,"Informationssikkerhedspolitikken."]
[null,"Mål for informationssikkerheden."]
[]
[null,"Dokumentationen indeholder:\n- identifikation og beskrivelse (titel, dato, forfatter mm.);\n- hensigtsmæssigt format i forhold til anvendelse;\n- revurdering og godkendelse af tilstrækkelighed og hensigtsmæssighed;\n\nDokumentationen er:\n- til at få fat på og anvendelig, når der er brug for det;\n- passende beskyttet (fx i forhold til fortrolighed eller imod ændringer);\n\nDer er taget stilling til:\n- distribution, adgang, genfinding og brug;\n- opbevaring, herunder lovkrav til opbevaring;\n- kontrol af ændringer (fx versionering);\n- bevaring og sletning."]
[]
[]
[]
[]
[]
[]
[]
[]
[]
[]
[]
[]
[]
[]
[null,"Krav om dokumentation"]
[null,"Dokumentation af processen til vurdering af informationssikkerhedsrisici.",null,"Beskrivelse af metode."]
[null,"Dokumentation af resultatet af vurdering af informationssikkerhedsrisici/risikovurderingsrapport.",null,"Dokumentationen indeholder:\n- identifikation og beskrivelse (titel, dato, forfatter mm.);\n- hensigtsmæssigt format i forhold til anvendelse;\n- revurdering og godkendelse af tilstrækkelighed og hensigtsmæssighed;\n\nDokumentationen er:\n- er til at få på og anvendeligt, når der er brug for det;\n- passende beskyttet (fx i forhold til fortrolighed eller imod modifikation);\n\nDer er taget stilling til:\n- distribution, adgang, genfinding og brug;\n- opbevaring, herundr lovkrav til opbevaring;\n- kontrol af ændringer (fx versionering);\n- bevaring og sletning."]

{"sheet":"Leverandørstyring","index":9,"n_rows":45,"n_cols":12,"rows_kept":45,"cut":false,"hidden":false,"merged":[[33,2,33,3],[33,1,34,1],[6,2,6,3],[6,1,14,1],[21,2,21,3],[16,2,16,3],[16,1,23,1],[17,2,17,3],[13,2,13,3],[30,2,30,3],[25,2,25,3],[25,1,31,1],[19,2,19,3],[20,2,20,3],[22,2,22,3],[23,2,23,3],[44,1,56,11],[32,1,32,11],[34,2,34,3],[35,1,35,11],[24,1,24,11],[26,2,26,3],[27,2,27,3],[28,2,28,3],[29,2,29,3],[31,2,31,3],[39,1,39,11],[40,1,40,11],[41,1,41,2],[41,3,41,11],[42,1,42,2],[42,3,42,4],[0,0,0,2],[3,1,3,8],[4,1,4,11],[5,1,5,4],[8,2,8,3],[7,2,7,3],[15,1,15,11],[18,2,18,3],[9,2,9,3],[10,2,10,3],[11,2,11,3],[12,2,12,3],[14,2,14,3]]}
[{"$f":"MID(CELL(\"filename\",B3),FIND(\"]\",CELL(\"filename\",B3),1)+1,100)","v":"Leverandørstyring"},null,null,null,null,null,null,null,null,null,null,"Gå til Oversigt"]
[]
[null,null,null,null,null,null,null,null,null,null,"Udarbejdet den - og af","Godkendt den-  og af"]
[]
[]
[null,null,null,null,null,"Ja","Delvist","Nej","Ikke relevant","Noter - bemærkninger","Dokumentation","Opfølgning"]
[null,"PLAN","Leverandørstyringsproces",null,"Der er udarbejdet og implementeret i en leverandørstyringsproces",null,null,null,null,null,null,{"$f":"IF(COUNTIF(Opfølgning!B:B,E7)>0,COUNTIF(Opfølgning!B:B,E7),\"Dobbeltklik\")","v":"Dobbeltklik"}]
[null,null,"Risikovurdering af leverandører",null,"Der foretages risikovurderinger af leverandører forud for indgåelse af aftale. ",null,null,null,null,null,null,{"$f":"IF(COUNTIF(Opfølgning!B:B,E8)>0,COUNTIF(Opfølgning!B:B,E8),\"Dobbeltklik\")","v":"Dobbeltklik"}]
[null,null,"Styring af informationssikkerhed",null,"Kontrakten indeholder krav om overholdelse af en anerkendt standard for informationssikkerhed.",null,null,null,null,null,null,{"$f":"IF(COUNTIF(Opfølgning!B:B,E9)>0,COUNTIF(Opfølgning!B:B,E9),\"Dobbeltklik\")","v":"Dobbeltklik"}]
[null,null,"Styrende lovvalg",null,"Lovvalg i kontrakten følger dansk/EU lovgivning.",null,null,null,null,null,null,{"$f":"IF(COUNTIF(Opfølgning!B:B,E10)>0,COUNTIF(Opfølgning!B:B,E10),\"Dobbeltklik\")","v":"Dobbeltklik"}]
[null,null,"Fortrolighedserklæring",null,"Der er underskrevet en tavshedserklæring dækkende kontraktprocessen og leverandørens medarbejdere.",null,null,null,null,null,null,{"$f":"IF(COUNTIF(Opfølgning!B:B,E11)>0,COUNTIF(Opfølgning!B:B,E11),\"Dobbeltklik\")","v":"Dobbeltklik"}]
[null,null,"Styring af underleverandører",null,"Der er retningslinjer for brug af underleverandører i kontrakten.",null,null,null,null,null,null,{"$f":"IF(COUNTIF(Opfølgning!B:B,E12)>0,COUNTIF(Opfølgning!B:B,E12),\"Dobbeltklik\")","v":"Dobbeltklik"}]
[null,null,"Roller og ansvar",null,"Roller og ansvar for kontrakt, ydelser og informationssikkerhed er klart defineret i kontrakten.",null,null,null,null,null,null,{"$f":"IF(COUNTIF(Opfølgning!B:B,E13)>0,COUNTIF(Opfølgning!B:B,E13),\"Dobbeltklik\")","v":"Dobbeltklik"}]
[null,null,"Persondata",null,"Der er indgås databehandleraftaler med de leverandører, der behandler persondata. ",null,null,null,null,null,null,{"$f":"IF(COUNTIF(Opfølgning!B:B,E14)>0,COUNTIF(Opfølgning!B:B,E14),\"Dobbeltklik\")","v":"Dobbeltklik"}]
[null,null,"Ophørsbetingelser",null,"Der er bestemmelser for sletning af data mm.",null,null,null,null,null,null,{"$f":"IF(COUNTIF(Opfølgning!B:B,E15)>0,COUNTIF(Opfølgning!B:B,E15),\"Dobbeltklik\")","v":"Dobbeltklik"}]
[null,"PLAN_slut"]
[null,"DO","Valg af passende kontroller på baggrund af risici",null,"Der er udvalgt passende kontroller, som leverandøren bør prioritere for at håndtere de indentificerede risici i aftaleforholdet. Kontrollerne skrives ind i den skriftlige aftale. ",null,null,null,null,null,null,{"$f":"IF(COUNTIF(Opfølgning!B:B,E17)>0,COUNTIF(Opfølgning!B:B,E17),\"Dobbeltklik\")","v":"Dobbeltklik"}]
[null,null,"Informationssikkerhed",null,"Leverandøren følger god praksis som fx ISO 27001, CobiT, ITIL, har en sikkerhedspolitik og gennemfører løbende awareness-kampagner.",null,null,null,null,null,null,{"$f":"IF(COUNTIF(Opfølgning!B:B,E18)>0,COUNTIF(Opfølgning!B:B,E18),\"Dobbeltklik\")","v":"Dobbeltklik"}]
[null,null,"Fysisk sikkerhed",null,"Leverandøren følger god praksis for fysisk sikkerhed.",null,null,null,null,null,null,{"$f":"IF(COUNTIF(Opfølgning!B:B,E19)>0,COUNTIF(Opfølgning!B:B,E19),\"Dobbeltklik\")","v":"Dobbeltklik"}]
[null,null,"Medarbejdersikkerhed",null,"Leverandørens medarbejdere screenes i forbindelse med ansættelse og skal fremvise ren straffeattest. Medarbejderne skal være certificerede inden for deres arbejdsfelt.",null,null,null,null,null,null,{"$f":"IF(COUNTIF(Opfølgning!B:B,E20)>0,COUNTIF(Opfølgning!B:B,E20),\"Dobbeltklik\")","v":"Dobbeltklik"}]
[null,null,"Adgangskontrol",null,"Leverandøren har implementeret adgangskontrolprocedurer omfattende funktionsadskillelse samt logisk og fysisk adgangskontrol.",null,null,null,null,null,null,{"$f":"IF(COUNTIF(Opfølgning!B:B,E21)>0,COUNTIF(Opfølgning!B:B,E21),\"Dobbeltklik\")","v":"Dobbeltklik"}]
[null,null,"Logning ",null,"Leverandøren har implementeret passende logning og følger regelmæssigt op på denne. ",null,null,null,null,null,null,{"$f":"IF(COUNTIF(Opfølgning!B:B,E22)>0,COUNTIF(Opfølgning!B:B,E22),\"Dobbeltklik\")","v":"Dobbeltklik"}]
[null,null,"It-beredskab",null,"Leverandøren har et it-beredskab i overensstemmelse med god praksis.",null,null,null,null,null,null,{"$f":"IF(COUNTIF(Opfølgning!B:B,E23)>0,COUNTIF(Opfølgning!B:B,E23),\"Dobbeltklik\")","v":"Dobbeltklik"}]
[null,null,"Reetableringstid",null,"Der er defineret recovery time (RTO) for den leverede ydelse.",null,null,null,null,null,null,{"$f":"IF(COUNTIF(Opfølgning!B:B,E24)>0,COUNTIF(Opfølgning!B:B,E24),\"Dobbeltklik\")","v":"Dobbeltklik"}]
[null,"DO_slut"]
[null,"CHECK","Statusmøder ",null,"Der afholdes regelmæssigt statusmøder med leverandøren, hvor der følges op på leverandørens efterlevelse af de sikkerhedskrav der er stillet i aftalen ",null,null,null,null,null,null,{"$f":"IF(COUNTIF(Opfølgning!B:B,E26)>0,COUNTIF(Opfølgning!B:B,E26),\"Dobbeltklik\")","v":"Dobbeltklik"}]
[null,null,"Overvågning",null,"Leverandøren gennemfører regelmæssig overvågning af informationssikkerheden, som fx gennemgang af adgange og rettigheder, logning.",null,null,null,null,null,null,{"$f":"IF(COUNTIF(Opfølgning!B:B,E27)>0,COUNTIF(Opfølgning!B:B,E27),\"Dobbeltklik\")","v":"Dobbeltklik"}]
[null,null,"Sikkerhedstests",null,"Leverandøren får regelmæssigt gennemgået informationssikkerheden i form af tekniske tests, gennemgang af it-kontroller mm.",null,null,null,null,null,null,{"$f":"IF(COUNTIF(Opfølgning!B:B,E28)>0,COUNTIF(Opfølgning!B:B,E28),\"Dobbeltklik\")","v":"Dobbeltklik"}]
[null,null,"Reetableringstid",null,"Leverandøren kan reetablere efter en hændelse inden for det specificerede tidpunkt.",null,null,null,null,null,null,{"$f":"IF(COUNTIF(Opfølgning!B:B,E29)>0,COUNTIF(Opfølgning!B:B,E29),\"Dobbeltklik\")","v":"Dobbeltklik"}]
[null,null,"Rapportering",null,"Der er adgang til leverandørens rapporter vedrørende informationssikkerhed.",null,null,null,null,null,null,{"$f":"IF(COUNTIF(Opfølgning!B:B,E30)>0,COUNTIF(Opfølgning!B:B,E30),\"Dobbeltklik\")","v":"Dobbeltklik"}]
[null,null,"Statusmøder ",null,"Der afholdes regelmæssigt statusmøder med leverandøren, hvor der følges op på leverandørens efterlevelse af de sikkerhedskrav der er stillet i aftalen ",null,null,null,null,null,null,{"$f":"IF(COUNTIF(Opfølgning!B:B,E31)>0,COUNTIF(Opfølgning!B:B,E31),\"Dobbeltklik\")","v":"Dobbeltklik"}]
[null,null,"Revision",null,"Leverandøren har aftale med uafhængig revisor om regelmæssig gennemgang af informationssikkerheden.",null,null,null,null,null,null,{"$f":"IF(COUNTIF(Opfølgning!B:B,E32)>0,COUNTIF(Opfølgning!B:B,E32),\"Dobbeltklik\")","v":"Dobbeltklik"}]
[null,"CHECK_slut"]
[null,"ACT","Ændringsstyring ",null,"Der er stillet krav om at væsentlige ændringer i leverandørforholdet skal godkendes - Der udføres en ny risikovurdering. ",null,null,null,null,null,null,{"$f":"IF(COUNTIF(Opfølgning!B:B,E34)>0,COUNTIF(Opfølgning!B:B,E34),\"Dobbeltklik\")","v":"Dobbeltklik"}]
[null,null,"Rapportering af sikkerhedshændelser",null,"Der er stillet krav om at leverandøren rapportere om sikkerhedshændelser, og der defineres reaktionstider og udbedringsprioriteringer ",null,null,null,null,null,null,{"$f":"IF(COUNTIF(Opfølgning!B:B,E35)>0,COUNTIF(Opfølgning!B:B,E35),\"Dobbeltklik\")","v":"Dobbeltklik"}]
[null,"ACT_slut"]
[]
[]
[]
[]
[null,"Krav om dokumentation"]
[null,"Dokumentation af processen:"]
[null,"ANBEFALING\n\nRegister over levarandører. Registret opdeles i udvikling, drift og service, da der er forskellige risici og sikkerhedsudfordringer forbundet med hvert område. "]
[]
[null,"Dokumentationen indeholder:\n- identifikation og beskrivelse (titel, dato, forfatter mm.);\n- hensigtsmæssigt format i forhold til anvendelse;\n- revurdering og godkendelse af tilstrækkelighed og hensigtsmæssighed;\n\nDokumentationen er:\n- til at få fat på og anvendelig, når der er brug for det;\n- passende beskyttet (fx i forhold til fortrolighed eller imod ændringer);\n\nDer er taget stilling til:\n- distribution, adgang, genfinding og brug;\n- opbevaring, herunder lovkrav til opbevaring;\n- kontrol af ændringer (fx versionering);\n- bevaring og sletning."]

{"sheet":"It-beredskab","index":10,"n_rows":38,"n_cols":12,"rows_kept":38,"cut":false,"hidden":false,"merged":[[37,1,49,11],[31,7,31,9],[32,1,32,3],[22,1,22,11],[25,1,25,11],[30,1,30,11],[23,1,24,1],[33,1,33,3],[34,1,34,3],[35,1,35,3],[23,2,24,3],[31,1,31,3],[31,4,31,6],[0,0,0,2],[3,1,3,8],[4,1,4,11],[5,1,5,4],[6,1,13,1],[6,2,13,3],[14,1,14,11],[15,1,18,1],[15,2,18,3],[19,1,19,11],[20,1,21,1],[20,2,21,3]]}
[{"$f":"MID(CELL(\"filename\",B3),FIND(\"]\",CELL(\"filename\",B3),1)+1,100)","v":"It-beredskab"},null,null,null,null,null,null,null,null,null,null,"Gå til Oversigt"]
[]
[null,null,null,null,null,null,null,null,null,null,"Udarbejdet den - og af","Godkendt den-  og af"]
[]
[]
[null,null,null,null,null,"Ja","Delvist","Nej","Ikke relevant","Noter - bemærkninger","Dokumentation","Opfølgning"]
[null,"PLAN","It-beredskabspolitik",null,"Der er etableret en strategi for it-beredskabet.",null,null,null,null,null,null,{"$f":"IF(COUNTIF(Opfølgning!B:B,E7)>0,COUNTIF(Opfølgning!B:B,E7),\"Dobbeltklik\")","v":"Dobbeltklik"}]
[null,null,null,null,"Ledelsen har defineret overordnede målsætninger for beredskabet",null,null,null,null,null,null,{"$f":"IF(COUNTIF(Opfølgning!B:B,E8)>0,COUNTIF(Opfølgning!B:B,E8),\"Dobbeltklik\")","v":"Dobbeltklik"}]
[null,null,null,null,"De relevante roller i forhold planlægning, opgaver og kommunikation er identificeret og indgår i beredskabsplanen. Kravene til leverandørens ansvar i forhold til beredskab er stillet i aftalen og er baseret på en risikovurdering ",null,null,null,null,null,null,{"$f":"IF(COUNTIF(Opfølgning!B:B,E9)>0,COUNTIF(Opfølgning!B:B,E9),\"Dobbeltklik\")","v":"Dobbeltklik"}]
[null,null,null,null,"It-beredskabet er forankret i organisationens øvrige beredskab eller krisestyring ",null,null,null,null,null,null,{"$f":"IF(COUNTIF(Opfølgning!B:B,E10)>0,COUNTIF(Opfølgning!B:B,E10),\"Dobbeltklik\")","v":"Dobbeltklik"}]
[null,null,null,null,"Relevante sikkerhedshændelser, der kan forårsage afbrydelser i forretningsprocesser er identificeret, og sandsynligheden og konsekvensen er vurderet.",null,null,null,null,null,null,{"$f":"IF(COUNTIF(Opfølgning!B:B,E11)>0,COUNTIF(Opfølgning!B:B,E11),\"Dobbeltklik\")","v":"Dobbeltklik"}]
[null,null,null,null,"Retableringsplaner tager afsæt i risikovurderinger samt i Business Impact Assessments.",null,null,null,null,null,null,{"$f":"IF(COUNTIF(Opfølgning!B:B,E12)>0,COUNTIF(Opfølgning!B:B,E12),\"Dobbeltklik\")","v":"Dobbeltklik"}]
[null,null,null,null,"Der er etableret beredskabsplaner, herunder forretningsnødplaner.",null,null,null,null,null,null,{"$f":"IF(COUNTIF(Opfølgning!B:B,E13)>0,COUNTIF(Opfølgning!B:B,E13),\"Dobbeltklik\")","v":"Dobbeltklik"}]
[null,null,null,null,"Der er planer for kommunikation til nøglepersoner, medarbejdere og eksterne interessenter.",null,null,null,null,null,null,{"$f":"IF(COUNTIF(Opfølgning!B:B,E14)>0,COUNTIF(Opfølgning!B:B,E14),\"Dobbeltklik\")","v":"Dobbeltklik"}]
[null,"PLAN_slut"]
[null,"DO","It-beredskab",null,"Der er implementeret et system til styring af beredskabet med angivelse af roller og ansvar.",null,null,null,null,null,null,{"$f":"IF(COUNTIF(Opfølgning!B:B,E16)>0,COUNTIF(Opfølgning!B:B,E16),\"Dobbeltklik\")","v":"Dobbeltklik"}]
[null,null,null,null,"Der er implementeret kontroller, processer og procedurer for it-beredskabet på tværs i organisationen.",null,null,null,null,null,null,{"$f":"IF(COUNTIF(Opfølgning!B:B,E17)>0,COUNTIF(Opfølgning!B:B,E17),\"Dobbeltklik\")","v":"Dobbeltklik"}]
[null,null,null,null,"De implementerede kontroller imødekommer de tilgængelighedskrav, der er fastsat i risikovurderingen ",null,null,null,null,null,null,{"$f":"IF(COUNTIF(Opfølgning!B:B,E18)>0,COUNTIF(Opfølgning!B:B,E18),\"Dobbeltklik\")","v":"Dobbeltklik"}]
[null,null,null,null,"Der er gennemført træning i beredskabssituationer.",null,null,null,null,null,null,{"$f":"IF(COUNTIF(Opfølgning!B:B,E19)>0,COUNTIF(Opfølgning!B:B,E19),\"Dobbeltklik\")","v":"Dobbeltklik"}]
[null,"DO_slut"]
[null,"CHECK","Test af it-beredskabsplanen",null,"Effekten af it-beredskabet er testet og evalueret  mod målsætningerne for beredskabet.",null,null,null,null,null,null,{"$f":"IF(COUNTIF(Opfølgning!B:B,E21)>0,COUNTIF(Opfølgning!B:B,E21),\"Dobbeltklik\")","v":"Dobbeltklik"}]
[null,null,null,null,"De relevante leverandører indgår i testen af beredskabet.",null,null,null,null,null,null,{"$f":"IF(COUNTIF(Opfølgning!B:B,E22)>0,COUNTIF(Opfølgning!B:B,E22),\"Dobbeltklik\")","v":"Dobbeltklik"}]
[null,"CHECK_slut"]
[null,"ACT","Forbedringer af it-beredskabet",null,"Resultatet af evalueringen er rapporteret til ledelsen med anbefalinger til forbedringer.",null,null,null,null,null,null,{"$f":"IF(COUNTIF(Opfølgning!B:B,E24)>0,COUNTIF(Opfølgning!B:B,E24),\"Dobbeltklik\")","v":"Dobbeltklik"}]
[null,null,null,null,"It-beredskabet er tilrettet i forhold til resultatet af test og evaluering med henblik på større effektivitet i de tværorganisatoriske processer.",null,null,null,null,null,null,{"$f":"IF(COUNTIF(Opfølgning!B:B,E25)>0,COUNTIF(Opfølgning!B:B,E25),\"Dobbeltklik\")","v":"Dobbeltklik"}]
[null,"ACT_slut"]
[]
[]
[]
[]
[null,"Krav om dokumentation"]
[null,"Dokumentation af processen:"]
[null,"It-beredskabsstrategi"]
[null,"It-beredskabsplan"]
[null,"Forretningsnødplaner"]
[null,"Rapportering af test med handlingsplaner"]
[]
[null,"Dokumentationen indeholder:\n- identifikation og beskrivelse (titel, dato, forfatter mm.);\n- hensigtsmæssigt format i forhold til anvendelse;\n- revurdering og godkendelse af tilstrækkelighed og hensigtsmæssighed;\n\nDokumentationen er:\n- til at få fat på og anvendelig, når der er brug for det;\n- passende beskyttet (fx i forhold til fortrolighed eller imod ændringer);\n\nDer er taget stilling til:\n- distribution, adgang, genfinding og brug;\n- opbevaring, herunder lovkrav til opbevaring;\n- kontrol af ændringer (fx versionering);\n- bevaring og sletning."]

{"sheet":"Måling","index":11,"n_rows":24,"n_cols":12,"rows_kept":24,"cut":false,"hidden":false,"merged":[[23,1,35,11],[21,1,21,2],[10,2,11,3],[20,1,20,2],[12,1,12,11],[14,1,14,11],[17,1,17,11],[18,1,18,11],[19,1,19,2],[19,3,19,11],[13,2,13,3],[7,1,7,11],[9,1,9,11],[10,1,11,1],[8,2,8,3],[0,0,0,2],[3,1,3,8],[4,1,4,11],[5,1,5,4],[6,2,6,3]]}
[{"$f":"MID(CELL(\"filename\",B3),FIND(\"]\",CELL(\"filename\",B3),1)+1,100)","v":"Måling"},null,null,null,null,null,null,null,null,null,null,"Gå til Oversigt"]
[]
[null,null,null,null,null,null,null,null,null,null,"Udarbejdet den - og af","Godkendt den-  og af"]
[]
[]
[null,null,null,null,null,"Ja","Delvist","Nej","Ikke relevant","Noter - bemærkninger","Dokumentation","Opfølgning"]
[null,"PLAN","Processerne for Overvågning, Måling, Analysering og Evaluering ",null,"Metoderne til overvågning og måling er fastsat og beskrevet, herunder \n- hvad der skal overvåges og måles,\n- hvornår de skal udføres,\n- hvem der har ansvaret,\n- hvordan resultater skal evalueres.",null,null,null,null,null,null,{"$f":"IF(COUNTIF(Opfølgning!B:B,E7)>0,COUNTIF(Opfølgning!B:B,E7),\"Dobbeltklik\")","v":"Dobbeltklik"}]
[null,"PLAN_slut"]
[null,"DO"]
[null,"DO_slut"]
[null,"CHECK","Revurdering af organisationens overvågninger og målinger",null,"Anvendeligheden og sammenligneligheden i resultaterne fra de udførte overvågninger og målinger vurderes.",null,null,null,null,null,null,{"$f":"IF(COUNTIF(Opfølgning!B:B,E11)>0,COUNTIF(Opfølgning!B:B,E11),\"Dobbeltklik\")","v":"Dobbeltklik"}]
[null,null,null,null,"Frekvensen af de udførte målinger revurderes.",null,null,null,null,null,null,{"$f":"IF(COUNTIF(Opfølgning!B:B,E12)>0,COUNTIF(Opfølgning!B:B,E12),\"Dobbeltklik\")","v":"Dobbeltklik"}]
[null,"CHECK_slut"]
[null,"ACT","Opfølgning på evalueringer af overvågninger og målinger",null,"Metoderne til overvågning og måling ændres i forhold til uhensigtsmæssigheder.",null,null,null,null,null,null,{"$f":"IF(COUNTIF(Opfølgning!B:B,E14)>0,COUNTIF(Opfølgning!B:B,E14),\"Dobbeltklik\")","v":"Dobbeltklik"}]
[null,"ACT_slut"]
[]
[]
[]
[null,"Krav om dokumentation"]
[null,"Dokumentation af processen:"]
[null,"Overvågning og måling. "]
[null,"Ledelsens revurdering af ISMS"]
[]
[null,"Dokumentationen indeholder:\n- identifikation og beskrivelse (titel, dato, forfatter mm.);\n- hensigtsmæssigt format i forhold til anvendelse;\n- revurdering og godkendelse af tilstrækkelighed og hensigtsmæssighed;\n\nDokumentationen er:\n- til at få fat på og anvendelig, når der er brug for det;\n- passende beskyttet (fx i forhold til fortrolighed eller imod ændringer);\n\nDer er taget stilling til:\n- distribution, adgang, genfinding og brug;\n- opbevaring, herunder lovkrav til opbevaring;\n- kontrol af ændringer (fx versionering);\n- bevaring og sletning."]

{"sheet":"Intern opfølgning","index":12,"n_rows":29,"n_cols":12,"rows_kept":29,"cut":false,"hidden":false,"merged":[[28,1,40,11],[18,1,18,11],[11,1,11,11],[8,1,10,1],[8,2,10,3],[14,1,14,11],[15,1,17,1],[15,2,17,3],[12,2,13,3],[12,1,13,1],[0,0,0,2],[3,1,3,8],[4,1,4,11],[25,1,25,2],[26,1,26,2],[21,1,21,11],[22,1,22,11],[23,1,23,2],[23,3,23,11],[24,1,24,2],[5,1,5,4],[7,1,7,11],[6,2,6,3]]}
[{"$f":"MID(CELL(\"filename\",B3),FIND(\"]\",CELL(\"filename\",B3),1)+1,100)","v":"Intern opfølgning"},null,null,null,null,null,null,null,null,null,null,"Gå til Oversigt"]
[]
[null,null,null,null,null,null,null,null,null,null,"Udarbejdet den - og af","Godkendt den-  og af"]
[]
[]
[null,null,null,null,null,"Ja","Delvist","Nej","Ikke relevant","Noter - bemærkninger","Dokumentation","Opfølgning"]
[null,"PLAN","Proces for intern audit",null,"Metoden, kriterier og afgrænsning er defineret og beskrevet, herunder\n- roller og ansvar,\n- rapportering af resultatet til ledelsen,\n- valg af intern auditor.",null,null,null,null,null,null,{"$f":"IF(COUNTIF(Opfølgning!B:B,E7)>0,COUNTIF(Opfølgning!B:B,E7),\"Dobbeltklik\")","v":"Dobbeltklik"}]
[null,"PLAN_slut"]
[null,"DO","Gennemførelse af den interne audit af informationssikkerhedsstyringen i organisationen ",null,"Organisationen gennemfører intern audit på informationssikkerheds-styringen med planlagte intervaller.",null,null,null,null,null,null,{"$f":"IF(COUNTIF(Opfølgning!B:B,E9)>0,COUNTIF(Opfølgning!B:B,E9),\"Dobbeltklik\")","v":"Dobbeltklik"}]
[null,null,null,null,"Den interne audit vurderer om sikkerhedsarbejdet lever op til organisationens egne krav til it-sikkerhed.",null,null,null,null,null,null,{"$f":"IF(COUNTIF(Opfølgning!B:B,E10)>0,COUNTIF(Opfølgning!B:B,E10),\"Dobbeltklik\")","v":"Dobbeltklik"}]
[null,null,null,null,"Den interne audit vurderer om sikkerhedsarbejdet lever op til ISO 27001 standarden.",null,null,null,null,null,null,{"$f":"IF(COUNTIF(Opfølgning!B:B,E11)>0,COUNTIF(Opfølgning!B:B,E11),\"Dobbeltklik\")","v":"Dobbeltklik"}]
[null,"DO_slut"]
[null,"CHECK","Proces for intern audit",null,"Den interne audit er implementeret og vedligeholdes effektivt.",null,null,null,null,null,null,{"$f":"IF(COUNTIF(Opfølgning!B:B,E13)>0,COUNTIF(Opfølgning!B:B,E13),\"Dobbeltklik\")","v":"Dobbeltklik"}]
[null,null,null,null,"Programmet for intern audit revurderes efter gennemført audit.",null,null,null,null,null,null,{"$f":"IF(COUNTIF(Opfølgning!B:B,E14)>0,COUNTIF(Opfølgning!B:B,E14),\"Dobbeltklik\")","v":"Dobbeltklik"}]
[null,"CHECK_slut"]
[null,"ACT","Forbedringer af informationssikkerhedssystemet",null,"Afvigelser fra organisationens sikkerhedsmæssige målsætninger gennemgås og årsagen fastlægges.",null,null,null,null,null,null,{"$f":"IF(COUNTIF(Opfølgning!B:B,E16)>0,COUNTIF(Opfølgning!B:B,E16),\"Dobbeltklik\")","v":"Dobbeltklik"}]
[null,null,null,null,"Effektiviteten i de korrigerende indsatser evalueres og der foretages ændringer i informationssikkehedsstyringen på bagggrund af eventuelle uhensigtsmæssigheder.",null,null,null,null,null,null,{"$f":"IF(COUNTIF(Opfølgning!B:B,E17)>0,COUNTIF(Opfølgning!B:B,E17),\"Dobbeltklik\")","v":"Dobbeltklik"}]
[null,null,null,null,"Informationssikkerheden og styringen af sikkerheden forbedres  på baggrund af de interne opfølgninger. ",null,null,null,null,null,null,{"$f":"IF(COUNTIF(Opfølgning!B:B,E18)>0,COUNTIF(Opfølgning!B:B,E18),\"Dobbeltklik\")","v":"Dobbeltklik"}]
[null,"ACT_slut"]
[]
[]
[]
[null,"Krav om dokumentation"]
[null,"Dokumentation af processen:"]
[null,"Programmer for interne audits"]
[null,"Gennemførte interne audits"]
[null,"Afvigelser fundet i forbindelse med den interne audit samt de efterfølgende korrigerende handlinger og resultatet af disse."]
[]
[null,"Dokumentationen indeholder:\n- identifikation og beskrivelse (titel, dato, forfatter mm.);\n- hensigtsmæssigt format i forhold til anvendelse;\n- revurdering og godkendelse af tilstrækkelighed og hensigtsmæssighed;\n\nDokumentationen er:\n- til at få fat på og anvendelig, når der er brug for det;\n- passende beskyttet (fx i forhold til fortrolighed eller imod ændringer);\n\nDer er taget stilling til:\n- distribution, adgang, genfinding og brug;\n- opbevaring, herunder lovkrav til opbevaring;\n- kontrol af ændringer (fx versionering);\n- bevaring og sletning."]