{"text_format":"1","workbook":"xlsx","n_sheets":13,"sheets":["Oversigt","Graf_Oversigt","Vejledning","Opfølgning","Risikovurdering","Risikohåndtering","ISMS","Ledelsesforankring","Politik","Leverandørstyring","It-beredskab","Måling","Intern opfølgning"],"not_rendered":{"charts":14,"images":0,"macros":1,"external_links":0,"defined_names":16,"comments":0,"pivot_tables":0},"unopened":[],"bounds":{"document_bytes":16777216,"sheet_cells":100000,"rows_first":2000,"rows_last":500,"rows_between":2000,"halvings":0,"cell_chars":16384,"cell_head_chars":4096},"cells_cut":0,"cells_raw":0,"read":"whole","date_system":"1900"}

{"sheet":"Oversigt","index":0,"n_rows":67,"n_cols":18,"rows_kept":67,"cut":false,"hidden":false,"merged":[[60,5,60,6],[60,8,60,9],[60,14,60,15],[60,11,60,12],[60,1,60,3],[0,0,0,3],[5,1,10,1],[2,4,2,6],[0,14,0,15],[2,7,2,9],[2,10,2,12],[2,13,2,15],[2,1,3,3],[0,12,0,13],[47,1,52,1],[53,1,58,1],[11,1,16,1],[23,1,28,1],[29,1,34,1],[35,1,40,1],[41,1,46,1],[17,1,22,1]]}
["Oversigt",null,null,null,null,null,null,null,null,null,null,null,"Opfølgning",null,"Noter"]
[]
[null,"Titel",null,null,"PLAN",null,null,"DO",null,null,"CHECK",null,null,"ACT",null,null,null," "]
[null,null,null,null,"Antal","Vægt","Proces","Antal","Vægt","Proces","Antal","Vægt","Proces","Antal","Vægt","Proces"]
[null,null,"Titel","Svar",{"$f":"E3&\"_Antal\"","v":"PLAN_Antal"},{"$f":"E3&\"_Vægt\"","v":"PLAN_Vægt"},{"$f":"E3&\"_Proces\"","v":"PLAN_Proces"},{"$f":"H3&\"_Antal\"","v":"DO_Antal"},{"$f":"H3&\"_Vægt\"","v":"DO_Vægt"},{"$f":"H3&\"_Proces\"","v":"DO_Proces"},{"$f":"K3&\"_Antal\"","v":"CHECK_Antal"},{"$f":"K3&\"_Vægt\"","v":"CHECK_Vægt"},{"$f":"K3&\"_Proces\"","v":"CHECK_Proces"},{"$f":"N3&\"_Antal\"","v":"ACT_Antal"},{"$f":"N3&\"_Vægt\"","v":"ACT_Vægt"},{"$f":"N3&\"_Proces\"","v":"ACT_Proces"}]
[null,"Risikovurdering",{"$f":"B6","v":"Risikovurdering"},"Ja",{"$f":"IFERROR(COUNTIF(INDIRECT(\"'\"&$B6&\"'!\"&CHAR(MATCH($D6,INDIRECT(\"'\"&$B6&\"'!6:6\",TRUE),0)+64)&MATCH(E$3,INDIRECT(\"'\"&$B6&\"'!B:B\",TRUE),0)&\":\"&CHAR(MATCH($D6,INDIRECT(\"'\"&$B6&\"'!6:6\",TRUE),0)+64)&MATCH(E$3&\"_slut\",INDIRECT(\"'\"&$B6&\"'!B:B\",TRUE),0),TRUE),\"X\"),0)","v":0},{"$f":"IF(E11=0,0,COUNTIF(INDIRECT(\"'\"&$B6&\"'!\"&CHAR(MATCH($D6,INDIRECT(\"'\"&$B6&\"'!6:6\",TRUE),0)+64)&MATCH(E$3,INDIRECT(\"'\"&$B6&\"'!B:B\",TRUE),0)&\":\"&CHAR(MATCH($D6,INDIRECT(\"'\"&$B6&\"'!6:6\",TRUE),0)+64)&MATCH(E$3&\"_slut\",INDIRECT(\"'\"&$B6&\"'!B:B\",TRUE),0),TRUE),\"X\")/E$61)","v":0},{"$f":"IF(E11=0,0,COUNTIF(INDIRECT(\"'\"&$B6&\"'!\"&CHAR(MATCH($D6,INDIRECT(\"'\"&$B6&\"'!6:6\",TRUE),0)+64)&MATCH(E$3,INDIRECT(\"'\"&$B6&\"'!B:B\",TRUE),0)&\":\"&CHAR(MATCH($D6,INDIRECT(\"'\"&$B6&\"'!6:6\",TRUE),0)+64)&MATCH(E$3&\"_slut\",INDIRECT(\"'\"&$B6&\"'!B:B\",TRUE),0),TRUE),\"X\")/SUM(E6:E10))","v":0},{"$f":"IFERROR(COUNTIF(INDIRECT(\"'\"&$B6&\"'!\"&CHAR(MATCH($D6,INDIRECT(\"'\"&$B6&\"'!6:6\",TRUE),0)+64)&MATCH(H$3,INDIRECT(\"'\"&$B6&\"'!B:B\",TRUE),0)&\":\"&CHAR(MATCH($D6,INDIRECT(\"'\"&$B6&\"'!6:6\",TRUE),0)+64)&MATCH(H$3&\"_slut\",INDIRECT(\"'\"&$B6&\"'!B:B\",TRUE),0),TRUE),\"X\"),0)","v":0},{"$f":"IF(H11=0,0,COUNTIF(INDIRECT(\"'\"&$B6&\"'!\"&CHAR(MATCH($D6,INDIRECT(\"'\"&$B6&\"'!6:6\",TRUE),0)+64)&MATCH(H$3,INDIRECT(\"'\"&$B6&\"'!B:B\",TRUE),0)&\":\"&CHAR(MATCH($D6,INDIRECT(\"'\"&$B6&\"'!6:6\",TRUE),0)+64)&MATCH(H$3&\"_slut\",INDIRECT(\"'\"&$B6&\"'!B:B\",TRUE),0),TRUE),\"X\")/H$61)","v":0},{"$f":"IF(H11=0,0,COUNTIF(INDIRECT(\"'\"&$B6&\"'!\"&CHAR(MATCH($D6,INDIRECT(\"'\"&$B6&\"'!6:6\",TRUE),0)+64)&MATCH(H$3,INDIRECT(\"'\"&$B6&\"'!B:B\",TRUE),0)&\":\"&CHAR(MATCH($D6,INDIRECT(\"'\"&$B6&\"'!6:6\",TRUE),0)+64)&MATCH(H$3&\"_slut\",INDIRECT(\"'\"&$B6&\"'!B:B\",TRUE),0),TRUE),\"X\")/SUM(H6:H10))","v":0},{"$f":"IFERROR(COUNTIF(INDIRECT(\"'\"&$B6&\"'!\"&CHAR(MATCH($D6,INDIRECT(\"'\"&$B6&\"'!6:6\",TRUE),0)+64)&MATCH(K$3,INDIRECT(\"'\"&$B6&\"'!B:B\",TRUE),0)&\":\"&CHAR(MATCH($D6,INDIRECT(\"'\"&$B6&\"'!6:6\",TRUE),0)+64)&MATCH(K$3&\"_slut\",INDIRECT(\"'\"&$B6&\"'!B:B\",TRUE),0),TRUE),\"X\"),0)","v":0},{"$f":"IF(K11=0,0,COUNTIF(INDIRECT(\"'\"&$B6&\"'!\"&CHAR(MATCH($D6,INDIRECT(\"'\"&$B6&\"'!6:6\",TRUE),0)+64)&MATCH(K$3,INDIRECT(\"'\"&$B6&\"'!B:B\",TRUE),0)&\":\"&CHAR(MATCH($D6,INDIRECT(\"'\"&$B6&\"'!6:6\",TRUE),0)+64)&MATCH(K$3&\"_slut\",INDIRECT(\"'\"&$B6&\"'!B:B\",TRUE),0),TRUE),\"X\")/K$61)","v":0},{"$f":"IF(K11=0,0,COUNTIF(INDIRECT(\"'\"&$B6&\"'!\"&CHAR(MATCH($D6,INDIRECT(\"'\"&$B6&\"'!6:6\",TRUE),0)+64)&MATCH(K$3,INDIRECT(\"'\"&$B6&\"'!B:B\",TRUE),0)&\":\"&CHAR(MATCH($D6,INDIRECT(\"'\"&$B6&\"'!6:6\",TRUE),0)+64)&MATCH(K$3&\"_slut\",INDIRECT(\"'\"&$B6&\"'!B:B\",TRUE),0),TRUE),\"X\")/SUM(K6:K10))","v":0},{"$f":"IFERROR(COUNTIF(INDIRECT(\"'\"&$B6&\"'!\"&CHAR(MATCH($D6,INDIRECT(\"'\"&$B6&\"'!6:6\",TRUE),0)+64)&MATCH(N$3,INDIRECT(\"'\"&$B6&\"'!B:B\",TRUE),0)&\":\"&CHAR(MATCH($D6,INDIRECT(\"'\"&$B6&\"'!6:6\",TRUE),0)+64)&MATCH(N$3&\"_slut\",INDIRECT(\"'\"&$B6&\"'!B:B\",TRUE),0),TRUE),\"X\"),0)","v":0},{"$f":"IF(N11=0,0,COUNTIF(INDIRECT(\"'\"&$B6&\"'!\"&CHAR(MATCH($D6,INDIRECT(\"'\"&$B6&\"'!6:6\",TRUE),0)+64)&MATCH(N$3,INDIRECT(\"'\"&$B6&\"'!B:B\",TRUE),0)&\":\"&CHAR(MATCH($D6,INDIRECT(\"'\"&$B6&\"'!6:6\",TRUE),0)+64)&MATCH(N$3&\"_slut\",INDIRECT(\"'\"&$B6&\"'!B:B\",TRUE),0),TRUE),\"X\")/N$61)","v":0},{"$f":"IF(N11=0,0,COUNTIF(INDIRECT(\"'\"&$B6&\"'!\"&CHAR(MATCH($D6,INDIRECT(\"'\"&$B6&\"'!6:6\",TRUE),0)+64)&MATCH(N$3,INDIRECT(\"'\"&$B6&\"'!B:B\",TRUE),0)&\":\"&CHAR(MATCH($D6,INDIRECT(\"'\"&$B6&\"'!6:6\",TRUE),0)+64)&MATCH(N$3&\"_slut\",INDIRECT(\"'\"&$B6&\"'!B:B\",TRUE),0),TRUE),\"X\")/SUM(N6:N10))","v":0}]
{"$rows_left_out":62}
{"sheet":"Graf_Oversigt","index":1,"n_rows":37,"n_cols":34,"rows_kept":37,"cut":false,"hidden":true,"merged":[[1,2,1,7],[1,8,1,13],[1,14,1,19],[1,20,1,25],[1,26,1,31],[25,2,25,7],[25,8,25,13],[25,14,25,19],[25,20,25,25],[25,26,25,31],[13,2,13,7],[13,8,13,13],[13,14,13,19],[13,20,13,25],[13,26,13,31]]}
[null,null,null,null,null,null,null,null,null,null,null,null,null,null,null,null,null,null,null,null,null,null,null,null,null,null,null,null,null,null,null,null,null,"list_x"]
[null,"Type","PLAN",null,null,null,null,null,"DO",null,null,null,null,null,"CHECK",null,null,null,null,null,"ACT",null,null,null,null,null,"SUM",null,null,null,null,null,null,"X"]
[null,"Antal","Ja","Delvist","Nej","Ikke relevant","Ikke sat","TOTAL","Ja","Delvist","Nej","Ikke relevant","Ikke sat","TOTAL","Ja","Delvist","Nej","Ikke relevant","Ikke sat","TOTAL","Ja","Delvist","Nej","Ikke relevant","Ikke sat","TOTAL","Ja","Delvist","Nej","Ikke relevant","Ikke sat","TOTAL"]
[null,"Risikovurdering",{"$f":"SUMIFS(Oversigt!$E:$E,Oversigt!$C:$C,$B4,Oversigt!$D:$D,C$3)","v":0},{"$f":"SUMIFS(Oversigt!$E:$E,Oversigt!$C:$C,$B4,Oversigt!$D:$D,D$3)","v":0},{"$f":"SUMIFS(Oversigt!$E:$E,Oversigt!$C:$C,$B4,Oversigt!$D:$D,E$3)","v":0},{"$f":"SUMIFS(Oversigt!$E:$E,Oversigt!$C:$C,$B4,Oversigt!$D:$D,F$3)","v":0},{"$f":"SUMIFS(Oversigt!$E:$E,Oversigt!$C:$C,$B4,Oversigt!$D:$D,G$3)","v":2},{"$f":"SUMIFS(Oversigt!$E:$E,Oversigt!$C:$C,$B4,Oversigt!$D:$D,H$3)","v":2},{"$f":"SUMIFS(Oversigt!$H:$H,Oversigt!$C:$C,$B4,Oversigt!$D:$D,I$3)","v":0},{"$f":"SUMIFS(Oversigt!$H:$H,Oversigt!$C:$C,$B4,Oversigt!$D:$D,J$3)","v":0},{"$f":"SUMIFS(Oversigt!$H:$H,Oversigt!$C:$C,$B4,Oversigt!$D:$D,K$3)","v":0},{"$f":"SUMIFS(Oversigt!$H:$H,Oversigt!$C:$C,$B4,Oversigt!$D:$D,L$3)","v":0},{"$f":"SUMIFS(Oversigt!$H:$H,Oversigt!$C:$C,$B4,Oversigt!$D:$D,M$3)","v":5},{"$f":"SUMIFS(Oversigt!$H:$H,Oversigt!$C:$C,$B4,Oversigt!$D:$D,N$3)","v":5},{"$f":"SUMIFS(Oversigt!$K:$K,Oversigt!$C:$C,$B4,Oversigt!$D:$D,O$3)","v":0},{"$f":"SUMIFS(Oversigt!$K:$K,Oversigt!$C:$C,$B4,Oversigt!$D:$D,P$3)","v":0},{"$f":"SUMIFS(Oversigt!$K:$K,Oversigt!$C:$C,$B4,Oversigt!$D:$D,Q$3)","v":0},{"$f":"SUMIFS(Oversigt!$K:$K,Oversigt!$C:$C,$B4,Oversigt!$D:$D,R$3)","v":0},{"$f":"SUMIFS(Oversigt!$K:$K,Oversigt!$C:$C,$B4,Oversigt!$D:$D,S$3)","v":3},{"$f":"SUMIFS(Oversigt!$K:$K,Oversigt!$C:$C,$B4,Oversigt!$D:$D,T$3)","v":3},{"$f":"SUMIFS(Oversigt!$N:$N,Oversigt!$C:$C,$B4,Oversigt!$D:$D,U$3)","v":0},{"$f":"SUMIFS(Oversigt!$N:$N,Oversigt!$C:$C,$B4,Oversigt!$D:$D,V$3)","v":0},{"$f":"SUMIFS(Oversigt!$N:$N,Oversigt!$C:$C,$B4,Oversigt!$D:$D,W$3)","v":0},{"$f":"SUMIFS(Oversigt!$N:$N,Oversigt!$C:$C,$B4,Oversigt!$D:$D,X$3)","v":0},{"$f":"SUMIFS(Oversigt!$N:$N,Oversigt!$C:$C,$B4,Oversigt!$D:$D,Y$3)","v":1},{"$f":"SUMIFS(Oversigt!$N:$N,Oversigt!$C:$C,$B4,Oversigt!$D:$D,Z$3)","v":1},{"$f":"SUMIFS(Oversigt!$E:$E,Oversigt!$C:$C,$B4,Oversigt!$D:$D,AA$3)+SUMIFS(Oversigt!$H:$H,Oversigt!$C:$C,$B4,Oversigt!$D:$D,AA$3)+SUMIFS(Oversigt!$K:$K,Oversigt!$C:$C,$B4,Oversigt!$D:$D,AA$3)+SUMIFS(Oversigt!$N:$N,Oversigt!$C:$C,$B4,Oversigt!$D:$D,AA$3)","v":0},{"$f":"SUMIFS(Oversigt!$E:$E,Oversigt!$C:$C,$B4,Oversigt!$D:$D,AB$3)+SUMIFS(Oversigt!$H:$H,Oversigt!$C:$C,$B4,Oversigt!$D:$D,AB$3)+SUMIFS(Oversigt!$K:$K,Oversigt!$C:$C,$B4,Oversigt!$D:$D,AB$3)+SUMIFS(Oversigt!$N:$N,Oversigt!$C:$C,$B4,Oversigt!$D:$D,AB$3)","v":0},{"$f":"SUMIFS(Oversigt!$E:$E,Oversigt!$C:$C,$B4,Oversigt!$D:$D,AC$3)+SUMIFS(Oversigt!$H:$H,Oversigt!$C:$C,$B4,Oversigt!$D:$D,AC$3)+SUMIFS(Oversigt!$K:$K,Oversigt!$C:$C,$B4,Oversigt!$D:$D,AC$3)+SUMIFS(Oversigt!$N:$N,Oversigt!$C:$C,$B4,Oversigt!$D:$D,AC$3)","v":0},{"$f":"SUMIFS(Oversigt!$E:$E,Oversigt!$C:$C,$B4,Oversigt!$D:$D,AD$3)+SUMIFS(Oversigt!$H:$H,Oversigt!$C:$C,$B4,Oversigt!$D:$D,AD$3)+SUMIFS(Oversigt!$K:$K,Oversigt!$C:$C,$B4,Oversigt!$D:$D,AD$3)+SUMIFS(Oversigt!$N:$N,Oversigt!$C:$C,$B4,Oversigt!$D:$D,AD$3)","v":0},{"$f":"SUMIFS(Oversigt!$E:$E,Oversigt!$C:$C,$B4,Oversigt!$D:$D,AE$3)+SUMIFS(Oversigt!$H:$H,Oversigt!$C:$C,$B4,Oversigt!$D:$D,AE$3)+SUMIFS(Oversigt!$K:$K,Oversigt!$C:$C,$B4,Oversigt!$D:$D,AE$3)+SUMIFS(Oversigt!$N:$N,Oversigt!$C:$C,$B4,Oversigt!$D:$D,AE$3)","v":11},{"$f":"SUMIFS(Oversigt!$E:$E,Oversigt!$C:$C,$B4,Oversigt!$D:$D,AF$3)+SUMIFS(Oversigt!$H:$H,Oversigt!$C:$C,$B4,Oversigt!$D:$D,AF$3)+SUMIFS(Oversigt!$K:$K,Oversigt!$C:$C,$B4,Oversigt!$D:$D,AF$3)+SUMIFS(Oversigt!$N:$N,Oversigt!$C:$C,$B4,Oversigt!$D:$D,AF$3)","v":11}]
[null,"Risikohåndtering",{"$f":"SUMIFS(Oversigt!$E:$E,Oversigt!$C:$C,$B5,Oversigt!$D:$D,C$3)","v":0},{"$f":"SUMIFS(Oversigt!$E:$E,Oversigt!$C:$C,$B5,Oversigt!$D:$D,D$3)","v":0},{"$f":"SUMIFS(Oversigt!$E:$E,Oversigt!$C:$C,$B5,Oversigt!$D:$D,E$3)","v":0},{"$f":"SUMIFS(Oversigt!$E:$E,Oversigt!$C:$C,$B5,Oversigt!$D:$D,F$3)","v":0},{"$f":"SUMIFS(Oversigt!$E:$E,Oversigt!$C:$C,$B5,Oversigt!$D:$D,G$3)","v":3},{"$f":"SUMIFS(Oversigt!$E:$E,Oversigt!$C:$C,$B5,Oversigt!$D:$D,H$3)","v":3},{"$f":"SUMIFS(Oversigt!$H:$H,Oversigt!$C:$C,$B5,Oversigt!$D:$D,I$3)","v":0},{"$f":"SUMIFS(Oversigt!$H:$H,Oversigt!$C:$C,$B5,Oversigt!$D:$D,J$3)","v":0},{"$f":"SUMIFS(Oversigt!$H:$H,Oversigt!$C:$C,$B5,Oversigt!$D:$D,K$3)","v":0},{"$f":"SUMIFS(Oversigt!$H:$H,Oversigt!$C:$C,$B5,Oversigt!$D:$D,L$3)","v":0},{"$f":"SUMIFS(Oversigt!$H:$H,Oversigt!$C:$C,$B5,Oversigt!$D:$D,M$3)","v":2},{"$f":"SUMIFS(Oversigt!$H:$H,Oversigt!$C:$C,$B5,Oversigt!$D:$D,N$3)","v":2},{"$f":"SUMIFS(Oversigt!$K:$K,Oversigt!$C:$C,$B5,Oversigt!$D:$D,O$3)","v":0},{"$f":"SUMIFS(Oversigt!$K:$K,Oversigt!$C:$C,$B5,Oversigt!$D:$D,P$3)","v":0},{"$f":"SUMIFS(Oversigt!$K:$K,Oversigt!$C:$C,$B5,Oversigt!$D:$D,Q$3)","v":0},{"$f":"SUMIFS(Oversigt!$K:$K,Oversigt!$C:$C,$B5,Oversigt!$D:$D,R$3)","v":0},{"$f":"SUMIFS(Oversigt!$K:$K,Oversigt!$C:$C,$B5,Oversigt!$D:$D,S$3)","v":3},{"$f":"SUMIFS(Oversigt!$K:$K,Oversigt!$C:$C,$B5,Oversigt!$D:$D,T$3)","v":3},{"$f":"SUMIFS(Oversigt!$N:$N,Oversigt!$C:$C,$B5,Oversigt!$D:$D,U$3)","v":0},{"$f":"SUMIFS(Oversigt!$N:$N,Oversigt!$C:$C,$B5,Oversigt!$D:$D,V$3)","v":0},{"$f":"SUMIFS(Oversigt!$N:$N,Oversigt!$C:$C,$B5,Oversigt!$D:$D,W$3)","v":0},{"$f":"SUMIFS(Oversigt!$N:$N,Oversigt!$C:$C,$B5,Oversigt!$D:$D,X$3)","v":0},{"$f":"SUMIFS(Oversigt!$N:$N,Oversigt!$C:$C,$B5,Oversigt!$D:$D,Y$3)","v":2},{"$f":"SUMIFS(Oversigt!$N:$N,Oversigt!$C:$C,$B5,Oversigt!$D:$D,Z$3)","v":2},{"$f":"SUMIFS(Oversigt!$E:$E,Oversigt!$C:$C,$B5,Oversigt!$D:$D,AA$3)+SUMIFS(Oversigt!$H:$H,Oversigt!$C:$C,$B5,Oversigt!$D:$D,AA$3)+SUMIFS(Oversigt!$K:$K,Oversigt!$C:$C,$B5,Oversigt!$D:$D,AA$3)+SUMIFS(Oversigt!$N:$N,Oversigt!$C:$C,$B5,Oversigt!$D:$D,AA$3)","v":0},{"$f":"SUMIFS(Oversigt!$E:$E,Oversigt!$C:$C,$B5,Oversigt!$D:$D,AB$3)+SUMIFS(Oversigt!$H:$H,Oversigt!$C:$C,$B5,Oversigt!$D:$D,AB$3)+SUMIFS(Oversigt!$K:$K,Oversigt!$C:$C,$B5,Oversigt!$D:$D,AB$3)+SUMIFS(Oversigt!$N:$N,Oversigt!$C:$C,$B5,Oversigt!$D:$D,AB$3)","v":0},{"$f":"SUMIFS(Oversigt!$E:$E,Oversigt!$C:$C,$B5,Oversigt!$D:$D,AC$3)+SUMIFS(Oversigt!$H:$H,Oversigt!$C:$C,$B5,Oversigt!$D:$D,AC$3)+SUMIFS(Oversigt!$K:$K,Oversigt!$C:$C,$B5,Oversigt!$D:$D,AC$3)+SUMIFS(Oversigt!$N:$N,Oversigt!$C:$C,$B5,Oversigt!$D:$D,AC$3)","v":0},{"$f":"SUMIFS(Oversigt!$E:$E,Oversigt!$C:$C,$B5,Oversigt!$D:$D,AD$3)+SUMIFS(Oversigt!$H:$H,Oversigt!$C:$C,$B5,Oversigt!$D:$D,AD$3)+SUMIFS(Oversigt!$K:$K,Oversigt!$C:$C,$B5,Oversigt!$D:$D,AD$3)+SUMIFS(Oversigt!$N:$N,Oversigt!$C:$C,$B5,Oversigt!$D:$D,AD$3)","v":0},{"$f":"SUMIFS(Oversigt!$E:$E,Oversigt!$C:$C,$B5,Oversigt!$D:$D,AE$3)+SUMIFS(Oversigt!$H:$H,Oversigt!$C:$C,$B5,Oversigt!$D:$D,AE$3)+SUMIFS(Oversigt!$K:$K,Oversigt!$C:$C,$B5,Oversigt!$D:$D,AE$3)+SUMIFS(Oversigt!$N:$N,Oversigt!$C:$C,$B5,Oversigt!$D:$D,AE$3)","v":10},{"$f":"SUMIFS(Oversigt!$E:$E,Oversigt!$C:$C,$B5,Oversigt!$D:$D,AF$3)+SUMIFS(Oversigt!$H:$H,Oversigt!$C:$C,$B5,Oversigt!$D:$D,AF$3)+SUMIFS(Oversigt!$K:$K,Oversigt!$C:$C,$B5,Oversigt!$D:$D,AF$3)+SUMIFS(Oversigt!$N:$N,Oversigt!$C:$C,$B5,Oversigt!$D:$D,AF$3)","v":10}]
[null,"ISMS",{"$f":"SUMIFS(Oversigt!$E:$E,Oversigt!$C:$C,$B6,Oversigt!$D:$D,C$3)","v":0},{"$f":"SUMIFS(Oversigt!$E:$E,Oversigt!$C:$C,$B6,Oversigt!$D:$D,D$3)","v":0},{"$f":"SUMIFS(Oversigt!$E:$E,Oversigt!$C:$C,$B6,Oversigt!$D:$D,E$3)","v":0},{"$f":"SUMIFS(Oversigt!$E:$E,Oversigt!$C:$C,$B6,Oversigt!$D:$D,F$3)","v":0},{"$f":"SUMIFS(Oversigt!$E:$E,Oversigt!$C:$C,$B6,Oversigt!$D:$D,G$3)","v":4},{"$f":"SUMIFS(Oversigt!$E:$E,Oversigt!$C:$C,$B6,Oversigt!$D:$D,H$3)","v":4},{"$f":"SUMIFS(Oversigt!$H:$H,Oversigt!$C:$C,$B6,Oversigt!$D:$D,I$3)","v":0},{"$f":"SUMIFS(Oversigt!$H:$H,Oversigt!$C:$C,$B6,Oversigt!$D:$D,J$3)","v":0},{"$f":"SUMIFS(Oversigt!$H:$H,Oversigt!$C:$C,$B6,Oversigt!$D:$D,K$3)","v":0},{"$f":"SUMIFS(Oversigt!$H:$H,Oversigt!$C:$C,$B6,Oversigt!$D:$D,L$3)","v":0},{"$f":"SUMIFS(Oversigt!$H:$H,Oversigt!$C:$C,$B6,Oversigt!$D:$D,M$3)","v":7},{"$f":"SUMIFS(Oversigt!$H:$H,Oversigt!$C:$C,$B6,Oversigt!$D:$D,N$3)","v":7},{"$f":"SUMIFS(Oversigt!$K:$K,Oversigt!$C:$C,$B6,Oversigt!$D:$D,O$3)","v":0},{"$f":"SUMIFS(Oversigt!$K:$K,Oversigt!$C:$C,$B6,Oversigt!$D:$D,P$3)","v":0},{"$f":"SUMIFS(Oversigt!$K:$K,Oversigt!$C:$C,$B6,Oversigt!$D:$D,Q$3)","v":0},{"$f":"SUMIFS(Oversigt!$K:$K,Oversigt!$C:$C,$B6,Oversigt!$D:$D,R$3)","v":0},{"$f":"SUMIFS(Oversigt!$K:$K,Oversigt!$C:$C,$B6,Oversigt!$D:$D,S$3)","v":3},{"$f":"SUMIFS(Oversigt!$K:$K,Oversigt!$C:$C,$B6,Oversigt!$D:$D,T$3)","v":3},{"$f":"SUMIFS(Oversigt!$N:$N,Oversigt!$C:$C,$B6,Oversigt!$D:$D,U$3)","v":0},{"$f":"SUMIFS(Oversigt!$N:$N,Oversigt!$C:$C,$B6,Oversigt!$D:$D,V$3)","v":0},{"$f":"SUMIFS(Oversigt!$N:$N,Oversigt!$C:$C,$B6,Oversigt!$D:$D,W$3)","v":0},{"$f":"SUMIFS(Oversigt!$N:$N,Oversigt!$C:$C,$B6,Oversigt!$D:$D,X$3)","v":0},{"$f":"SUMIFS(Oversigt!$N:$N,Oversigt!$C:$C,$B6,Oversigt!$D:$D,Y$3)","v":1},{"$f":"SUMIFS(Oversigt!$N:$N,Oversigt!$C:$C,$B6,Oversigt!$D:$D,Z$3)","v":1},{"$f":"SUMIFS(Oversigt!$E:$E,Oversigt!$C:$C,$B6,Oversigt!$D:$D,AA$3)+SUMIFS(Oversigt!$H:$H,Oversigt!$C:$C,$B6,Oversigt!$D:$D,AA$3)+SUMIFS(Oversigt!$K:$K,Oversigt!$C:$C,$B6,Oversigt!$D:$D,AA$3)+SUMIFS(Oversigt!$N:$N,Oversigt!$C:$C,$B6,Oversigt!$D:$D,AA$3)","v":0},{"$f":"SUMIFS(Oversigt!$E:$E,Oversigt!$C:$C,$B6,Oversigt!$D:$D,AB$3)+SUMIFS(Oversigt!$H:$H,Oversigt!$C:$C,$B6,Oversigt!$D:$D,AB$3)+SUMIFS(Oversigt!$K:$K,Oversigt!$C:$C,$B6,Oversigt!$D:$D,AB$3)+SUMIFS(Oversigt!$N:$N,Oversigt!$C:$C,$B6,Oversigt!$D:$D,AB$3)","v":0},{"$f":"SUMIFS(Oversigt!$E:$E,Oversigt!$C:$C,$B6,Oversigt!$D:$D,AC$3)+SUMIFS(Oversigt!$H:$H,Oversigt!$C:$C,$B6,Oversigt!$D:$D,AC$3)+SUMIFS(Oversigt!$K:$K,Oversigt!$C:$C,$B6,Oversigt!$D:$D,AC$3)+SUMIFS(Oversigt!$N:$N,Oversigt!$C:$C,$B6,Oversigt!$D:$D,AC$3)","v":0},{"$f":"SUMIFS(Oversigt!$E:$E,Oversigt!$C:$C,$B6,Oversigt!$D:$D,AD$3)+SUMIFS(Oversigt!$H:$H,Oversigt!$C:$C,$B6,Oversigt!$D:$D,AD$3)+SUMIFS(Oversigt!$K:$K,Oversigt!$C:$C,$B6,Oversigt!$D:$D,AD$3)+SUMIFS(Oversigt!$N:$N,Oversigt!$C:$C,$B6,Oversigt!$D:$D,AD$3)","v":0},{"$f":"SUMIFS(Oversigt!$E:$E,Oversigt!$C:$C,$B6,Oversigt!$D:$D,AE$3)+SUMIFS(Oversigt!$H:$H,Oversigt!$C:$C,$B6,Oversigt!$D:$D,AE$3)+SUMIFS(Oversigt!$K:$K,Oversigt!$C:$C,$B6,Oversigt!$D:$D,AE$3)+SUMIFS(Oversigt!$N:$N,Oversigt!$C:$C,$B6,Oversigt!$D:$D,AE$3)","v":15},{"$f":"SUMIFS(Oversigt!$E:$E,Oversigt!$C:$C,$B6,Oversigt!$D:$D,AF$3)+SUMIFS(Oversigt!$H:$H,Oversigt!$C:$C,$B6,Oversigt!$D:$D,AF$3)+SUMIFS(Oversigt!$K:$K,Oversigt!$C:$C,$B6,Oversigt!$D:$D,AF$3)+SUMIFS(Oversigt!$N:$N,Oversigt!$C:$C,$B6,Oversigt!$D:$D,AF$3)","v":15}]
{"$rows_left_out":32}
{"sheet":"Vejledning","index":2,"n_rows":61,"n_cols":5,"rows_kept":61,"cut":false,"hidden":false,"merged":[[60,1,77,3],[0,0,0,2],[0,4,1,5],[3,1,14,3],[17,1,46,3],[49,1,57,3]]}
["Vejledning",null,null,null,"Gå til Oversigt"]
[]
[null,"Baggrund"]
[null,"Værktøjet er udviklet til at understøtte arbejdet med implementering af ISO27001 og kan bruges til en selvevaluering af, hvor langt organisationen er i denne proces. \n\nSelvevalueringsværktøjet er baseret på ISO27001, hvis formål er at bidrage med konkrete krav til at etablere, implementere, vedligeholde og forbedre et informationssikkerhedssystem i organisationer. Værktøjet er designet som en hjælp til at holde styr på de forskellige krav fra standarden, samt den implementeringsgrad den pågældende organisation har. \n\nVærktøjet kan benyttes som et levende dokument til løbende forbedring af det interne overblik og forståelsen for organisationens sikkerhedsniveau. Ydermere vil det være en stor hjælp til et ellers tidskrævende og omfattende dokumentationsarbejde ved besøg fra Rigsrevisionen eller It-tilsynet.\n\nVærktøjet er udviklet til de fagpersoner, som står for informationssikkerhedsarbejdet i organisationen. I standarden og dermed også i dette værktøj er der defineret flere roller i arbejdet, som i nogle organisationer udføres af færre personer end beskrevet. Det vigtigste er, at der i organisationen er udpeget en ansvarlig og en udførende for arbejdet."]
[]
[]
{"$rows_left_out":56}
{"sheet":"Opfølgning","index":3,"n_rows":1,"n_cols":5,"rows_kept":1,"cut":false,"hidden":false,"merged":[]}
["Titel","Tekst","Hvad","Hvem","Hvornår"]

{"sheet":"Risikovurdering","index":4,"n_rows":30,"n_cols":12,"rows_kept":30,"cut":false,"hidden":false,"merged":[[29,1,41,11],[24,1,24,11],[25,1,25,2],[27,1,27,2],[25,3,25,11],[26,1,26,2],[0,0,0,2],[18,1,18,11],[19,2,19,3],[20,1,20,11],[23,1,23,11],[3,1,3,8],[4,1,4,11],[6,1,7,1],[6,2,7,2],[5,1,5,4],[8,1,8,11],[14,1,14,11],[9,1,13,1],[9,2,13,3],[15,1,17,1],[15,2,17,3]]}
[{"$f":"MID(CELL(\"filename\",B3),FIND(\"]\",CELL(\"filename\",B3),1)+1,100)","v":"Risikovurdering"},null,null,null,null,null,null,null,null,null,null,"Gå til Oversigt"]
[]
[null,null,null,null,null,null,null,null,null,null,"Udarbejdet den - og af","Godkendt den-  og af"]
[]
[]
[null,null,null,null,null,"Ja","Delvist","Nej","Ikke relevant","Noter - bemærkninger","Dokumentation","Opfølgning"]
{"$rows_left_out":25}
{"sheet":"Risikohåndtering","index":5,"n_rows":29,"n_cols":12,"rows_kept":29,"cut":false,"hidden":false,"merged":[[28,1,40,11],[24,1,24,2],[10,2,11,3],[10,1,11,1],[13,2,15,3],[13,1,15,1],[17,1,18,1],[24,3,24,11],[25,1,25,2],[12,1,12,11],[26,1,26,2],[23,1,23,11],[22,1,22,11],[19,1,19,11],[16,1,16,11],[17,2,18,3],[0,0,0,2],[3,1,3,8],[4,1,4,11],[5,1,5,4],[9,1,9,11],[6,2,8,3],[6,1,8,1]]}
[{"$f":"MID(CELL(\"filename\",B3),FIND(\"]\",CELL(\"filename\",B3),1)+1,100)","v":"Risikohåndtering"},null,null,null,null,null,null,null,null,null,null,"Gå til Oversigt"]
[]
[null,null,null,null,null,null,null,null,null,null,"Udarbejdet den - og af","Godkendt den-  og af"]
[]
[]
[null,null,null,null,null,"Ja","Delvist","Nej","Ikke relevant","Noter - bemærkninger","Dokumentation","Opfølgning"]
{"$rows_left_out":24}
{"sheet":"ISMS","index":6,"n_rows":37,"n_cols":12,"rows_kept":37,"cut":false,"hidden":false,"merged":[[30,1,30,2],[29,1,29,3],[36,1,48,11],[23,2,23,3],[22,1,22,11],[28,1,28,11],[29,4,29,6],[29,7,29,9],[32,3,34,3],[31,1,31,2],[32,1,32,2],[33,1,33,2],[34,1,34,2],[10,1,10,11],[11,1,17,1],[11,2,12,2],[13,2,14,3],[15,2,17,3],[18,1,18,11],[19,1,21,1],[19,2,19,3],[21,2,21,3],[24,1,24,11],[20,2,20,3],[0,0,0,2],[3,1,3,8],[4,1,4,11],[5,1,5,4],[6,1,9,1],[7,2,7,3],[8,2,8,3],[6,2,6,3],[9,2,9,3]]}
[{"$f":"MID(CELL(\"filename\",B3),FIND(\"]\",CELL(\"filename\",B3),1)+1,100)","v":"ISMS"},null,null,null,null,null,null,null,null,null,null,"Gå til Oversigt"]
[]
[null,null,null,null,null,null,null,null,null,null,"Udarbejdet den - og af","Godkendt den-  og af"]
[]
[]
[null,null,null,null,null,"Ja","Delvist","Nej","Ikke relevant","Noter - bemærkninger","Dokumentation","Opfølgning"]
{"$rows_left_out":32}
{"sheet":"Ledelsesforankring","index":7,"n_rows":28,"n_cols":12,"rows_kept":28,"cut":false,"hidden":false,"merged":[[27,1,39,11],[25,1,25,2],[12,1,12,11],[13,1,15,1],[16,1,16,11],[13,2,15,3],[19,1,19,11],[22,1,22,11],[23,1,23,11],[24,1,24,2],[24,3,24,11],[25,3,25,4],[17,2,18,3],[17,1,18,1],[8,1,11,1],[8,2,10,2],[8,3,10,3],[11,2,11,3],[0,0,0,2],[3,1,3,8],[4,1,4,11],[5,1,5,4],[7,1,7,11]]}
[{"$f":"MID(CELL(\"filename\",B3),FIND(\"]\",CELL(\"filename\",B3),1)+1,100)","v":"Ledelsesforankring"},null,null,null,null,null,null,null,null,null,null,"Gå til Oversigt"]
[]
[null,null,null,null,null,null,null,null,null,null,"Udarbejdet den - og af","Godkendt den-  og af"]
[]
[]
[null,null,null,null,null,"Ja","Delvist","Nej","Ikke relevant","Noter - bemærkninger","Dokumentation","Opfølgning"]
{"$rows_left_out":23}
{"sheet":"Politik","index":8,"n_rows":45,"n_cols":12,"rows_kept":45,"cut":false,"hidden":false,"merged":[[43,1,43,2],[43,3,43,11],[44,1,44,2],[44,3,44,11],[14,1,15,1],[22,1,22,11],[42,1,42,11],[16,1,16,11],[17,1,18,1],[19,1,19,11],[23,4,23,6],[23,7,23,9],[14,2,14,3],[23,1,23,3],[15,2,15,3],[17,2,17,3],[18,2,18,3],[24,1,24,3],[25,1,25,3],[27,1,39,11],[13,1,13,11],[0,0,0,2],[3,1,3,8],[4,1,4,11],[5,1,5,4],[6,1,8,1],[9,1,9,11],[10,1,12,1],[6,2,6,3],[7,2,8,3],[10,2,12,3]]}
[{"$f":"MID(CELL(\"filename\",B3),FIND(\"]\",CELL(\"filename\",B3),1)+1,100)","v":"Politik"},null,null,null,null,null,null,null,null,null,null,"Gå til Oversigt"]
[]
[null,null,null,null,null,null,null,null,null,null,"Udarbejdet den - og af","Godkendt den-  og af"]
[]
[]
[null,null,null,null,null,"Ja","Delvist","Nej","Ikke relevant","Noter - bemærkninger","Dokumentation","Opfølgning"]
{"$rows_left_out":40}
{"sheet":"Leverandørstyring","index":9,"n_rows":45,"n_cols":12,"rows_kept":45,"cut":false,"hidden":false,"merged":[[33,2,33,3],[33,1,34,1],[6,2,6,3],[6,1,14,1],[21,2,21,3],[16,2,16,3],[16,1,23,1],[17,2,17,3],[13,2,13,3],[30,2,30,3],[25,2,25,3],[25,1,31,1],[19,2,19,3],[20,2,20,3],[22,2,22,3],[23,2,23,3],[44,1,56,11],[32,1,32,11],[34,2,34,3],[35,1,35,11],[24,1,24,11],[26,2,26,3],[27,2,27,3],[28,2,28,3],[29,2,29,3],[31,2,31,3],[39,1,39,11],[40,1,40,11],[41,1,41,2],[41,3,41,11],[42,1,42,2],[42,3,42,4],[0,0,0,2],[3,1,3,8],[4,1,4,11],[5,1,5,4],[8,2,8,3],[7,2,7,3],[15,1,15,11],[18,2,18,3],[9,2,9,3],[10,2,10,3],[11,2,11,3],[12,2,12,3],[14,2,14,3]]}
[{"$f":"MID(CELL(\"filename\",B3),FIND(\"]\",CELL(\"filename\",B3),1)+1,100)","v":"Leverandørstyring"},null,null,null,null,null,null,null,null,null,null,"Gå til Oversigt"]
[]
[null,null,null,null,null,null,null,null,null,null,"Udarbejdet den - og af","Godkendt den-  og af"]
[]
[]
[null,null,null,null,null,"Ja","Delvist","Nej","Ikke relevant","Noter - bemærkninger","Dokumentation","Opfølgning"]
{"$rows_left_out":40}
{"sheet":"It-beredskab","index":10,"n_rows":38,"n_cols":12,"rows_kept":38,"cut":false,"hidden":false,"merged":[[37,1,49,11],[31,7,31,9],[32,1,32,3],[22,1,22,11],[25,1,25,11],[30,1,30,11],[23,1,24,1],[33,1,33,3],[34,1,34,3],[35,1,35,3],[23,2,24,3],[31,1,31,3],[31,4,31,6],[0,0,0,2],[3,1,3,8],[4,1,4,11],[5,1,5,4],[6,1,13,1],[6,2,13,3],[14,1,14,11],[15,1,18,1],[15,2,18,3],[19,1,19,11],[20,1,21,1],[20,2,21,3]]}
[{"$f":"MID(CELL(\"filename\",B3),FIND(\"]\",CELL(\"filename\",B3),1)+1,100)","v":"It-beredskab"},null,null,null,null,null,null,null,null,null,null,"Gå til Oversigt"]
[]
[null,null,null,null,null,null,null,null,null,null,"Udarbejdet den - og af","Godkendt den-  og af"]
[]
[]
[null,null,null,null,null,"Ja","Delvist","Nej","Ikke relevant","Noter - bemærkninger","Dokumentation","Opfølgning"]
{"$rows_left_out":33}
{"sheet":"Måling","index":11,"n_rows":24,"n_cols":12,"rows_kept":24,"cut":false,"hidden":false,"merged":[[23,1,35,11],[21,1,21,2],[10,2,11,3],[20,1,20,2],[12,1,12,11],[14,1,14,11],[17,1,17,11],[18,1,18,11],[19,1,19,2],[19,3,19,11],[13,2,13,3],[7,1,7,11],[9,1,9,11],[10,1,11,1],[8,2,8,3],[0,0,0,2],[3,1,3,8],[4,1,4,11],[5,1,5,4],[6,2,6,3]]}
[{"$f":"MID(CELL(\"filename\",B3),FIND(\"]\",CELL(\"filename\",B3),1)+1,100)","v":"Måling"},null,null,null,null,null,null,null,null,null,null,"Gå til Oversigt"]
[]
[null,null,null,null,null,null,null,null,null,null,"Udarbejdet den - og af","Godkendt den-  og af"]
[]
[]
[null,null,null,null,null,"Ja","Delvist","Nej","Ikke relevant","Noter - bemærkninger","Dokumentation","Opfølgning"]
{"$rows_left_out":19}
{"sheet":"Intern opfølgning","index":12,"n_rows":29,"n_cols":12,"rows_kept":29,"cut":false,"hidden":false,"merged":[[28,1,40,11],[18,1,18,11],[11,1,11,11],[8,1,10,1],[8,2,10,3],[14,1,14,11],[15,1,17,1],[15,2,17,3],[12,2,13,3],[12,1,13,1],[0,0,0,2],[3,1,3,8],[4,1,4,11],[25,1,25,2],[26,1,26,2],[21,1,21,11],[22,1,22,11],[23,1,23,2],[23,3,23,11],[24,1,24,2],[5,1,5,4],[7,1,7,11],[6,2,6,3]]}
[{"$f":"MID(CELL(\"filename\",B3),FIND(\"]\",CELL(\"filename\",B3),1)+1,100)","v":"Intern opfølgning"},null,null,null,null,null,null,null,null,null,null,"Gå til Oversigt"]
[]
[null,null,null,null,null,null,null,null,null,null,"Udarbejdet den - og af","Godkendt den-  og af"]
[]
[]
[null,null,null,null,null,"Ja","Delvist","Nej","Ikke relevant","Noter - bemærkninger","Dokumentation","Opfølgning"]
{"$rows_left_out":23}