{"text_format":"1","workbook":"xlsx","n_sheets":12,"sheets":["Forside","Vejledning","Dataindtastning","Datagrundlag","Anbefalede visninger","Yderligere visninger","Heatmap","Data til anb. visninger","Data til yd. visninger","Redigerbart ark","Variabler","Blankt spørgeskema"],"not_rendered":{"charts":20,"images":26,"macros":1,"external_links":0,"defined_names":243,"comments":0,"pivot_tables":0},"unopened":[],"bounds":{"document_bytes":16777216,"sheet_cells":100000,"rows_first":2000,"rows_last":500,"rows_between":2000,"halvings":0,"cell_chars":16384,"cell_head_chars":4096},"cells_cut":0,"cells_raw":0,"read":"whole","date_system":"1900"}

{"sheet":"Forside","index":0,"n_rows":29,"n_cols":13,"rows_kept":29,"cut":false,"hidden":false,"merged":[[30,12,30,13],[5,12,5,16],[6,12,6,16],[13,12,13,13],[16,12,16,13],[28,12,28,13],[22,12,22,13],[19,12,19,13],[25,12,25,13],[9,12,9,16]]}
[]
[]
[null,null,null,null,null,null,null,null,null,null,null,null,"Introduktion til datagrundlaget"]
[]
[null,null,null,null,null,null,null,null,null,null,null,null,"Versionskontrol af datagrundlaget:"]
[null,null,null,null,null,null,null,null,null,null,null,null,"For at sikre, at datagrundlaget er i den senest offentliggjorte version, anbefales det, at der gennemføres et versionstjek, inden værktøjet tages i brug."]
[null,null,null,null,null,null,null,null,null,null,null,null,"Du bruger en gammel version [ITD-3.1.2019.06.05.004]; Hent den nyeste version [ITD-3.0.2019.22.03.003] på www.digst.dk.\r\nTjekket den: 06.05.2019"]
[]
[null,null,null,null,null,null,null,null,null,null,null,null,"Generelt om datagrundlaget:"]
[null,null,null,null,null,null,null,null,null,null,null,null,"\nDatagrundlaget er udviklet til at danne de anbefalede visninger til myndighedens it-handlingsplan på baggrund af myndighedens kortlægning af sin it-systemportefølje. Datagrundlaget fungerer som et værktøj, hvori myndigheden kan indtaste data direkte, og ligeledes som et konsolideringsværktøj, der kan importere data fra det valgfrie værktøj til kortlægning af it-systemporteføljen.\n \n\nDet anbefales, at 'Vejledning til model for porteføljestyring af statslige it-systemer' læses, inden dette værktøj tages i brug."]
[null,null,null,null,null,null,null,null,null,null,null,null,"Datagrundlagets ark:"]
[]
[null,null,null,null,null,null,null,null,null,null,null,null,"Dataindtastning"]
[null,null,null,null,null,null,null,null,null,null,null,null,"I dette ark kan myndigheden indtaste data direkte, importere data fra et eller flere værktøjer til kortlægning af it-systemporteføljen og validere indtastede data, inden disse overføres til arket 'Datagrundlag'."]
[]
[null,null,null,null,null,null,null,null,null,null,null,null,"Datagrundlag"]
[null,null,null,null,null,null,null,null,null,null,null,null,"Arket 'Datagrundlag' indeholder de data, som it-handlingsplanens anbefalede og yderligere visninger beregnes på baggrund af. Myndigheden kan ikke redigere data direkte i dette ark, idet disse skal valideres og overføres fra arket 'Dataindtastning'."]
[]
[null,null,null,null,null,null,null,null,null,null,null,null,"Anbefalede visninger og yderligere visninger"]
[null,null,null,null,null,null,null,null,null,null,null,null,"Disse ark indeholder de anbefalede visninger, som myndigheden bør inkludere i sin it-handlingsplan, og de yderligere visninger, som er valgfrie for myndigheden at anvende i it-handlingsplanen."]
[]
[null,null,null,null,null,null,null,null,null,null,null,null,"Heatmap"]
[null,null,null,null,null,null,null,null,null,null,null,null,"Dette ark indeholder et heatmap, som myndigheden kan benytte til at danne overblik over, hvor der er flest udfordringer. Heatmappet kan anvendes i forbindelse med udarbejdelsen af it-handlingsplanen, men det er ikke et krav, at den indgår i handlingsplanen."]
[]
[null,null,null,null,null,null,null,null,null,null,null,null,"Data til de anbefalede visninger og data til de yderligere visninger"]
[null,null,null,null,null,null,null,null,null,null,null,null,"Disse ark indeholder beregningerne for it-handlingsplanens anbefalede og yderligere visninger. Myndigheden kan ikke redigere beregningerne i disse ark."]
[]
[null,null,null,null,null,null,null,null,null,null,null,null,"Redigerbart ark"]
[null,null,null,null,null,null,null,null,null,null,null,null,"Myndigheden kan anvende dette ark til egne beregninger på baggrund af dataene i denne fil. Arket er selvstændigt og påvirker derfor ikke de andre ark eller beregninger i denne fil."]

{"sheet":"Vejledning","index":1,"n_rows":118,"n_cols":4,"rows_kept":118,"cut":false,"hidden":false,"merged":[[4,1,4,4],[67,2,67,3],[44,2,44,3],[43,2,43,3],[40,2,40,3],[39,2,39,3],[41,2,41,3],[42,2,42,3],[57,2,57,3],[59,2,59,3],[61,2,61,3],[63,2,63,3],[65,2,65,3],[97,2,97,3],[98,2,98,3],[99,2,99,3],[101,2,101,3],[92,2,92,3],[93,2,93,3],[94,2,94,3],[95,2,95,3],[96,2,96,3]]}
[]
[null,"Vejledning til datagrundlaget"]
[]
[]
[null," Vejledning til datagrundlaget"]
[null,"  Flowchart"]
[]
[]
[]
[]
[]
[]
[]
[]
[]
[]
[]
[]
[]
[]
[]
[]
[]
[]
[]
[]
[]
[]
[]
[null,null,"                                                                                    Dataindtastning","                                                                             Videre behandling"]
[]
[]
[null,null,"(1) Der kan vælges mellem 4 forskellige metoder for dataimportering."]
[null,null,"          (2A) Data kan importeres fra kortlægningsværktøjet. "]
[null,null,"          (2B) Data kan importeres fra spørgeskema(er) genereret via enten kortlægningværktøjet eller datagrundlaget."]
[null,null,"          (2C) Data kan indtastes direkte i arket. Dette gøres under \"Tilføj nyt it-system\"."]
[null,null,"          (2D) Data kan kopieres og indsættes fra eget oversigtsark."]
[null,null,"(3) Data skal valideres, før det kan overføres til datagrundlaget."]
[null,null,"         (4A) Efter at have benyttet valideringsfunktionen, vil eventuelle fejl fremhæves. "]
[null,null,"         (4B) I tilfælde af fejl eller mangler, skal de fremhævede felter genbesøges. "]
[null,null,"(5) Komplet data overføres til datagrundlag"]
[null,null,"         (5B) Hvis det ønskes, kan det validerede data eksporteres til et nyt excel ark. "]
[null,null,"         (5C) Hvis det ønskes, kan spørgeskemaer gendannes ud fra datagrundlaget. "]
[null,null,"(6) Ud fra datagrundlaget genereres en række figurer. Disse kan ses under \"Anbefalede visninger\" og \"Yderligere visninger\"."]
[null,null,"(7) Figurerne overføres til et samlet Word-dokument, hvorfra de kan kopieres til it-handlingsplanen."]
[]
[]
[null,"  Dataindtastning"]
[]
[null,null,"I dette ark indtaster myndigheden oplysninger om sine it-systemer med afsæt i spørgsmålene beskrevet i 'Vejledning til model for porteføljestyring af statslige it-systemer'. Det er også muligt at importere data fra et eller flere kortlægningsværktøjer, eller at kopiere data ind fra evt. egne oversigtsark hos myndigheden."]
[]
[null,null,"Når myndigheden har angivet oplysninger om alle de it-systemer, der er omfattet af kortlægningen, kan data overføres til arket 'Datagrundlag'."]
[]
[null,null,"Spørgsmål og svarmuligheder:\nI øverste tabel fremgår de svarmuligheder, som myndigheden skal anvende ved besvarelse af spørgsmål vedrørende it-systemerne. Hvis en lyseblå celle med spørgsmål vælges af brugeren, vil der blive vist en yderligere hjælpetekst til korrekt besvarelse af det pågældende spørgsmål. Har spørgsmålet præ-definerede svarmuligheder, fremgår disse i de mørkegrå linjer direkte under spørgsmålsteksten."]
[]
[null,null,"Følgende funktioner findes i arket 'Dataindtastning':\n\n(2A) Import af data fra kortlægningsværktøj:\nHer kan myndigheden importere data fra et eller flere udfyldte kortlægningsværktøjer. Der kan kun importeres data fra kortlægningsværktøjet og ikke andre filtyper eller formater."]
[]
[null,null,"(2B) Importer data fra spørgeskema(er):\nHer kan myndigheden importere data til it-systemoversigten via et eller flere spørgeskemaer, som er genereret i enten kortlægningsværktøjet eller datagrundlaget. I tilfælde af at det pågældende system allerede eksisterer i it-systemoversigten, vil systemet ikke blive oprettet som nyt, men dets data vil i stedet blive opdateret. "]
[]
[null,null,"(2C) Indtast nyt it-system:\nHer kan myndigheden indtaste data for et enkelt it-system, for herefter at overføre data via \"Tilføj enkelt it-system\" knappen. Rækken indeholder enten frie tekstfelter eller drop-down menuer til spørgsmål, hvor der er præ-definerede svarmuligheder. "]
[]
[null,null,"(2D) It-systemoversigt:\nHer indsættes automatisk data fra værktøjerne til kortlægning af it-systemporteføljen, samt tilføjelser fra \"Tilføj enkelt it-system\". Myndigheden kan også frit udfylde disse felter med afsæt i spørgsmålene, eller kopiere data ind fra evt. eget oversigtsark."]
[]
[null,null,"(3) Validering:\nHer kan myndigheden sikre validiteten af de indtastede data. Fejlagtigt udfyldte celler vil blive markeret med gult, tomme celler, som bør udfyldes, bliver markeret brunt, og it-systemdubletter bliver markeret lyserødt. "]
[]
[null,null,"(4) Information: \nHer kan myndigheden se resultatet af den sidst gennemførte validering."]
[]
[null,null,"(5) Overfør data til arket 'Datagrundlag':\nHer kan myndigheden overføre data til datagrundlaget, hvorefter disse vil indgå i de anbefalede og yderligere visninger. Det vil ikke være muligt at overføre data til datagrundlaget, som indeholder fejlagtigt udfyldte celler. Brugeren vil blive gjort opmærksom på, hvis data indeholder tomme celler. \n"]
[]
[null,"  Datagrundlag"]
[]
[null,null,"Dette ark danner udgangspunkt for it-handlingsplanens anbefalede og yderligere visninger, samt heatmap. Alle data i dette ark er blevet valideret og er overført fra 'Dataindtastning'. Myndigheden kan således ikke redigere data direkte i dette ark."]
[]
[null,null,"(5B) Det er muligt for myndigheden at eksportere datagrundlaget til en ny separat Excel fil. "]
[null,null,"Det eksporterede data kan benyttes til at konstruere egne visninger, i tilfælde af at de anbefalede visninger og yderligere visninger ikke er fyldestgørende. "]
[]
[null,null,"(5C) Det er muligt for myndigheden at eksportere systemerne i datagrundlaget til nye spørgeskemaer. \nDet er muligt at vælge placering. Filnavnet vil afhænge af systemnavn. \nDe eksporterede spørgeskemaer vil indeholde alle data i datagrundlaget for de pågældende it-systemer."]
[]
[null,"  Anbefalede visninger og Yderligere visninger"]
[]
[null,null,"Arkene indeholder de anbefalede og yderligere visninger til myndighedens it-handlingsplan. Myndigheden bør som minimum kopiere de anbefalede visninger til it-handlingsplanen.\n\nFor at kopiere visningerne til it-handlingsplanen, er der to mulige løsninger: "]
[]
[null,null,"6A) For at benytte den automatiske eksportering, tryk på knappen øverst i fanen. \nDet skal bemærkes, at denne eksporterer alle visninger - både fra anbefalede visninger og yderligere visninger. "]
[]
[null,null,"6B) For at kopiere manuelt, anbefales følgende tre trin:\n\nI) Marker visningens område med musen (se blå markering). Visningens celler fremgår desuden under visningens overskrift.\nII) Kopier dette område ved at trykke CTRL + C på dit tastatur.\nIII) Vælg det sted i it-handlingsplansdokumentet, hvor visningen skal fremgå, og tryk \nCTRL + ALT + V på tastaturet. Vælg herefter filtypen 'Enhanced metafile' for at sikre den bedste opløsning."]
[]
[null,null,"Efter overførsel af data, skal myndigheden selv indstille det passende zoomniveau, for at sikre en korrekt gengivelse af graferne."]
[]
[null,"  Heatmap"]
[]
[null,null,"Arket indeholder et heatmap, som kan anvendes til at danne sig et overblik over, hvor der er flest udfordringer. Dette kan enten gøres ud fra hvilke systemer, der har flest udfordringer og/eller ud fra hvilke emner, der er flest udfordringer med. \n\nHeatmappet kan anvendes i forbindelse med udarbejdelsen af it-handlingsplanen, men det er ikke et krav, at den indgår i handlingsplanen."]
[null,null,"Der fremgår i heatmappet kun 19 udvalgte spørgsmål, da svarene i disse er blevet vurderet til at kunne sorteres fra værst til bedst (for nogle dog svarende til sortering fra mest til mindst kritisk). Heatmappet repræsenterer derfor ikke et komplet overblik og skal derfor kun anvendes som et supplement til de resterende visninger.\n\n2 ud af de 19 spørgsmål er kollektive repræsentationer af input fra de op til fem leverandørkontrakter. \n\nDet bemærkes, at \"Planlægning af udbud sammenholdt med udløb af kontrakter (Værste kontrakt)\" har otte udfaldsmuligheder:"]
[null,null,"- Tidligere udløbet kontrakt - genudbud ikke planlagt"]
[null,null,"- Ukendt(e) kontraktudløbsdato(er) - genudbud ikke planlagt"]
[null,null,"- Ukendt(e) kontraktudløbsdato(er) - genudbud planlagt"]
[null,null,"- Genudbud planlagt - transition(er) forventes ikke gennemført inden kontraktens/kontrakternes udløb"]
[null,null,"- Kendt(e) kontraktudløbsdato(er) - genudbud ikke planlagt"]
[null,null,"- Ingen kontraktudløb - genudbud ikke planlagt"]
[null,null,"- Genudbud planlagt - ingen dato for udløb af nuværende kontrakt(er)"]
[null,null,"- Genudbud planlagt - transition(er) forventes gennemført inden kontraktens/kontrakternes udløb"]
[]
[null,null,"Rækkefølgen af hhv. spørgsmål og systemer kan sorteres efter ”Original”, som svarer til de rækkefølger, der findes i arket ”Dataindtastning”, eller efter ”Værst til bedst”, som giver sortering efter de konkrete besvarelser af spørgsmålene for de enkelte systemer."]
[]
[null,"  Data til de anbefalede visninger og data til de yderligere visninger"]
[]
[null,null,"Disse ark viser de beregninger, som ligger til grund for de anbefalede og yderligere visninger. Formålet med arkene er at sikre myndigheden indsigt i de bagvedliggende beregninger. Myndigheden kan ikke redigere beregningerne i disse ark."]
[]
[]
[]
[]
[]
[]
[]
[]
[]
[null,"  Redigerbart ark"]
[]
[null,null,"Myndigheden kan anvende dette ark til at udarbejde egne supplerende beregninger og visninger på baggrund af data i arket 'Datagrundlag'. Arket er selvstændigt og påvirker derfor ikke andre ark eller beregninger i denne fil."]

{"sheet":"Dataindtastning","index":2,"n_rows":25,"n_cols":171,"rows_kept":25,"cut":false,"hidden":false,"merged":[[4,4,4,7],[4,9,4,14],[4,16,4,17],[5,4,5,7],[5,9,5,10],[5,13,5,14],[5,16,5,17]]}
[null,null,null,null,null,null,null,null,null,null,null,null,null,null,null,null,null,null,null,null,null,null,null,null,null,null,null,null,null,null,null,null,null,null,null,null,null,null,null,null,null,null,null,null,null,null,null,null,null,null,null,null,null,null,null,null,null,null,null,null,null,null,null,null,null,null,null,null,null,null,null,null,null,null,null,null,null,null,null,null,null,null,null,null,null,null,null,null,{"$f":"IF(E1=\"\",\"Fejl\",\"\")","v":"Fejl"},{"$f":"IF(F1=\"\",\"Fejl\",\"\")","v":"Fejl"},{"$f":"IF(AND(ISNUMBER(G1)=TRUE,G1<>\"\"),\"\",\"Fejl\")","v":"Fejl"},{"$f":"IF(H1=\"\",\"Fejl\",\"\")","v":"Fejl"},{"$f":"IF(I1<>\"\",\"\",\"Fejl\")","v":"Fejl"},{"$f":"IF(J1=\"\",\"Fejl\",\"\")","v":"Fejl"},{"$f":"IF(K1=\"\",\"Fejl\",\"\")","v":"Fejl"},{"$f":"IF(L1=\"\",\"Fejl\",\"\")","v":"Fejl"},{"$f":"IF(OR(M1=\"\",ISERROR(MATCH(M1,M$12:M$17,0))),\"Fejl\",\"\")","v":"Fejl"},{"$f":"IF(OR(N1=\"\",ISERROR(MATCH(N1,N$12:N$17,0))),\"Fejl\",\"\")","v":"Fejl"},{"$f":"IF(OR(O1=\"\",ISERROR(MATCH(O1,O$12:O$17,0))),\"Fejl\",\"\")","v":"Fejl"},{"$f":"IF(AND(SUM(COUNTIF($N1:$O1,{\"Insourcet\",\"Statens IT\"}))=2,P1=\"\"),\"\",\nIF(AND(ISNUMBER(P1)=TRUE,P1<=5),\"\",\"Fejl\"))","v":"Fejl"},{"$f":"IF(AND(SUM(COUNTIF($N1:$O1,{\"Insourcet\",\"Statens IT\"}))=2,Q1=\"\"),\"\",\nIF(OR(\nAND(Q1<>\"\",$P1>=CW$8),\nAND(Q1=\"\",$P1<CW$8)),\"\",\"Fejl\"))","v":""},{"$f":"IF(AND(SUM(COUNTIF($N1:$O1,{\"Insourcet\",\"Statens IT\"}))=2,R1=\"\"),\"\",\nIF(OR(\nAND(R1<>\"\",$P1>=CX$8),\nAND(R1=\"\",$P1<CX$8)),\"\",\"Fejl\"))","v":""},{"$f":"IF(AND(SUM(COUNTIF($N1:$O1,{\"Insourcet\",\"Statens IT\"}))=2,S1=\"\"),\"\",\nIF(OR(\nAND(S1<>\"\",$P1>=CY$8),\nAND(S1=\"\",$P1<CY$8)),\"\",\"Fejl\"))","v":""},{"$f":"IF(AND(SUM(COUNTIF($N1:$O1,{\"Insourcet\",\"Statens IT\"}))=2,T1=\"\"),\"\",\nIF(OR(\nAND(T1<>\"\",$P1>=CZ$8),\nAND(T1=\"\",$P1<CZ$8)),\"\",\"Fejl\"))","v":""},{"$f":"IF(AND(SUM(COUNTIF($N1:$O1,{\"Insourcet\",\"Statens IT\"}))=2,U1=\"\"),\"\",\nIF(OR(\nAND(U1<>\"\",$P1>=DA$8),\nAND(U1=\"\",$P1<DA$8)),\"\",\"Fejl\"))","v":""},{"$f":"IF(ISERROR(MATCH(V1,V$12:V$17,0))=FALSE,\"\",\"Fejl\")","v":"Fejl"},{"$f":"IF(ISERROR(MATCH(W1,W$12:W$17,0))=FALSE,\"\",\"Fejl\")","v":"Fejl"},{"$f":"IF(ISNUMBER(X1)=TRUE,\"\",\"Fejl\")","v":"Fejl"},{"$f":"IF(ISERROR(MATCH(Y1,Y$12:Y$17,0))=FALSE,\"\",\"Fejl\")","v":"Fejl"},{"$f":"IF(OR(\nAND($P1>=DF$8,ISERROR(MATCH(Z1,Z$12:Z$17,0))=FALSE),\nAND($P1<DF$8,Z1=\"\")),\n\"\",\"Fejl\")","v":""},{"$f":"IF(OR(\nAND($P1>=DG$8,ISERROR(MATCH(AA1,AA$12:AA$17,0))=FALSE),\nAND($P1<DG$8,AA1=\"\")),\n\"\",\"Fejl\")","v":""},{"$f":"IF(AND($P1<DG$8,AA1=\"\"),\"\",IF(\n\nOR(AND($P1>=DH$8,AA1=\"1. Dato (Indsæt dato i næste felt)\",\n    AND(IF(ISNUMBER(VALUE(MID(AB1,1,2))),AND(VALUE(MID(AB1,1,2)) >= 1,VALUE(MID(AB1,1,2)) <= 31),FALSE),\n    IF(ISNUMBER(VALUE(MID(AB1,4,2))),AND(VALUE(MID(AB1,4,2)) >= 1,VALUE(MID(AB1,4,2)) <= 12),FALSE),\n    ISNUMBER(VALUE(MID(AB1,7,4))),\n    MID(AB1,3,1)=\".\",\n    MID(AB1,6,1)=\".\",\n    LEN(AB1)=10\n)),\nAND(OR(AA1=\"2. Ingen udløbsdato\",AA1=\"3. Ved ikke\"),AB1=\"\")),\"\",\"Fejl\"))","v":""},{"$f":"IF(OR(AND($P1>=DI$8,ISNUMBER(AC1)=TRUE,AA1=\"1. Dato (indsæt dato i næste felt)\"),\nAND(OR($P1<DG$8,AA1=\"2. Ingen udløbsdato\",AA1=\"3. Ved ikke\"),AC1=\"\")),\"\",\"Fejl\")","v":""},{"$f":"IF(OR(\nAND($P1>=DJ$8,ISERROR(MATCH(AD1,AD$12:AD$17,0))=FALSE),\nAND($P1<DJ$8,AD1=\"\")),\n\"\",\"Fejl\")","v":""},{"$f":"IF(AND($P1<DJ$8,AD1=\"\"),\"\",IF(\n\nOR(AND($P1>=DK$8,AD1=\"1. Dato (Indsæt dato i næste felt)\",\n    AND(IF(ISNUMBER(VALUE(MID(AE1,1,2))),AND(VALUE(MID(AE1,1,2)) >= 1,VALUE(MID(AE1,1,2)) <= 31),FALSE),\n    IF(ISNUMBER(VALUE(MID(AE1,4,2))),AND(VALUE(MID(AE1,4,2)) >= 1,VALUE(MID(AE1,4,2)) <= 12),FALSE),\n    ISNUMBER(VALUE(MID(AE1,7,4))),\n    MID(AE1,3,1)=\".\",\n    MID(AE1,6,1)=\".\",\n    LEN(AE1)=10\n)),\nAND(OR(AD1=\"2. Ikke planlagt\",AD1=\"3. Ved ikke\"),AE1=\"\")),\"\",\"Fejl\"))","v":""},{"$f":"IF(OR(\nAND($P1>=DL$8,ISERROR(MATCH(AF1,AF$12:AF$17,0))=FALSE),\nAND($P1<DL$8,AF1=\"\")),\n\"\",\"Fejl\")","v":""},{"$f":"IF(OR(\nAND($P1>=DM$8,ISERROR(MATCH(AG1,AG$12:AG$17,0))=FALSE),\nAND($P1<DM$8,AG1=\"\")),\n\"\",\"Fejl\")","v":""},{"$f":"IF(OR(\nAND($P1>=DN$8,ISERROR(MATCH(AH1,AH$12:AH$17,0))=FALSE),\nAND($P1<DN$8,AH1=\"\")),\n\"\",\"Fejl\")","v":""},{"$f":"IF(OR(\nAND($P1>=DO$8,ISERROR(MATCH(AI1,AI$12:AI$17,0))=FALSE),\nAND($P1<DO$8,AI1=\"\")),\n\"\",\"Fejl\")","v":""},{"$f":"IF(AND($P1<DO$8,AI1=\"\"),\"\",IF(\n\nOR(AND($P1>=DP$8,AI1=\"1. Dato (Indsæt dato i næste felt)\",\n    AND(IF(ISNUMBER(VALUE(MID(AJ1,1,2))),AND(VALUE(MID(AJ1,1,2)) >= 1,VALUE(MID(AJ1,1,2)) <= 31),FALSE),\n    IF(ISNUMBER(VALUE(MID(AJ1,4,2))),AND(VALUE(MID(AJ1,4,2)) >= 1,VALUE(MID(AJ1,4,2)) <= 12),FALSE),\n    ISNUMBER(VALUE(MID(AJ1,7,4))),\n    MID(AJ1,3,1)=\".\",\n    MID(AJ1,6,1)=\".\",\n    LEN(AJ1)=10\n)),\nAND(OR(AI1=\"2. Ingen udløbsdato\",AI1=\"3. Ved ikke\"),AJ1=\"\")),\"\",\"Fejl\"))","v":""},{"$f":"IF(OR(AND($P1>=DQ$8,ISNUMBER(AK1)=TRUE,AI1=\"1. Dato (indsæt dato i næste felt)\"),\nAND(OR($P1<DO$8,AI1=\"2. Ingen udløbsdato\",AI1=\"3. Ved ikke\"),AK1=\"\")),\"\",\"Fejl\")","v":""},{"$f":"IF(OR(\nAND($P1>=DR$8,ISERROR(MATCH(AL1,AL$12:AL$17,0))=FALSE),\nAND($P1<DR$8,AL1=\"\")),\n\"\",\"Fejl\")","v":""},{"$f":"IF(AND($P1<DR$8,AL1=\"\"),\"\",IF(\n\nOR(AND($P1>=DS$8,AL1=\"1. Dato (Indsæt dato i næste felt)\",\n    AND(IF(ISNUMBER(VALUE(MID(AM1,1,2))),AND(VALUE(MID(AM1,1,2)) >= 1,VALUE(MID(AM1,1,2)) <= 31),FALSE),\n    IF(ISNUMBER(VALUE(MID(AM1,4,2))),AND(VALUE(MID(AM1,4,2)) >= 1,VALUE(MID(AM1,4,2)) <= 12),FALSE),\n    ISNUMBER(VALUE(MID(AM1,7,4))),\n    MID(AM1,3,1)=\".\",\n    MID(AM1,6,1)=\".\",\n    LEN(AM1)=10\n)),\nAND(OR(AL1=\"2. Ikke planlagt\",AL1=\"3. Ved ikke\"),AM1=\"\")),\"\",\"Fejl\"))","v":""},{"$f":"IF(OR(\nAND($P1>=DT$8,ISERROR(MATCH(AN1,AN$12:AN$17,0))=FALSE),\nAND($P1<DT$8,AN1=\"\")),\n\"\",\"Fejl\")","v":""},{"$f":"IF(OR(\nAND($P1>=DU$8,ISERROR(MATCH(AO1,AO$12:AO$17,0))=FALSE),\nAND($P1<DU$8,AO1=\"\")),\n\"\",\"Fejl\")","v":""},{"$f":"IF(OR(\nAND($P1>=DV$8,ISERROR(MATCH(AP1,AP$12:AP$17,0))=FALSE),\nAND($P1<DV$8,AP1=\"\")),\n\"\",\"Fejl\")","v":""},{"$f":"IF(OR(\nAND($P1>=DW$8,ISERROR(MATCH(AQ1,AQ$12:AQ$17,0))=FALSE),\nAND($P1<DW$8,AQ1=\"\")),\n\"\",\"Fejl\")","v":""},{"$f":"IF(AND($P1<DW$8,AQ1=\"\"),\"\",IF(\n\nOR(AND($P1>=DX$8,AQ1=\"1. Dato (Indsæt dato i næste felt)\",\n    AND(IF(ISNUMBER(VALUE(MID(AR1,1,2))),AND(VALUE(MID(AR1,1,2)) >= 1,VALUE(MID(AR1,1,2)) <= 31),FALSE),\n    IF(ISNUMBER(VALUE(MID(AR1,4,2))),AND(VALUE(MID(AR1,4,2)) >= 1,VALUE(MID(AR1,4,2)) <= 12),FALSE),\n    ISNUMBER(VALUE(MID(AR1,7,4))),\n    MID(AR1,3,1)=\".\",\n    MID(AR1,6,1)=\".\",\n    LEN(AR1)=10\n)),\nAND(OR(AQ1=\"2. Ingen udløbsdato\",AQ1=\"3. Ved ikke\"),AR1=\"\")),\"\",\"Fejl\"))","v":""},{"$f":"IF(OR(AND($P1>=DY$8,ISNUMBER(AS1)=TRUE,AQ1=\"1. Dato (indsæt dato i næste felt)\"),\nAND(OR($P1<DW$8,AQ1=\"2. Ingen udløbsdato\",AQ1=\"3. Ved ikke\"),AS1=\"\")),\"\",\"Fejl\")","v":""},{"$f":"IF(OR(\nAND($P1>=DZ$8,ISERROR(MATCH(AT1,AT$12:AT$17,0))=FALSE),\nAND($P1<DZ$8,AT1=\"\")),\n\"\",\"Fejl\")","v":""},{"$f":"IF(AND($P1<DZ$8,AT1=\"\"),\"\",IF(\n\nOR(AND($P1>=EA$8,AT1=\"1. Dato (Indsæt dato i næste felt)\",\n    AND(IF(ISNUMBER(VALUE(MID(AU1,1,2))),AND(VALUE(MID(AU1,1,2)) >= 1,VALUE(MID(AU1,1,2)) <= 31),FALSE),\n    IF(ISNUMBER(VALUE(MID(AU1,4,2))),AND(VALUE(MID(AU1,4,2)) >= 1,VALUE(MID(AU1,4,2)) <= 12),FALSE),\n    ISNUMBER(VALUE(MID(AU1,7,4))),\n    MID(AU1,3,1)=\".\",\n    MID(AU1,6,1)=\".\",\n    LEN(AU1)=10\n)),\nAND(OR(AT1=\"2. Ikke planlagt\",AT1=\"3. Ved ikke\"),AU1=\"\")),\"\",\"Fejl\"))","v":""},{"$f":"IF(OR(\nAND($P1>=EB$8,ISERROR(MATCH(AV1,AV$12:AV$17,0))=FALSE),\nAND($P1<EB$8,AV1=\"\")),\n\"\",\"Fejl\")","v":""},{"$f":"IF(OR(\nAND($P1>=EC$8,ISERROR(MATCH(AW1,AW$12:AW$17,0))=FALSE),\nAND($P1<EC$8,AW1=\"\")),\n\"\",\"Fejl\")","v":""},{"$f":"IF(OR(\nAND($P1>=ED$8,ISERROR(MATCH(AX1,AX$12:AX$17,0))=FALSE),\nAND($P1<ED$8,AX1=\"\")),\n\"\",\"Fejl\")","v":""},{"$f":"IF(OR(\nAND($P1>=EE$8,ISERROR(MATCH(AY1,AY$12:AY$17,0))=FALSE),\nAND($P1<EE$8,AY1=\"\")),\n\"\",\"Fejl\")","v":""},{"$f":"IF(AND($P1<EE$8,AY1=\"\"),\"\",IF(\n\nOR(AND($P1>=EF$8,AY1=\"1. Dato (Indsæt dato i næste felt)\",\n    AND(IF(ISNUMBER(VALUE(MID(AZ1,1,2))),AND(VALUE(MID(AZ1,1,2)) >= 1,VALUE(MID(AZ1,1,2)) <= 31),FALSE),\n    IF(ISNUMBER(VALUE(MID(AZ1,4,2))),AND(VALUE(MID(AZ1,4,2)) >= 1,VALUE(MID(AZ1,4,2)) <= 12),FALSE),\n    ISNUMBER(VALUE(MID(AZ1,7,4))),\n    MID(AZ1,3,1)=\".\",\n    MID(AZ1,6,1)=\".\",\n    LEN(AZ1)=10\n)),\nAND(OR(AY1=\"2. Ingen udløbsdato\",AY1=\"3. Ved ikke\"),AZ1=\"\")),\"\",\"Fejl\"))","v":""},{"$f":"IF(OR(AND($P1>=EG$8,ISNUMBER(BA1)=TRUE,AY1=\"1. Dato (indsæt dato i næste felt)\"),\nAND(OR($P1<EE$8,AY1=\"2. Ingen udløbsdato\",AY1=\"3. Ved ikke\"),BA1=\"\")),\"\",\"Fejl\")","v":""},{"$f":"IF(OR(\nAND($P1>=EH$8,ISERROR(MATCH(BB1,BB$12:BB$17,0))=FALSE),\nAND($P1<EH$8,BB1=\"\")),\n\"\",\"Fejl\")","v":""},{"$f":"IF(AND($P1<EH$8,BB1=\"\"),\"\",IF(\n\nOR(AND($P1>=EI$8,BB1=\"1. Dato (Indsæt dato i næste felt)\",\n    AND(IF(ISNUMBER(VALUE(MID(BC1,1,2))),AND(VALUE(MID(BC1,1,2)) >= 1,VALUE(MID(BC1,1,2)) <= 31),FALSE),\n    IF(ISNUMBER(VALUE(MID(BC1,4,2))),AND(VALUE(MID(BC1,4,2)) >= 1,VALUE(MID(BC1,4,2)) <= 12),FALSE),\n    ISNUMBER(VALUE(MID(BC1,7,4))),\n    MID(BC1,3,1)=\".\",\n    MID(BC1,6,1)=\".\",\n    LEN(BC1)=10\n)),\nAND(OR(BB1=\"2. Ikke planlagt\",BB1=\"3. Ved ikke\"),BC1=\"\")),\"\",\"Fejl\"))","v":""},{"$f":"IF(OR(\nAND($P1>=EJ$8,ISERROR(MATCH(BD1,BD$12:BD$17,0))=FALSE),\nAND($P1<EJ$8,BD1=\"\")),\n\"\",\"Fejl\")","v":""},{"$f":"IF(OR(\nAND($P1>=EK$8,ISERROR(MATCH(BE1,BE$12:BE$17,0))=FALSE),\nAND($P1<EK$8,BE1=\"\")),\n\"\",\"Fejl\")","v":""},{"$f":"IF(OR(\nAND($P1>=EL$8,ISERROR(MATCH(BF1,BF$12:BF$17,0))=FALSE),\nAND($P1<EL$8,BF1=\"\")),\n\"\",\"Fejl\")","v":""},{"$f":"IF(OR(\nAND($P1>=EM$8,ISERROR(MATCH(BG1,BG$12:BG$17,0))=FALSE),\nAND($P1<EM$8,BG1=\"\")),\n\"\",\"Fejl\")","v":""},{"$f":"IF(AND($P1<EM$8,BG1=\"\"),\"\",IF(\n\nOR(AND($P1>=EN$8,BG1=\"1. Dato (Indsæt dato i næste felt)\",\n    AND(IF(ISNUMBER(VALUE(MID(BH1,1,2))),AND(VALUE(MID(BH1,1,2)) >= 1,VALUE(MID(BH1,1,2)) <= 31),FALSE),\n    IF(ISNUMBER(VALUE(MID(BH1,4,2))),AND(VALUE(MID(BH1,4,2)) >= 1,VALUE(MID(BH1,4,2)) <= 12),FALSE),\n    ISNUMBER(VALUE(MID(BH1,7,4))),\n    MID(BH1,3,1)=\".\",\n    MID(BH1,6,1)=\".\",\n    LEN(BH1)=10\n)),\nAND(OR(BG1=\"2. Ingen udløbsdato\",BG1=\"3. Ved ikke\"),BH1=\"\")),\"\",\"Fejl\"))","v":""},{"$f":"IF(OR(AND($P1>=EO$8,ISNUMBER(BI1)=TRUE,BG1=\"1. Dato (indsæt dato i næste felt)\"),\nAND(OR($P1<EM$8,BG1=\"2. Ingen udløbsdato\",BG1=\"3. Ved ikke\"),BI1=\"\")),\"\",\"Fejl\")","v":""},{"$f":"IF(OR(\nAND($P1>=EP$8,ISERROR(MATCH(BJ1,BJ$12:BJ$17,0))=FALSE),\nAND($P1<EP$8,BJ1=\"\")),\n\"\",\"Fejl\")","v":""},{"$f":"IF(AND($P1<EP$8,BJ1=\"\"),\"\",IF(\n\nOR(AND($P1>=EQ$8,BJ1=\"1. Dato (Indsæt dato i næste felt)\",\n    AND(IF(ISNUMBER(VALUE(MID(BK1,1,2))),AND(VALUE(MID(BK1,1,2)) >= 1,VALUE(MID(BK1,1,2)) <= 31),FALSE),\n    IF(ISNUMBER(VALUE(MID(BK1,4,2))),AND(VALUE(MID(BK1,4,2)) >= 1,VALUE(MID(BK1,4,2)) <= 12),FALSE),\n    ISNUMBER(VALUE(MID(BK1,7,4))),\n    MID(BK1,3,1)=\".\",\n    MID(BK1,6,1)=\".\",\n    LEN(BK1)=10\n)),\nAND(OR(BJ1=\"2. Ikke planlagt\",BJ1=\"3. Ved ikke\"),BK1=\"\")),\"\",\"Fejl\"))","v":""},{"$f":"IF(OR(\nAND($P1>=ER$8,ISERROR(MATCH(BL1,BL$12:BL$17,0))=FALSE),\nAND($P1<ER$8,BL1=\"\")),\n\"\",\"Fejl\")","v":""},{"$f":"IF(OR(\nAND($P1>=ES$8,ISERROR(MATCH(BM1,BM$12:BM$17,0))=FALSE),\nAND($P1<ES$8,BM1=\"\")),\n\"\",\"Fejl\")","v":""},{"$f":"IF(OR(BN1=\"\",ISERROR(MATCH(BN1,BN$12:BN$17,0))),\"Fejl\",\"\")","v":"Fejl"},{"$f":"IF(OR(BO1=\"\",ISERROR(MATCH(BO1,BO$12:BO$17,0))),\"Fejl\",\"\")","v":"Fejl"},{"$f":"IF(OR(BP1=\"\",ISERROR(MATCH(BP1,BP$12:BP$17,0))),\"Fejl\",\"\")","v":"Fejl"},{"$f":"IF(OR(BQ1=\"\",ISERROR(MATCH(BQ1,BQ$12:BQ$17,0))),\"Fejl\",\"\")","v":"Fejl"},{"$f":"IF(OR(BR1=\"\",ISERROR(MATCH(BR1,BR$12:BR$18,0))),\"Fejl\",\"\")","v":"Fejl"},{"$f":"IF(BS1=\"\",\"Fejl\",\"\")","v":"Fejl"},{"$f":"IF(OR(BT1=\"\",ISERROR(MATCH(BT1,BT$12:BT$17,0))),\"Fejl\",\"\")","v":"Fejl"},"Fejl","Fejl","Fejl","Fejl","Fejl","Fejl","Fejl","Fejl","Fejl",{"$f":"IF(OR(CD1=\"\",ISNUMBER(CD1)=FALSE,SUM(CE1:CH1)<>CD1,CD1=0,SUM(CE1:CH1)=0),\"Fejl\",\"\")","v":"Fejl"},{"$f":"IF(OR(CE1=\"\",ISNUMBER(CE1)=FALSE,SUM(CE1:CH1)=0),\"Fejl\",\"\")","v":"Fejl"},{"$f":"IF(OR(CF1=\"\",ISNUMBER(CF1)=FALSE,SUM(CE1:CH1)=0),\"Fejl\",\"\")","v":"Fejl"},{"$f":"IF(OR(CG1=\"\",ISNUMBER(CG1)=FALSE,SUM(CE1:CH1)=0),\"Fejl\",\"\")","v":"Fejl"},{"$f":"IF(OR(CH1=\"\",ISNUMBER(CH1)=FALSE,SUM(CE1:CH1)=0),\"Fejl\",\"\")","v":"Fejl"},{"$f":"IF(OR(CI1=\"\",ISNUMBER(CI1)=FALSE),\"Fejl\",\"\")","v":"Fejl"}]
[null,null,null,null,"Dataindtastning"]
[]
[]
[null,null,null,null,"Import af data til dataindtastningsarket",null,null,null,null,"Validering af data i dataindtastningsarket",null,null,null,null,null,null,"Overførsel til datagrundlag"]
[null,null,null,null,null,null,null,null,null,null,null,null,"          Ugyldig indtastning\n\n          Manglende indtastning\n\n          System dublet","Valideringen er afsluttet. Der er ingen ugyldige indtastninger i arket, og data kan overføres til arket 'Datagrundlag'."]
[null,null,null,null,"I dette ark kan myndigheden importere eller indtaste informationer for dets it-systemer. Efterfølgende valideres datakvaliteten, før det kan overføres til det endelige datagrundlag. "]
[null,null,null,null," Spørgsmål og svarmuligheder",null,null,null,null,null,null,null,null,null,null,null,null,null,null,null,null,null,null,null,null,null,null,null,null,null,null,null,null,null,null,null,null,null,null,null,null,null,null,null,null,null,null,null,null,null,null,null,null,null,null,null,null,null,null,null,null,null,null,null,null,null,null,null,null,null,null,null,null,null,null,null,null,null,null,null,null,null,null,null,null,null,null,null,null,null,null,null,null,null,null,null,null,null,null,null,1,2,3,4,5,null,null,null,null,1,1,1,1,1,1,1,1,2,2,2,2,2,2,2,2,3,3,3,3,3,3,3,3,4,4,4,4,4,4,4,4,5,5,5,5,5,5,5,5]
[]
[null,null,null,null,{"$f":"VLOOKUP(E$19,Variabler!$C:$F,2,FALSE)","v":"Spørgsmål A"},{"$f":"VLOOKUP(F$19,Variabler!$C:$F,2,FALSE)","v":"Spørgsmål B"},{"$f":"VLOOKUP(G$19,Variabler!$C:$F,2,FALSE)","v":"Spørgsmål C"},{"$f":"VLOOKUP(H$19,Variabler!$C:$F,2,FALSE)","v":"Spørgsmål E"},{"$f":"VLOOKUP(I$19,Variabler!$C:$F,2,FALSE)","v":"Spørgsmål F"},{"$f":"VLOOKUP(J$19,Variabler!$C:$F,2,FALSE)","v":"Spørgsmål G"},{"$f":"VLOOKUP(K$19,Variabler!$C:$F,2,FALSE)","v":"Spørgsmål H"},{"$f":"VLOOKUP(L$19,Variabler!$C:$F,2,FALSE)","v":"Spørgsmål I"},{"$f":"VLOOKUP(M$19,Variabler!$C:$F,2,FALSE)","v":"Spørgsmål J"},{"$f":"VLOOKUP(N$19,Variabler!$C:$F,2,FALSE)","v":"Spørgsmål K1"},{"$f":"VLOOKUP(O$19,Variabler!$C:$F,2,FALSE)","v":"Spørgsmål K2"},{"$f":"VLOOKUP(P$19,Variabler!$C:$F,2,FALSE)","v":"Spørgsmål L"},{"$f":"VLOOKUP(Q$19,Variabler!$C:$F,2,FALSE)","v":"Spørgsmål M1"},{"$f":"VLOOKUP(R$19,Variabler!$C:$F,2,FALSE)","v":"Spørgsmål M2"},{"$f":"VLOOKUP(S$19,Variabler!$C:$F,2,FALSE)","v":"Spørgsmål M3"},{"$f":"VLOOKUP(T$19,Variabler!$C:$F,2,FALSE)","v":"Spørgsmål M4"},{"$f":"VLOOKUP(U$19,Variabler!$C:$F,2,FALSE)","v":"Spørgsmål M5"},{"$f":"VLOOKUP(V$19,Variabler!$C:$F,2,FALSE)","v":"Spørgsmål 1"},{"$f":"VLOOKUP(W$19,Variabler!$C:$F,2,FALSE)","v":"Spørgsmål 2"},{"$f":"VLOOKUP(X$19,Variabler!$C:$F,2,FALSE)","v":"Spørgsmål 3"},{"$f":"VLOOKUP(Y$19,Variabler!$C:$F,2,FALSE)","v":"Spørgsmål 4"},{"$f":"VLOOKUP(Z$19,Variabler!$C:$F,2,FALSE)","v":"Spørgsmål 5.1"},{"$f":"VLOOKUP(AA$19,Variabler!$C:$F,2,FALSE)","v":"Spørgsmål 6.1.1"},{"$f":"VLOOKUP(AB$19,Variabler!$C:$F,2,FALSE)","v":"Spørgsmål 6.1.2"},{"$f":"VLOOKUP(AC$19,Variabler!$C:$F,2,FALSE)","v":"Spørgsmål 7.1"},{"$f":"VLOOKUP(AD$19,Variabler!$C:$F,2,FALSE)","v":"Spørgsmål 8.1.1"},{"$f":"VLOOKUP(AE$19,Variabler!$C:$F,2,FALSE)","v":"Spørgsmål 8.1.2"},{"$f":"VLOOKUP(AF$19,Variabler!$C:$F,2,FALSE)","v":"Spørgsmål 9.1"},{"$f":"VLOOKUP(AG$19,Variabler!$C:$F,2,FALSE)","v":"Spørgsmål 10.1"},{"$f":"VLOOKUP(AH$19,Variabler!$C:$F,2,FALSE)","v":"Spørgsmål 5.2"},{"$f":"VLOOKUP(AI$19,Variabler!$C:$F,2,FALSE)","v":"Spørgsmål 6.2.1"},{"$f":"VLOOKUP(AJ$19,Variabler!$C:$F,2,FALSE)","v":"Spørgsmål 6.2.2"},{"$f":"VLOOKUP(AK$19,Variabler!$C:$F,2,FALSE)","v":"Spørgsmål 7.2"},{"$f":"VLOOKUP(AL$19,Variabler!$C:$F,2,FALSE)","v":"Spørgsmål 8.2.1"},{"$f":"VLOOKUP(AM$19,Variabler!$C:$F,2,FALSE)","v":"Spørgsmål 8.2.2"},{"$f":"VLOOKUP(AN$19,Variabler!$C:$F,2,FALSE)","v":"Spørgsmål 9.2"},{"$f":"VLOOKUP(AO$19,Variabler!$C:$F,2,FALSE)","v":"Spørgsmål 10.2"},{"$f":"VLOOKUP(AP$19,Variabler!$C:$F,2,FALSE)","v":"Spørgsmål 5.3"},{"$f":"VLOOKUP(AQ$19,Variabler!$C:$F,2,FALSE)","v":"Spørgsmål 6.3.1"},{"$f":"VLOOKUP(AR$19,Variabler!$C:$F,2,FALSE)","v":"Spørgsmål 6.3.2"},{"$f":"VLOOKUP(AS$19,Variabler!$C:$F,2,FALSE)","v":"Spørgsmål 7.3"},{"$f":"VLOOKUP(AT$19,Variabler!$C:$F,2,FALSE)","v":"Spørgsmål 8.3.1"},{"$f":"VLOOKUP(AU$19,Variabler!$C:$F,2,FALSE)","v":"Spørgsmål 8.3.2"},{"$f":"VLOOKUP(AV$19,Variabler!$C:$F,2,FALSE)","v":"Spørgsmål 9.3"},{"$f":"VLOOKUP(AW$19,Variabler!$C:$F,2,FALSE)","v":"Spørgsmål 10.3"},{"$f":"VLOOKUP(AX$19,Variabler!$C:$F,2,FALSE)","v":"Spørgsmål 5.4"},{"$f":"VLOOKUP(AY$19,Variabler!$C:$F,2,FALSE)","v":"Spørgsmål 6.4.1"},{"$f":"VLOOKUP(AZ$19,Variabler!$C:$F,2,FALSE)","v":"Spørgsmål 6.4.2"},{"$f":"VLOOKUP(BA$19,Variabler!$C:$F,2,FALSE)","v":"Spørgsmål 7.4"},{"$f":"VLOOKUP(BB$19,Variabler!$C:$F,2,FALSE)","v":"Spørgsmål 8.4.1"},{"$f":"VLOOKUP(BC$19,Variabler!$C:$F,2,FALSE)","v":"Spørgsmål 8.4.2"},{"$f":"VLOOKUP(BD$19,Variabler!$C:$F,2,FALSE)","v":"Spørgsmål 9.4"},{"$f":"VLOOKUP(BE$19,Variabler!$C:$F,2,FALSE)","v":"Spørgsmål 10.4"},{"$f":"VLOOKUP(BF$19,Variabler!$C:$F,2,FALSE)","v":"Spørgsmål 5.5"},{"$f":"VLOOKUP(BG$19,Variabler!$C:$F,2,FALSE)","v":"Spørgsmål 6.5.1"},{"$f":"VLOOKUP(BH$19,Variabler!$C:$F,2,FALSE)","v":"Spørgsmål 6.5.2"},{"$f":"VLOOKUP(BI$19,Variabler!$C:$F,2,FALSE)","v":"Spørgsmål 7.5"},{"$f":"VLOOKUP(BJ$19,Variabler!$C:$F,2,FALSE)","v":"Spørgsmål 8.5.1"},{"$f":"VLOOKUP(BK$19,Variabler!$C:$F,2,FALSE)","v":"Spørgsmål 8.5.2"},{"$f":"VLOOKUP(BL$19,Variabler!$C:$F,2,FALSE)","v":"Spørgsmål 9.5"},{"$f":"VLOOKUP(BM$19,Variabler!$C:$F,2,FALSE)","v":"Spørgsmål 10.5"},{"$f":"VLOOKUP(BN$19,Variabler!$C:$F,2,FALSE)","v":"Spørgsmål 11"},{"$f":"VLOOKUP(BO$19,Variabler!$C:$F,2,FALSE)","v":"Spørgsmål 12"},{"$f":"VLOOKUP(BP$19,Variabler!$C:$F,2,FALSE)","v":"Spørgsmål 13"},{"$f":"VLOOKUP(BQ$19,Variabler!$C:$F,2,FALSE)","v":"Spørgsmål 14"},{"$f":"VLOOKUP(BR$19,Variabler!$C:$F,2,FALSE)","v":"Spørgsmål 15"},{"$f":"VLOOKUP(BS$19,Variabler!$C:$F,2,FALSE)","v":"Spørgsmål 16"},{"$f":"VLOOKUP(BT$19,Variabler!$C:$F,2,FALSE)","v":"Spørgsmål 17"},{"$f":"VLOOKUP(BU$19,Variabler!$C:$F,2,FALSE)","v":"Spørgsmål 18"},{"$f":"VLOOKUP(BV$19,Variabler!$C:$F,2,FALSE)","v":"Spørgsmål 19"},{"$f":"VLOOKUP(BW$19,Variabler!$C:$F,2,FALSE)","v":"Spørgsmål 20"},{"$f":"VLOOKUP(BX$19,Variabler!$C:$F,2,FALSE)","v":"Spørgsmål 21"},{"$f":"VLOOKUP(BY$19,Variabler!$C:$F,2,FALSE)","v":"Spørgsmål 22"},{"$f":"VLOOKUP(BZ$19,Variabler!$C:$F,2,FALSE)","v":"Spørgsmål 23"},{"$f":"VLOOKUP(CA$19,Variabler!$C:$F,2,FALSE)","v":"Spørgsmål 24"},{"$f":"VLOOKUP(CB$19,Variabler!$C:$F,2,FALSE)","v":"Spørgsmål 25"},{"$f":"VLOOKUP(CC$19,Variabler!$C:$F,2,FALSE)","v":"Spørgsmål 26"},{"$f":"VLOOKUP(CD$19,Variabler!$C:$F,2,FALSE)","v":"Spørgsmål 27"},{"$f":"VLOOKUP(CE$19,Variabler!$C:$F,2,FALSE)","v":"Spørgsmål 28A"},{"$f":"VLOOKUP(CF$19,Variabler!$C:$F,2,FALSE)","v":"Spørgsmål 28B"},{"$f":"VLOOKUP(CG$19,Variabler!$C:$F,2,FALSE)","v":"Spørgsmål 28C"},{"$f":"VLOOKUP(CH$19,Variabler!$C:$F,2,FALSE)","v":"Spørgsmål 28D"},{"$f":"VLOOKUP(CI$19,Variabler!$C:$F,2,FALSE)","v":"Spørgsmål 29"},null,{"$f":"E10","v":"Spørgsmål A"},{"$f":"F10","v":"Spørgsmål B"},"Spørgsmål C","Spørgsmål E","Spørgsmål F",{"$f":"J10","v":"Spørgsmål G"},{"$f":"K10","v":"Spørgsmål H"},"Spørgsmål I","Spørgsmål J","Spørgsmål K1","Spørgsmål K2","Spørgsmål L","Spørgsmål M1","Spørgsmål M2","Spørgsmål M3","Spørgsmål M4","Spørgsmål M5",{"$f":"V10","v":"Spørgsmål 1"},"Spørgsmål 2","Spørgsmål 3","Spørgsmål 4","Spørgsmål 5.1","Spørgsmål 6.1.1","Spørgsmål 6.1.2","Spørgsmål 7.1","Spørgsmål 8.1.1","Spørgsmål 8.1.2","Spørgsmål 9.1","Spørgsmål 10.1","Spørgsmål 5.2","Spørgsmål 6.2.1","Spørgsmål 6.2.2","Spørgsmål 7.2",{"$f":"AL10","v":"Spørgsmål 8.2.1"},"Spørgsmål 8.2.2","Spørgsmål 9.2","Spørgsmål 10.2","Spørgsmål 5.3","Spørgsmål 6.3.1","Spørgsmål 6.3.2","Spørgsmål 7.3","Spørgsmål 8.3.1","Spørgsmål 8.3.2","Spørgsmål 9.3","Spørgsmål 10.3","Spørgsmål 5.4","Spørgsmål 6.4.1","Spørgsmål 6.4.2","Spørgsmål 7.4",{"$f":"BB10","v":"Spørgsmål 8.4.1"},"Spørgsmål 8.4.2","Spørgsmål 9.4","Spørgsmål 10.4","Spørgsmål 5.5","Spørgsmål 6.5.1","Spørgsmål 6.5.2","Spørgsmål 7.5","Spørgsmål 8.5.1","Spørgsmål 8.5.2","Spørgsmål 9.5","Spørgsmål 10.5","Spørgsmål 11","Spørgsmål 12","Spørgsmål 13","Spørgsmål 14",{"$f":"BR10","v":"Spørgsmål 15"},"Spørgsmål 16","Spørgsmål 17","Spørgsmål 18","Spørgsmål 19","Spørgsmål 20","Spørgsmål 21","Spørgsmål 22","Spørgsmål 23","Spørgsmål 24","Spørgsmål 25","Spørgsmål 26","Spørgsmål 27","Spørgsmål 28A","Spørgsmål 28B","Spørgsmål 28C",{"$f":"CH10","v":"Spørgsmål 28D"},{"$f":"CI10","v":"Spørgsmål 29"}]
[null,null,null,null,{"$f":"VLOOKUP(E$19,Variabler!$C:$F,3,FALSE)","v":"Ministerområde"},{"$f":"VLOOKUP(F$19,Variabler!$C:$F,3,FALSE)","v":"Hvad er myndighedens navn?"},{"$f":"VLOOKUP(G$19,Variabler!$C:$F,3,FALSE)","v":"Hvad er de samlede årlige it-omkostninger i myndigheden eksklusiv overhead og fællesomkostninger?"},{"$f":"VLOOKUP(H$19,Variabler!$C:$F,3,FALSE)","v":"It-systemnavn"},{"$f":"VLOOKUP(I$19,Variabler!$C:$F,3,FALSE)","v":"It-systemejer"},{"$f":"VLOOKUP(J$19,Variabler!$C:$F,3,FALSE)","v":"It-systemejernes organisatoriske placering"},{"$f":"VLOOKUP(K$19,Variabler!$C:$F,3,FALSE)","v":"It-systemets nøglefunktion"},{"$f":"VLOOKUP(L$19,Variabler!$C:$F,3,FALSE)","v":"Primært understøttet forretningsområde"},{"$f":"VLOOKUP(M$19,Variabler!$C:$F,3,FALSE)","v":"It-systemets kritikalitet"},{"$f":"VLOOKUP(N$19,Variabler!$C:$F,3,FALSE)","v":"It-systemets sourcingmodel for drift"},{"$f":"VLOOKUP(O$19,Variabler!$C:$F,3,FALSE)","v":"It-systemets sourcingmodel for vedligehold og udvikling"},{"$f":"VLOOKUP(P$19,Variabler!$C:$F,3,FALSE)","v":"Samlet antal leverandørkontrakter for drift, vedligehold og udvikling"},{"$f":"VLOOKUP(Q$19,Variabler!$C:$F,3,FALSE)","v":"Angiv navnene på leverandørkontrakterne og leverandør (leverandør 1)"},{"$f":"VLOOKUP(R$19,Variabler!$C:$F,3,FALSE)","v":"Angiv navnene på leverandørkontrakterne og leverandør (leverandør 2)"},{"$f":"VLOOKUP(S$19,Variabler!$C:$F,3,FALSE)","v":"Angiv navnene på leverandørkontrakterne og leverandør (leverandør 3)"},{"$f":"VLOOKUP(T$19,Variabler!$C:$F,3,FALSE)","v":"Angiv navnene på leverandørkontrakterne og leverandør (leverandør 4)"},{"$f":"VLOOKUP(U$19,Variabler!$C:$F,3,FALSE)","v":"Angiv navnene på leverandørkontrakterne og leverandør (leverandør 5)"},{"$f":"VLOOKUP(V$19,Variabler!$C:$F,3,FALSE)","v":"Hvor tilfredsstillende er it-systemets understøttelse af forretningsprocesser i dag?"},{"$f":"VLOOKUP(W$19,Variabler!$C:$F,3,FALSE)","v":"I hvilken grad er der omskiftelighed i forretningsgrundlaget for it-systemet?"},{"$f":"VLOOKUP(X$19,Variabler!$C:$F,3,FALSE)","v":"Hvor mange slutbrugere har it-systemet?"},{"$f":"VLOOKUP(Y$19,Variabler!$C:$F,3,FALSE)","v":"Hvor tilfredsstillende er it-systemets realiserede tilgængelighed?"},{"$f":"VLOOKUP(Z$19,Variabler!$C:$F,3,FALSE)","v":"Hvor tilfredsstillende er myndighedens kontraktstyring af it-systemets kontraktdokumenter i dag?\n"},{"$f":"VLOOKUP(AA$19,Variabler!$C:$F,3,FALSE)","v":"Hvad er udløbsdatoen for kontrakten eksklusiv forlængelsesperioden?"},{"$f":"VLOOKUP(AB$19,Variabler!$C:$F,3,FALSE)","v":"Hvad er udløbsdatoen for kontrakten eksklusiv forlængelsesperioden?"},{"$f":"VLOOKUP(AC$19,Variabler!$C:$F,3,FALSE)","v":"Hvor mange forlængelsesmåneder giver kontrakten maksimalt mulighed for?"},{"$f":"VLOOKUP(AD$19,Variabler!$C:$F,3,FALSE)","v":"Hvornår er it-systemets transition til en eventuel ny leverandør planlagt afsluttet?"},{"$f":"VLOOKUP(AE$19,Variabler!$C:$F,3,FALSE)","v":"Hvornår er it-systemets transition til en eventuel ny leverandør planlagt afsluttet?"},{"$f":"VLOOKUP(AF$19,Variabler!$C:$F,3,FALSE)","v":"Er alle væsentlige kontraktdokumenter med videre for it-systemet optaget i et kontraktbibliotek?"},{"$f":"VLOOKUP(AG$19,Variabler!$C:$F,3,FALSE)","v":"Følges faste procedurer for økonomisk controlling imod kontrakt og leverede ydelser?"},{"$f":"VLOOKUP(AH$19,Variabler!$C:$F,3,FALSE)","v":"Hvor tilfredsstillende er myndighedens kontraktstyring af it-systemets kontraktdokumenter i dag?\n"},{"$f":"VLOOKUP(AI$19,Variabler!$C:$F,3,FALSE)","v":"Hvad er udløbsdatoen for kontrakten eksklusiv forlængelsesperioden?"},{"$f":"VLOOKUP(AJ$19,Variabler!$C:$F,3,FALSE)","v":"Hvad er udløbsdatoen for kontrakten eksklusiv forlængelsesperioden?"},{"$f":"VLOOKUP(AK$19,Variabler!$C:$F,3,FALSE)","v":"Hvor mange forlængelsesmåneder giver kontrakten maksimalt mulighed for?"},{"$f":"VLOOKUP(AL$19,Variabler!$C:$F,3,FALSE)","v":"Hvornår er it-systemets transition til en eventuel ny leverandør planlagt afsluttet?"},{"$f":"VLOOKUP(AM$19,Variabler!$C:$F,3,FALSE)","v":"Hvornår er it-systemets transition til en eventuel ny leverandør planlagt afsluttet?"},{"$f":"VLOOKUP(AN$19,Variabler!$C:$F,3,FALSE)","v":"Er alle væsentlige kontraktdokumenter med videre for it-systemet optaget i et kontraktbibliotek?"},{"$f":"VLOOKUP(AO$19,Variabler!$C:$F,3,FALSE)","v":"Følges faste procedurer for økonomisk controlling imod kontrakt og leverede ydelser?"},{"$f":"VLOOKUP(AP$19,Variabler!$C:$F,3,FALSE)","v":"Hvor tilfredsstillende er myndighedens kontraktstyring af it-systemets kontraktdokumenter i dag?\n"},{"$f":"VLOOKUP(AQ$19,Variabler!$C:$F,3,FALSE)","v":"Hvad er udløbsdatoen for kontrakten eksklusiv forlængelsesperioden?"},{"$f":"VLOOKUP(AR$19,Variabler!$C:$F,3,FALSE)","v":"Hvad er udløbsdatoen for kontrakten eksklusiv forlængelsesperioden?"},{"$f":"VLOOKUP(AS$19,Variabler!$C:$F,3,FALSE)","v":"Hvor mange forlængelsesmåneder giver kontrakten maksimalt mulighed for?"},{"$f":"VLOOKUP(AT$19,Variabler!$C:$F,3,FALSE)","v":"Hvornår er it-systemets transition til en eventuel ny leverandør planlagt afsluttet?"},{"$f":"VLOOKUP(AU$19,Variabler!$C:$F,3,FALSE)","v":"Hvornår er it-systemets transition til en eventuel ny leverandør planlagt afsluttet?"},{"$f":"VLOOKUP(AV$19,Variabler!$C:$F,3,FALSE)","v":"Er alle væsentlige kontraktdokumenter med videre for it-systemet optaget i et kontraktbibliotek?"},{"$f":"VLOOKUP(AW$19,Variabler!$C:$F,3,FALSE)","v":"Følges faste procedurer for økonomisk controlling imod kontrakt og leverede ydelser?"},{"$f":"VLOOKUP(AX$19,Variabler!$C:$F,3,FALSE)","v":"Hvor tilfredsstillende er myndighedens kontraktstyring af it-systemets kontraktdokumenter i dag?\n"},{"$f":"VLOOKUP(AY$19,Variabler!$C:$F,3,FALSE)","v":"Hvad er udløbsdatoen for kontrakten eksklusiv forlængelsesperioden?"},{"$f":"VLOOKUP(AZ$19,Variabler!$C:$F,3,FALSE)","v":"Hvad er udløbsdatoen for kontrakten eksklusiv forlængelsesperioden?"},{"$f":"VLOOKUP(BA$19,Variabler!$C:$F,3,FALSE)","v":"Hvor mange forlængelsesmåneder giver kontrakten maksimalt mulighed for?"},{"$f":"VLOOKUP(BB$19,Variabler!$C:$F,3,FALSE)","v":"Hvornår er it-systemets transition til en eventuel ny leverandør planlagt afsluttet?"},{"$f":"VLOOKUP(BC$19,Variabler!$C:$F,3,FALSE)","v":"Hvornår er it-systemets transition til en eventuel ny leverandør planlagt afsluttet?"},{"$f":"VLOOKUP(BD$19,Variabler!$C:$F,3,FALSE)","v":"Er alle væsentlige kontraktdokumenter med videre for it-systemet optaget i et kontraktbibliotek?"},{"$f":"VLOOKUP(BE$19,Variabler!$C:$F,3,FALSE)","v":"Følges faste procedurer for økonomisk controlling imod kontrakt og leverede ydelser?"},{"$f":"VLOOKUP(BF$19,Variabler!$C:$F,3,FALSE)","v":"Hvor tilfredsstillende er myndighedens kontraktstyring af it-systemets kontraktdokumenter i dag?\n"},{"$f":"VLOOKUP(BG$19,Variabler!$C:$F,3,FALSE)","v":"Hvad er udløbsdatoen for kontrakten eksklusiv forlængelsesperioden?"},{"$f":"VLOOKUP(BH$19,Variabler!$C:$F,3,FALSE)","v":"Hvad er udløbsdatoen for kontrakten eksklusiv forlængelsesperioden?"},{"$f":"VLOOKUP(BI$19,Variabler!$C:$F,3,FALSE)","v":"Hvor mange forlængelsesmåneder giver kontrakten maksimalt mulighed for?"},{"$f":"VLOOKUP(BJ$19,Variabler!$C:$F,3,FALSE)","v":"Hvornår er it-systemets transition til en eventuel ny leverandør planlagt afsluttet?"},{"$f":"VLOOKUP(BK$19,Variabler!$C:$F,3,FALSE)","v":"Hvornår er it-systemets transition til en eventuel ny leverandør planlagt afsluttet?"},{"$f":"VLOOKUP(BL$19,Variabler!$C:$F,3,FALSE)","v":"Er alle væsentlige kontraktdokumenter med videre for it-systemet optaget i et kontraktbibliotek?"},{"$f":"VLOOKUP(BM$19,Variabler!$C:$F,3,FALSE)","v":"Følges faste procedurer for økonomisk controlling imod kontrakt og leverede ydelser?"},{"$f":"VLOOKUP(BN$19,Variabler!$C:$F,3,FALSE)","v":"Hvor tilfredsstillende er it-systemets tekniske tilstand i dag?\n"},{"$f":"VLOOKUP(BO$19,Variabler!$C:$F,3,FALSE)","v":"Baserer it-systemets teknologiske komponenter sig primært på versioner, som forventes vedligeholdt af et leverandørmarked fremadrettet?"},{"$f":"VLOOKUP(BP$19,Variabler!$C:$F,3,FALSE)","v":"Understøtter it-systemet, gennem planlagt vedligehold og videreudvikling, alle væsentlige tiltænkte processer i forretningsgrundlaget i de kommende tre år?\n"},{"$f":"VLOOKUP(BQ$19,Variabler!$C:$F,3,FALSE)","v":"Er it-systemets primære integrationer baseret på standardadaptere?"},{"$f":"VLOOKUP(BR$19,Variabler!$C:$F,3,FALSE)","v":"I hvilken grad kan it-systemet skaleres kapacitetsmæssigt i forhold til behov (flere brugere, flere data)?\n"},{"$f":"VLOOKUP(BS$19,Variabler!$C:$F,3,FALSE)","v":"Hvilke primære programmeringssprog er it-systemet baseret på?\n"},{"$f":"VLOOKUP(BT$19,Variabler!$C:$F,3,FALSE)","v":"Er dokumentationen i al væsentlighed retvisende for it-systemets nuværende tilstand?"},{"$f":"VLOOKUP(BU$19,Variabler!$C:$F,3,FALSE)","v":"Hvad er myndighedens rettigheder i forhold til hovedkomponenterne i it-systemet?\n\n"},{"$f":"VLOOKUP(BV$19,Variabler!$C:$F,3,FALSE)","v":"Hvad er myndighedens rettigheder i forhold til data?\n"},{"$f":"VLOOKUP(BW$19,Variabler!$C:$F,3,FALSE)","v":"Har myndigheden mere end én ressource med teknisk viden om it-systemet?\n\n"},{"$f":"VLOOKUP(BX$19,Variabler!$C:$F,3,FALSE)","v":"Er der en opdateret proces for håndtering af nøglepersonsafhængigheder?"},{"$f":"VLOOKUP(BY$19,Variabler!$C:$F,3,FALSE)","v":"Er der etableret formelle procedurer for løbende opsamling og overlevering af information for it-systemet?"},{"$f":"VLOOKUP(BZ$19,Variabler!$C:$F,3,FALSE)","v":"Overholder forvaltningen af it-systemet de gældende politikker og retningslinjer, som myndigheden har implementeret i henhold til ISO 27001-standarden?"},{"$f":"VLOOKUP(CA$19,Variabler!$C:$F,3,FALSE)","v":"Imødekommer it-systemet kravene i databeskyttelsesforordningen?"},{"$f":"VLOOKUP(CB$19,Variabler!$C:$F,3,FALSE)","v":"Er alle relevante sikkerhedsopdateringer og patches implementeret?"},{"$f":"VLOOKUP(CC$19,Variabler!$C:$F,3,FALSE)","v":"Findes der en disaster recovery-plan for it-systemet, og er planen testet?"},{"$f":"VLOOKUP(CD$19,Variabler!$C:$F,3,FALSE)","v":"Hvad er de samlede årlige it-omkostninger til it-systemet?"},{"$f":"VLOOKUP(CE$19,Variabler!$C:$F,3,FALSE)","v":"Sammensætning af omkostninger til it-systemet: Hvad er de årlige omkostninger til drift af it-systemet?\n"},{"$f":"VLOOKUP(CF$19,Variabler!$C:$F,3,FALSE)","v":"Sammensætning af omkostninger til it-systemet: Hvad er de årlige omkostninger til vedligehold af it-systemet?"},{"$f":"VLOOKUP(CG$19,Variabler!$C:$F,3,FALSE)","v":"Sammensætning af omkostninger til it-systemet: Hvor meget udgør de interne personaleomkostninger af drift og vedligehold?"},{"$f":"VLOOKUP(CH$19,Variabler!$C:$F,3,FALSE)","v":"Sammensætning af omkostninger til it-systemet: Hvad er de årlige udviklingsomkostninger til it-systemet?"},{"$f":"VLOOKUP(CI$19,Variabler!$C:$F,3,FALSE)","v":"Hvad er de forventede investeringer i it-systemet i it-handlingsplanens \nperiode?\n"},null,{"$f":"E11","v":"Ministerområde"},"Hvad er myndighedens navn?","Hvad er de samlede årlige it-omkostninger i myndigheden eksklusiv overhead og fællesomkostninger?","It-systemnavn","It-systemejer","It-systemejernes organisatoriske placering","It-systemets nøglefunktion","Primært understøttet forretningsområde","It-systemets kritikalitet","It-systemets sourcingmodel for drift","It-systemets sourcingmodel for vedligehold og udvikling","Samlet antal leverandørkontrakter for drift, vedligehold og udvikling","Angiv navnene på leverandørkontrakterne og leverandør (leverandør 1)","Angiv navnene på leverandørkontrakterne og leverandør (leverandør 2)","Angiv navnene på leverandørkontrakterne og leverandør (leverandør 3)","Angiv navnene på leverandørkontrakterne og leverandør (leverandør 4)","Angiv navnene på leverandørkontrakterne og leverandør (leverandør 5)","Hvor tilfredsstillende er it-systemets understøttelse af forretningsprocesser i dag?","I hvilken grad er der omskiftelighed i forretningsgrundlaget for it-systemet?","Hvor mange slutbrugere har it-systemet?","Hvor tilfredsstillende er it-systemets realiserede tilgængelighed?","Hvor tilfredsstillende er myndighedens kontraktstyring af it-systemets kontraktdokumenter i dag?\n","Hvad er udløbsdatoen for kontrakten eksklusiv forlængelsesperioden?","Hvad er udløbsdatoen for kontrakten eksklusiv forlængelsesperioden?","Hvor mange forlængelsesmåneder giver kontrakten maksimalt mulighed for?","Hvornår er it-systemets transition til en eventuel ny leverandør planlagt afsluttet?","Hvornår er it-systemets transition til en eventuel ny leverandør planlagt afsluttet?","Er alle væsentlige kontraktdokumenter med videre for it-systemet optaget i et kontraktbibliotek?","Følges faste procedurer for økonomisk controlling imod kontrakt og leverede ydelser?","Hvor tilfredsstillende er myndighedens kontraktstyring af it-systemets kontraktdokumenter i dag?\n","Hvad er udløbsdatoen for kontrakten eksklusiv forlængelsesperioden?","Hvad er udløbsdatoen for kontrakten eksklusiv forlængelsesperioden?","Hvor mange forlængelsesmåneder giver kontrakten maksimalt mulighed for?","Hvornår er it-systemets transition til en eventuel ny leverandør planlagt afsluttet?","Hvornår er it-systemets transition til en eventuel ny leverandør planlagt afsluttet?","Er alle væsentlige kontraktdokumenter med videre for it-systemet optaget i et kontraktbibliotek?","Følges faste procedurer for økonomisk controlling imod kontrakt og leverede ydelser?","Hvor tilfredsstillende er myndighedens kontraktstyring af it-systemets kontraktdokumenter i dag?\n","Hvad er udløbsdatoen for kontrakten eksklusiv forlængelsesperioden?","Hvad er udløbsdatoen for kontrakten eksklusiv forlængelsesperioden?","Hvor mange forlængelsesmåneder giver kontrakten maksimalt mulighed for?","Hvornår er it-systemets transition til en eventuel ny leverandør planlagt afsluttet?","Hvornår er it-systemets transition til en eventuel ny leverandør planlagt afsluttet?","Er alle væsentlige kontraktdokumenter med videre for it-systemet optaget i et kontraktbibliotek?","Følges faste procedurer for økonomisk controlling imod kontrakt og leverede ydelser?","Hvor tilfredsstillende er myndighedens kontraktstyring af it-systemets kontraktdokumenter i dag?\n","Hvad er udløbsdatoen for kontrakten eksklusiv forlængelsesperioden?","Hvad er udløbsdatoen for kontrakten eksklusiv forlængelsesperioden?","Hvor mange forlængelsesmåneder giver kontrakten maksimalt mulighed for?","Hvornår er it-systemets transition til en eventuel ny leverandør planlagt afsluttet?","Hvornår er it-systemets transition til en eventuel ny leverandør planlagt afsluttet?","Er alle væsentlige kontraktdokumenter med videre for it-systemet optaget i et kontraktbibliotek?","Følges faste procedurer for økonomisk controlling imod kontrakt og leverede ydelser?","Hvor tilfredsstillende er myndighedens kontraktstyring af it-systemets kontraktdokumenter i dag?\n","Hvad er udløbsdatoen for kontrakten eksklusiv forlængelsesperioden?","Hvad er udløbsdatoen for kontrakten eksklusiv forlængelsesperioden?","Hvor mange forlængelsesmåneder giver kontrakten maksimalt mulighed for?","Hvornår er it-systemets transition til en eventuel ny leverandør planlagt afsluttet?","Hvornår er it-systemets transition til en eventuel ny leverandør planlagt afsluttet?","Er alle væsentlige kontraktdokumenter med videre for it-systemet optaget i et kontraktbibliotek?","Følges faste procedurer for økonomisk controlling imod kontrakt og leverede ydelser?","Hvor tilfredsstillende er it-systemets tekniske tilstand i dag?\n","Baserer it-systemets teknologiske komponenter sig primært på versioner, som forventes vedligeholdt af et leverandørmarked fremadrettet?","Understøtter it-systemet, gennem planlagt vedligehold og videreudvikling, alle væsentlige tiltænkte processer i forretningsgrundlaget i de kommende tre år?\n","Er it-systemets primære integrationer baseret på standardadaptere?","I hvilken grad kan it-systemet skaleres kapacitetsmæssigt i forhold til behov (flere brugere, flere data)?\n","Hvilke primære programmeringssprog er it-systemet baseret på?\n","Er dokumentationen i al væsentlighed retvisende for it-systemets nuværende tilstand?","Hvad er myndighedens rettigheder i forhold til hovedkomponenterne i it-systemet?\n\n","Hvad er myndighedens rettigheder i forhold til data?\n","Har myndigheden mere end én ressource med teknisk viden om it-systemet?\n\n","Er der en opdateret proces for håndtering af nøglepersonsafhængigheder?","Er der etableret formelle procedurer for løbende opsamling og overlevering af information for it-systemet?","Overholder forvaltningen af it-systemet de gældende politikker og retningslinjer, som myndigheden har implementeret i henhold til ISO 27001-standarden?","Imødekommer it-systemet kravene i databeskyttelsesforordningen?","Er alle relevante sikkerhedsopdateringer og patches implementeret?","Findes der en disaster recovery-plan for it-systemet, og er planen testet?","Hvad er de samlede årlige it-omkostninger til it-systemet?","Sammensætning af omkostninger til it-systemet: Hvad er de årlige omkostninger til drift af it-systemet?\n","Sammensætning af omkostninger til it-systemet: Hvad er de årlige omkostninger til vedligehold af it-systemet?","Sammensætning af omkostninger til it-systemet: Hvor meget udgør de interne personaleomkostninger af drift og vedligehold?",{"$f":"CH11","v":"Sammensætning af omkostninger til it-systemet: Hvad er de årlige udviklingsomkostninger til it-systemet?"},{"$f":"CI11","v":"Hvad er de forventede investeringer i it-systemet i it-handlingsplanens \nperiode?\n"}]
[null,"   Håndtering af data i dataindtastningsarket",null,null,{"$f":"IFERROR(INDIRECT(VLOOKUP(Dataindtastning!E$19,Variabler!$C:$F,4,FALSE)),\"\")","v":"[Valgfri tekst]"},{"$f":"IFERROR(INDIRECT(VLOOKUP(Dataindtastning!F$19,Variabler!$C:$F,4,FALSE)),\"\")","v":"[Valgfri tekst]"},{"$f":"IFERROR(INDIRECT(VLOOKUP(Dataindtastning!G$19,Variabler!$C:$F,4,FALSE)),\"\")","v":"[Valgfrit tal]"},{"$f":"IFERROR(INDIRECT(VLOOKUP(Dataindtastning!H$19,Variabler!$C:$F,4,FALSE)),\"\")","v":"[Valgfri tekst]"},{"$f":"IFERROR(INDIRECT(VLOOKUP(Dataindtastning!I$19,Variabler!$C:$F,4,FALSE)),\"\")","v":"[Valgfri tekst]"},{"$f":"IFERROR(INDIRECT(VLOOKUP(Dataindtastning!J$19,Variabler!$C:$F,4,FALSE)),\"\")","v":"[Valgfri tekst]"},{"$f":"IFERROR(INDIRECT(VLOOKUP(Dataindtastning!K$19,Variabler!$C:$F,4,FALSE)),\"\")","v":"[Valgfri tekst]"},{"$f":"IFERROR(INDIRECT(VLOOKUP(Dataindtastning!L$19,Variabler!$C:$F,4,FALSE)),\"\")","v":"[Valgfri tekst]"},{"$f":"IFERROR(INDIRECT(VLOOKUP(Dataindtastning!M$19,Variabler!$C:$F,4,FALSE)),\"\")","v":"Samfundskritisk"},{"$f":"IFERROR(INDIRECT(VLOOKUP(Dataindtastning!N$19,Variabler!$C:$F,4,FALSE)),\"\")","v":"Overvejende outsourcet"},{"$f":"IFERROR(INDIRECT(VLOOKUP(Dataindtastning!O$19,Variabler!$C:$F,4,FALSE)),\"\")","v":"Overvejende outsourcet"},{"$f":"IFERROR(INDIRECT(VLOOKUP(Dataindtastning!P$19,Variabler!$C:$F,4,FALSE)),\"\")","v":"[Valgfrit tal]"},{"$f":"IFERROR(INDIRECT(VLOOKUP(Dataindtastning!Q$19,Variabler!$C:$F,4,FALSE)),\"\")","v":"[Valgfri tekst]"},{"$f":"IFERROR(INDIRECT(VLOOKUP(Dataindtastning!R$19,Variabler!$C:$F,4,FALSE)),\"\")","v":"[Valgfri tekst]"},{"$f":"IFERROR(INDIRECT(VLOOKUP(Dataindtastning!S$19,Variabler!$C:$F,4,FALSE)),\"\")","v":"[Valgfri tekst]"},{"$f":"IFERROR(INDIRECT(VLOOKUP(Dataindtastning!T$19,Variabler!$C:$F,4,FALSE)),\"\")","v":"[Valgfri tekst]"},{"$f":"IFERROR(INDIRECT(VLOOKUP(Dataindtastning!U$19,Variabler!$C:$F,4,FALSE)),\"\")","v":"[Valgfri tekst]"},{"$f":"IFERROR(INDIRECT(VLOOKUP(Dataindtastning!V$19,Variabler!$C:$F,4,FALSE)),\"\")","v":"1. Meget utilfredsstillende"},{"$f":"IFERROR(INDIRECT(VLOOKUP(Dataindtastning!W$19,Variabler!$C:$F,4,FALSE)),\"\")","v":"1. I meget lav grad"},{"$f":"IFERROR(INDIRECT(VLOOKUP(Dataindtastning!X$19,Variabler!$C:$F,4,FALSE)),\"\")","v":"[Valgfrit tal]"},{"$f":"IFERROR(INDIRECT(VLOOKUP(Dataindtastning!Y$19,Variabler!$C:$F,4,FALSE)),\"\")","v":"1. Meget utilfredsstillende"},{"$f":"IFERROR(INDIRECT(VLOOKUP(Dataindtastning!Z$19,Variabler!$C:$F,4,FALSE)),\"\")","v":"1. Meget utilfredsstillende"},{"$f":"IFERROR(INDIRECT(VLOOKUP(Dataindtastning!AA$19,Variabler!$C:$F,4,FALSE)),\"\")","v":"1. Dato (indsæt dato i næste felt)"},{"$f":"IFERROR(INDIRECT(VLOOKUP(Dataindtastning!AB$19,Variabler!$C:$F,4,FALSE)),\"\")","v":"[Dato] (format DD-MM-ÅÅÅÅ)"},{"$f":"IFERROR(INDIRECT(VLOOKUP(Dataindtastning!AC$19,Variabler!$C:$F,4,FALSE)),\"\")","v":"[Valgfrit tal]"},{"$f":"IFERROR(INDIRECT(VLOOKUP(Dataindtastning!AD$19,Variabler!$C:$F,4,FALSE)),\"\")","v":"1. Dato (indsæt dato i næste felt)"},{"$f":"IFERROR(INDIRECT(VLOOKUP(Dataindtastning!AE$19,Variabler!$C:$F,4,FALSE)),\"\")","v":"[Dato] (format DD-MM-ÅÅÅÅ)"},{"$f":"IFERROR(INDIRECT(VLOOKUP(Dataindtastning!AF$19,Variabler!$C:$F,4,FALSE)),\"\")","v":"1. Ja"},{"$f":"IFERROR(INDIRECT(VLOOKUP(Dataindtastning!AG$19,Variabler!$C:$F,4,FALSE)),\"\")","v":"1. Ja"},{"$f":"IFERROR(INDIRECT(VLOOKUP(Dataindtastning!AH$19,Variabler!$C:$F,4,FALSE)),\"\")","v":"1. Meget utilfredsstillende"},{"$f":"IFERROR(INDIRECT(VLOOKUP(Dataindtastning!AI$19,Variabler!$C:$F,4,FALSE)),\"\")","v":"1. Dato (indsæt dato i næste felt)"},{"$f":"IFERROR(INDIRECT(VLOOKUP(Dataindtastning!AJ$19,Variabler!$C:$F,4,FALSE)),\"\")","v":"[Dato] (format DD-MM-ÅÅÅÅ)"},{"$f":"IFERROR(INDIRECT(VLOOKUP(Dataindtastning!AK$19,Variabler!$C:$F,4,FALSE)),\"\")","v":"[Valgfrit tal]"},{"$f":"IFERROR(INDIRECT(VLOOKUP(Dataindtastning!AL$19,Variabler!$C:$F,4,FALSE)),\"\")","v":"1. Dato (indsæt dato i næste felt)"},{"$f":"IFERROR(INDIRECT(VLOOKUP(Dataindtastning!AM$19,Variabler!$C:$F,4,FALSE)),\"\")","v":"[Dato] (format DD-MM-ÅÅÅÅ)"},{"$f":"IFERROR(INDIRECT(VLOOKUP(Dataindtastning!AN$19,Variabler!$C:$F,4,FALSE)),\"\")","v":"1. Ja"},{"$f":"IFERROR(INDIRECT(VLOOKUP(Dataindtastning!AO$19,Variabler!$C:$F,4,FALSE)),\"\")","v":"1. Ja"},{"$f":"IFERROR(INDIRECT(VLOOKUP(Dataindtastning!AP$19,Variabler!$C:$F,4,FALSE)),\"\")","v":"1. Meget utilfredsstillende"},{"$f":"IFERROR(INDIRECT(VLOOKUP(Dataindtastning!AQ$19,Variabler!$C:$F,4,FALSE)),\"\")","v":"1. Dato (indsæt dato i næste felt)"},{"$f":"IFERROR(INDIRECT(VLOOKUP(Dataindtastning!AR$19,Variabler!$C:$F,4,FALSE)),\"\")","v":"[Dato] (format DD-MM-ÅÅÅÅ)"},{"$f":"IFERROR(INDIRECT(VLOOKUP(Dataindtastning!AS$19,Variabler!$C:$F,4,FALSE)),\"\")","v":"[Valgfrit tal]"},{"$f":"IFERROR(INDIRECT(VLOOKUP(Dataindtastning!AT$19,Variabler!$C:$F,4,FALSE)),\"\")","v":"1. Dato (indsæt dato i næste felt)"},{"$f":"IFERROR(INDIRECT(VLOOKUP(Dataindtastning!AU$19,Variabler!$C:$F,4,FALSE)),\"\")","v":"[Dato] (format DD-MM-ÅÅÅÅ)"},{"$f":"IFERROR(INDIRECT(VLOOKUP(Dataindtastning!AV$19,Variabler!$C:$F,4,FALSE)),\"\")","v":"1. Ja"},{"$f":"IFERROR(INDIRECT(VLOOKUP(Dataindtastning!AW$19,Variabler!$C:$F,4,FALSE)),\"\")","v":"1. Ja"},{"$f":"IFERROR(INDIRECT(VLOOKUP(Dataindtastning!AX$19,Variabler!$C:$F,4,FALSE)),\"\")","v":"1. Meget utilfredsstillende"},{"$f":"IFERROR(INDIRECT(VLOOKUP(Dataindtastning!AY$19,Variabler!$C:$F,4,FALSE)),\"\")","v":"1. Dato (indsæt dato i næste felt)"},{"$f":"IFERROR(INDIRECT(VLOOKUP(Dataindtastning!AZ$19,Variabler!$C:$F,4,FALSE)),\"\")","v":"[Dato] (format DD-MM-ÅÅÅÅ)"},{"$f":"IFERROR(INDIRECT(VLOOKUP(Dataindtastning!BA$19,Variabler!$C:$F,4,FALSE)),\"\")","v":"[Valgfrit tal]"},{"$f":"IFERROR(INDIRECT(VLOOKUP(Dataindtastning!BB$19,Variabler!$C:$F,4,FALSE)),\"\")","v":"1. Dato (indsæt dato i næste felt)"},{"$f":"IFERROR(INDIRECT(VLOOKUP(Dataindtastning!BC$19,Variabler!$C:$F,4,FALSE)),\"\")","v":"[Dato] (format DD-MM-ÅÅÅÅ)"},{"$f":"IFERROR(INDIRECT(VLOOKUP(Dataindtastning!BD$19,Variabler!$C:$F,4,FALSE)),\"\")","v":"1. Ja"},{"$f":"IFERROR(INDIRECT(VLOOKUP(Dataindtastning!BE$19,Variabler!$C:$F,4,FALSE)),\"\")","v":"1. Ja"},{"$f":"IFERROR(INDIRECT(VLOOKUP(Dataindtastning!BF$19,Variabler!$C:$F,4,FALSE)),\"\")","v":"1. Meget utilfredsstillende"},{"$f":"IFERROR(INDIRECT(VLOOKUP(Dataindtastning!BG$19,Variabler!$C:$F,4,FALSE)),\"\")","v":"1. Dato (indsæt dato i næste felt)"},{"$f":"IFERROR(INDIRECT(VLOOKUP(Dataindtastning!BH$19,Variabler!$C:$F,4,FALSE)),\"\")","v":"[Dato] (format DD-MM-ÅÅÅÅ)"},{"$f":"IFERROR(INDIRECT(VLOOKUP(Dataindtastning!BI$19,Variabler!$C:$F,4,FALSE)),\"\")","v":"[Valgfrit tal]"},{"$f":"IFERROR(INDIRECT(VLOOKUP(Dataindtastning!BJ$19,Variabler!$C:$F,4,FALSE)),\"\")","v":"1. Dato (indsæt dato i næste felt)"},{"$f":"IFERROR(INDIRECT(VLOOKUP(Dataindtastning!BK$19,Variabler!$C:$F,4,FALSE)),\"\")","v":"[Dato] (format DD-MM-ÅÅÅÅ)"},{"$f":"IFERROR(INDIRECT(VLOOKUP(Dataindtastning!BL$19,Variabler!$C:$F,4,FALSE)),\"\")","v":"1. Ja"},{"$f":"IFERROR(INDIRECT(VLOOKUP(Dataindtastning!BM$19,Variabler!$C:$F,4,FALSE)),\"\")","v":"1. Ja"},{"$f":"IFERROR(INDIRECT(VLOOKUP(Dataindtastning!BN$19,Variabler!$C:$F,4,FALSE)),\"\")","v":"1. Meget utilfredsstillende"},{"$f":"IFERROR(INDIRECT(VLOOKUP(Dataindtastning!BO$19,Variabler!$C:$F,4,FALSE)),\"\")","v":"1. Ja"},{"$f":"IFERROR(INDIRECT(VLOOKUP(Dataindtastning!BP$19,Variabler!$C:$F,4,FALSE)),\"\")","v":"1. Ja"},{"$f":"IFERROR(INDIRECT(VLOOKUP(Dataindtastning!BQ$19,Variabler!$C:$F,4,FALSE)),\"\")","v":"1. Ja"},{"$f":"IFERROR(INDIRECT(VLOOKUP(Dataindtastning!BR$19,Variabler!$C:$F,4,FALSE)),\"\")","v":"1. I meget lav grad"},{"$f":"IFERROR(INDIRECT(VLOOKUP(Dataindtastning!BS$19,Variabler!$C:$F,4,FALSE)),\"\")","v":"[Valgfri tekst]"},{"$f":"IFERROR(INDIRECT(VLOOKUP(Dataindtastning!BT$19,Variabler!$C:$F,4,FALSE)),\"\")","v":"1. Ja"},{"$f":"IFERROR(INDIRECT(VLOOKUP(Dataindtastning!BU$19,Variabler!$C:$F,4,FALSE)),\"\")","v":"1. Ingen rettigheder"},{"$f":"IFERROR(INDIRECT(VLOOKUP(Dataindtastning!BV$19,Variabler!$C:$F,4,FALSE)),\"\")","v":"1. Ingen rettigheder"},{"$f":"IFERROR(INDIRECT(VLOOKUP(Dataindtastning!BW$19,Variabler!$C:$F,4,FALSE)),\"\")","v":"1. Ja"},{"$f":"IFERROR(INDIRECT(VLOOKUP(Dataindtastning!BX$19,Variabler!$C:$F,4,FALSE)),\"\")","v":"1. Ja"},{"$f":"IFERROR(INDIRECT(VLOOKUP(Dataindtastning!BY$19,Variabler!$C:$F,4,FALSE)),\"\")","v":"1. Ja"},{"$f":"IFERROR(INDIRECT(VLOOKUP(Dataindtastning!BZ$19,Variabler!$C:$F,4,FALSE)),\"\")","v":"1. Ja"},{"$f":"IFERROR(INDIRECT(VLOOKUP(Dataindtastning!CA$19,Variabler!$C:$F,4,FALSE)),\"\")","v":"1. Ja, it-systemet understøtter til fulde databeskyttelsesforordningen"},{"$f":"IFERROR(INDIRECT(VLOOKUP(Dataindtastning!CB$19,Variabler!$C:$F,4,FALSE)),\"\")","v":"1. Ja"},{"$f":"IFERROR(INDIRECT(VLOOKUP(Dataindtastning!CC$19,Variabler!$C:$F,4,FALSE)),\"\")","v":"1. Ja, og planen er testet"},{"$f":"IFERROR(INDIRECT(VLOOKUP(Dataindtastning!CD$19,Variabler!$C:$F,4,FALSE)),\"\")","v":"Sum af spg. 28A+28B+28D"},{"$f":"IFERROR(INDIRECT(VLOOKUP(Dataindtastning!CE$19,Variabler!$C:$F,4,FALSE)),\"\")","v":"[Valgfrit tal]"},{"$f":"IFERROR(INDIRECT(VLOOKUP(Dataindtastning!CF$19,Variabler!$C:$F,4,FALSE)),\"\")","v":"[Valgfrit tal]"},{"$f":"IFERROR(INDIRECT(VLOOKUP(Dataindtastning!CG$19,Variabler!$C:$F,4,FALSE)),\"\")","v":"[Valgfrit tal]"},{"$f":"IFERROR(INDIRECT(VLOOKUP(Dataindtastning!CH$19,Variabler!$C:$F,4,FALSE)),\"\")","v":"[Valgfrit tal]"},{"$f":"IFERROR(INDIRECT(VLOOKUP(Dataindtastning!CI$19,Variabler!$C:$F,4,FALSE)),\"\")","v":"[Valgfrit tal]"}]
[null,null,null,null," "," "," "," "," "," "," "," ","Forretningskritisk","Delvist outsourcet","Delvist outsourcet"," "," "," "," "," "," ","2. Utilfredsstillende","2. I mindre grad"," ","2. Utilfredsstillende","2. Utilfredsstillende","2. Ingen udløbsdato"," "," ","2. Ikke planlagt"," ","2. Nej","2. Nej","2. Utilfredsstillende","2. Ingen udløbsdato"," "," ","2. Ikke planlagt"," ","2. Nej","2. Nej","2. Utilfredsstillende","2. Ingen udløbsdato"," "," ","2. Ikke planlagt"," ","2. Nej","2. Nej","2. Utilfredsstillende","2. Ingen udløbsdato"," "," ","2. Ikke planlagt"," ","2. Nej","2. Nej","2. Utilfredsstillende","2. Ingen udløbsdato"," "," ","2. Ikke planlagt"," ","2. Nej","2. Nej","2. Utilfredsstillende","2. Nej","2. Nej","2. Nej","2. I mindre grad"," ","2. Nej","2. Udvidet brugsret","2. Udvidet brugsret","2. Nej","2. Nej","2. Nej","2. Nej","2. Ja, it-systemet understøtter delvist databeskyttelsesforordningen, fuld overholdelse nås gennem manuelle processer","2. Nej","2. Ja, der er en plan"," "," "," "," "," "," "]
[null,null,null,null," "," "," "," "," "," "," "," ","Ikke kritisk","Statens IT","Insourcet"," "," "," "," "," "," ","3. Tilfredsstillende","3. I nogen grad"," ","3. Tilfredsstillende","3. Tilfredsstillende","3. Ved ikke"," "," ","3. Ved ikke"," ","3. Ved ikke","3. Ved ikke","3. Tilfredsstillende","3. Ved ikke"," "," ","3. Ved ikke"," ","3. Ved ikke","3. Ved ikke","3. Tilfredsstillende","3. Ved ikke"," "," ","3. Ved ikke"," ","3. Ved ikke","3. Ved ikke","3. Tilfredsstillende","3. Ved ikke"," "," ","3. Ved ikke"," ","3. Ved ikke","3. Ved ikke","3. Tilfredsstillende","3. Ved ikke"," "," ","3. Ved ikke"," ","3. Ved ikke","3. Ved ikke","3. Tilfredsstillende","3. Ved ikke","3. Ved ikke","3. Ved ikke","3. I nogen grad"," ","3. Ved ikke","3. Fulde rettigheder","3. Fulde rettigheder","3. Ved ikke","3. Ved ikke","3. Ved ikke","3. Ikke relevant","3. Nej, it-systemet understøtter ikke databeskyttelsesforordningen","3. Ved ikke","3. Nej"," "," "," "," "," "," "]
[null,null,null,null," "," "," "," "," "," "," "," "," ","Insourcet"," "," "," "," "," "," "," ","4. Meget tilfredsstillende","4. I høj grad"," ","4. Meget tilfredsstillende","4. Meget tilfredsstillende"," "," "," "," "," "," "," ","4. Meget tilfredsstillende"," "," "," "," "," "," "," ","4. Meget tilfredsstillende"," "," "," "," "," "," "," ","4. Meget tilfredsstillende"," "," "," "," "," "," "," ","4. Meget tilfredsstillende"," "," "," "," "," "," "," ","4. Meget tilfredsstillende"," ","4. Ikke relevant"," ","4. I høj grad"," "," ","4. Ved ikke","4. Ved ikke"," "," "," "," ","4. Ikke relevant"," ","4. Ved ikke"," "," "," "," "," "," "]
[null,null,null,null," "," "," "," "," "," "," "," "," "," "," "," "," "," "," "," "," ","5. Særdeles tilfredsstillende","5. I meget høj grad"," ","5. Særdeles tilfredsstillende","5. Særdeles tilfredsstillende"," "," "," "," "," "," "," ","5. Særdeles tilfredsstillende"," "," "," "," "," "," "," ","5. Særdeles tilfredsstillende"," "," "," "," "," "," "," ","5. Særdeles tilfredsstillende"," "," "," "," "," "," "," ","5. Særdeles tilfredsstillende"," "," "," "," "," "," "," ","5. Særdeles tilfredsstillende"," "," "," ","5. I meget høj grad"," "," "," "," "," "," "," "," "," "," ","5. Ikke relevant"," "," "," "," "," "," "]
[null,null,null,null," "," ","  "," "," "," "," "," "," "," "," ","  "," "," "," "," "," "," ","6. Ved ikke","  "," "," "," ","  ","  "," ","  "," "," "," "," ","  ","  "," ","  "," "," "," "," ","  ","  "," ","  "," "," "," "," ","  ","  "," ","  "," "," "," "," ","  ","  "," ","  "," "," "," "," "," "," ","6. Ved ikke"," "," "," "," "," "," "," "," "," "," "," ","  ","  ","  ","  ","  ","  "]
[null,null,null,null," "," "," "," "," "," "," "," "," "," "," "," "," "," "," "," "," "," "," "," "," "," "," "," "," "," "," "," "," "," "," "," "," "," "," "," "," "," "," "," "," "," "," "," "," "," "," "," "," "," "," "," "," "," "," "," "," "," "," "," "," "," "," "," "," ","7. Ikke relevant"," "," "," "," "," "," "," "," "," "," "," "," "," "," "," "," "," "]
[null,null,null,null,1,2,3,4,5,6,7,8,9,10,11,12,13,14,15,16,17,18,19,20,21,22,23,24,25,26,27,28,29,30,31,32,33,34,35,36,37,38,39,40,41,42,43,44,45,46,47,48,49,50,51,52,53,54,55,56,57,58,59,60,61,62,63,64,65,66,67,68,69,70,71,72,73,74,75,76,77,78,79,80,81,82,83]
[]
[null,null,null,null,"  Indtast nyt it-system","Her kan du indtaste oplysninger for et it-system ad gangen. Klik på knappen Tilføj enkelt it-system, når du er færdig."]
[]
[]
[null,"   Validitetstjek af data i dette ark",null,null," It-systemoversigt","Nedenfor er alle de it-systemer, som for nuværende er registreret i datagrundlaget. Du kan frit indsætte oplysninger om yderligere it-systemer eller redigere i nuværende oplysninger."]
[null,null,null,null,null,null,null,null,null,null,null,null,null,null,null,null,null,null,null,null,null,null,null,null,null,null,null,null,null,null,null,null,null,null,null,null,null,null,null,null,null,null,null,null,null,null,null,null,null,null,null,null,null,null,null,null,null,null,null,null,null,null,null,null,null,null,null,null,null,null,null,null,null,null,null,null,null,null,null,null,null,null,null,null,null,null,null,null,{"$f":"IF(LEN(TRIM(E25))=0,\"Tom\",\"\")","v":"Tom"},{"$f":"IF(LEN(TRIM(F25))=0,\"Tom\",\"\")","v":"Tom"},{"$f":"IF(LEN(TRIM(G25))=0,\"Tom\",IF(ISNUMBER(G25)=FALSE,\"Fejl\",\"\"))","v":"Tom"},{"$f":"IF(LEN(TRIM(H25))=0,\"Tom\",\"\")","v":"Tom"},{"$f":"IF(LEN(TRIM(I25))=0,\"Tom\",\"\")","v":"Tom"},{"$f":"IF(LEN(TRIM(J25))=0,\"Tom\",\"\")","v":"Tom"},{"$f":"IF(LEN(TRIM(K25))=0,\"Tom\",\"\")","v":"Tom"},{"$f":"IF(LEN(TRIM(L25))=0,\"Tom\",IF(L25<>\"Øvrige områder\",\nIF(COUNTIF($L$24:L24,L25)=0,IF(MAX($CR$24:CR24)=7,\"Fejl\",MAX($CR$24:CR24)+1),\nIF(COUNTIF($L$24:L24,L25)>0,INDEX($CR$24:CR24,MATCH(L25,$L$24:L24,0)),\"Fejl\")\n),\n\"\"))","v":"Tom"},{"$f":"IF(LEN(TRIM(M25))=0,\"Tom\",IF(ISERROR(MATCH(M25,M$12:M$18,0)),\"Fejl\",\"\"))","v":"Tom"},{"$f":"IF(LEN(TRIM(N25))=0,\"Tom\",IF(ISERROR(MATCH(N25,N$12:N$18,0)),\"Fejl\",\"\"))","v":"Tom"},{"$f":"IF(LEN(TRIM(O25))=0,\"Tom\",IF(ISERROR(MATCH(O25,O$12:O$18,0)),\"Fejl\",\"\"))","v":"Tom"},{"$f":"IF(OR(\nAND(SUM(COUNTIF($N25:$O25,{\"Insourcet\",\"Statens IT\"}))=2,P25=\"\"),\nAND(SUM(COUNTIF($N25:$O25,{\"Insourcet\",\"Statens IT\"}))=2,P25=0),\nAND(SUM(COUNTIF($N25:$O25,{\"Insourcet\",\"Statens IT\"}))<2,ISNUMBER(P25)=TRUE,P25<=5,P25>=0)),\"\",\nIF(LEN(TRIM(P25))=0,\"Tom\",\"Fejl\"))","v":"Tom"},{"$f":"IF(AND(SUM(COUNTIF($N25:$O25,{\"Insourcet\",\"Statens IT\"}))=2,Q25=\"\"),\"\",\nIF(AND(Q25<>\"\",$P25>=CW$8),\"\",\nIF(AND($P25<CW$8,Q25=\"\"),\"\",\nIF(AND(Q25=\"\",$P25>=CW$8),\"Tom\",\nIF($P25=\"\",\"\",\"Fejl\")))))","v":""},{"$f":"IF(AND(SUM(COUNTIF($N25:$O25,{\"Insourcet\",\"Statens IT\"}))=2,R25=\"\"),\"\",\nIF(AND(R25<>\"\",$P25>=CX$8),\"\",\nIF(AND($P25<CX$8,R25=\"\"),\"\",\nIF(AND(R25=\"\",$P25>=CX$8),\"Tom\",\nIF($P25=\"\",\"\",\"Fejl\")))))","v":""},{"$f":"IF(AND(SUM(COUNTIF($N25:$O25,{\"Insourcet\",\"Statens IT\"}))=2,S25=\"\"),\"\",\nIF(AND(S25<>\"\",$P25>=CY$8),\"\",\nIF(AND($P25<CY$8,S25=\"\"),\"\",\nIF(AND(S25=\"\",$P25>=CY$8),\"Tom\",\nIF($P25=\"\",\"\",\"Fejl\")))))","v":""},{"$f":"IF(AND(SUM(COUNTIF($N25:$O25,{\"Insourcet\",\"Statens IT\"}))=2,T25=\"\"),\"\",\nIF(AND(T25<>\"\",$P25>=CZ$8),\"\",\nIF(AND($P25<CZ$8,T25=\"\"),\"\",\nIF(AND(T25=\"\",$P25>=CZ$8),\"Tom\",\nIF($P25=\"\",\"\",\"Fejl\")))))","v":""},{"$f":"IF(AND(SUM(COUNTIF($N25:$O25,{\"Insourcet\",\"Statens IT\"}))=2,U25=\"\"),\"\",\nIF(AND(U25<>\"\",$P25>=DA$8),\"\",\nIF(AND($P25<DA$8,U25=\"\"),\"\",\nIF(AND(U25=\"\",$P25>=DA$8),\"Tom\",\nIF($P25=\"\",\"\",\"Fejl\")))))","v":""},{"$f":"IF(ISERROR(MATCH(V25,V$12:V$18,0))=FALSE,\"\",IF(LEN(TRIM(V25))=0,\"Tom\",\"Fejl\"))","v":"Tom"},{"$f":"IF(ISERROR(MATCH(W25,W$12:W$18,0))=FALSE,\"\",IF(LEN(TRIM(W25))=0,\"Tom\",\"Fejl\"))","v":"Tom"},{"$f":"IF(LEN(TRIM(X25))=0,\"Tom\",IF(ISNUMBER(X25)=TRUE,\"\",\"Fejl\"))","v":"Tom"},{"$f":"IF(ISERROR(MATCH(Y25,Y$12:Y$18,0))=FALSE,\"\",IF(LEN(TRIM(Y25))=0,\"Tom\",\"Fejl\"))","v":"Tom"},{"$f":"IF(OR(\nAND($P25>=DF$8,ISERROR(MATCH(Z25,Z$12:Z$18,0))=FALSE),\nAND($P25<DF$8,Z25=\"\")),\n\"\",IF(LEN(TRIM(Z25))=0,\"Tom\",\"Fejl\"))","v":""},{"$f":"IF(OR(\nAND($P25>=DG$8,ISERROR(MATCH(AA25,AA$12:AA$18,0))=FALSE),\nAND($P25<DG$8,AA25=\"\")),\n\"\",IF(LEN(TRIM(AA25))=0,\"Tom\",\"Fejl\"))","v":""},{"$f":"IF(AND($P25<DH$8,AB25=\"\"),\"\",\nIF(\nOR(AA25=\"\",\nAND($P25>=DH$8,AA25=\"1. Dato (Indsæt dato i næste felt)\",ISNUMBER(AB25),AB25>29220,AB25<55154),\nAND(OR(AA25=\"2. Ingen udløbsdato\",AA25=\"3. Ved ikke\"),AB25=\"\")),\"\",\nIF(AND(AA25=\"1. Dato (Indsæt dato i næste felt)\",LEN(TRIM(AB25))=0),\"Tom\",\"Fejl\")))","v":""},{"$f":"IF(AND($P25<DI$8,AC25=\"\"),\"\",\nIF(\nOR(AND($P25>=DI$8,ISNUMBER(AC25)=TRUE,AA25=\"1. Dato (indsæt dato i næste felt)\"),\nAND(OR($P25<DI$8,AA25=\"2. Ingen udløbsdato\",AA25=\"3. Ved ikke\",AA25=\"\"),AC25=\"\")),\"\",IF(AND(AA25=\"1. Dato (Indsæt dato i næste felt)\",LEN(TRIM(AC25))=0),\"Tom\",\"Fejl\")))","v":""},{"$f":"IF(AND($P25<DJ$8,AD25=\"\"),\"\",\nIF(OR(\nAND($P25>=DJ$8,ISERROR(MATCH(AD25,AD$12:AD$18,0))=FALSE),\nAND($P25<DJ$8,AD25=\"\")),\n\"\",IF(LEN(TRIM(AD25))=0,\"Tom\",\"Fejl\")))","v":""},{"$f":"IF(AND($P25<DK$8,AE25=\"\"),\"\",\nIF(\nOR(AD25=\"\",\nAND($P25>=DK$8,AD25=\"1. Dato (Indsæt dato i næste felt)\",ISNUMBER(AE25),AE25>29220,AE25<55154),\nAND(OR(AD25=\"2. Ikke planlagt\",AD25=\"3. Ved ikke\"),AE25=\"\")),\"\",\nIF(AND(AD25=\"1. Dato (Indsæt dato i næste felt)\",LEN(TRIM(AE25))=0),\"Tom\",\"Fejl\")))","v":""},{"$f":"IF(OR(\nAND($P25>=DL$8,ISERROR(MATCH(AF25,AF$12:AF$18,0))=FALSE),\nAND($P25<DL$8,AF25=\"\")),\n\"\",IF(LEN(TRIM(AF25))=0,\"Tom\",\"Fejl\"))","v":""},{"$f":"IF(OR(\nAND($P25>=DM$8,ISERROR(MATCH(AG25,AG$12:AG$18,0))=FALSE),\nAND($P25<DM$8,AG25=\"\")),\n\"\",IF(LEN(TRIM(AG25))=0,\"Tom\",\"Fejl\"))","v":""},{"$f":"IF(OR(\nAND($P25>=DN$8,ISERROR(MATCH(AH25,AH$12:AH$18,0))=FALSE),\nAND($P25<DN$8,AH25=\"\")),\n\"\",IF(LEN(TRIM(AH25))=0,\"Tom\",\"Fejl\"))","v":""},{"$f":"IF(OR(\nAND($P25>=DO$8,ISERROR(MATCH(AI25,AI$12:AI$18,0))=FALSE),\nAND($P25<DO$8,AI25=\"\")),\n\"\",IF(LEN(TRIM(AI25))=0,\"Tom\",\"Fejl\"))","v":""},{"$f":"IF(AND($P25<DP$8,AJ25=\"\"),\"\",\nIF(\nOR(AI25=\"\",\nAND($P25>=DP$8,AI25=\"1. Dato (Indsæt dato i næste felt)\",ISNUMBER(AJ25),AJ25>29220,AJ25<55154),\nAND(OR(AI25=\"2. Ingen udløbsdato\",AI25=\"3. Ved ikke\"),AJ25=\"\")),\"\",\nIF(AND(AI25=\"1. Dato (Indsæt dato i næste felt)\",LEN(TRIM(AJ25))=0),\"Tom\",\"Fejl\")))","v":""},{"$f":"IF(AND($P25<DQ$8,AK25=\"\"),\"\",\nIF(\nOR(AND($P25>=DQ$8,ISNUMBER(AK25)=TRUE,AI25=\"1. Dato (indsæt dato i næste felt)\"),\nAND(OR($P25<DQ$8,AI25=\"2. Ingen udløbsdato\",AI25=\"3. Ved ikke\",AI25=\"\"),AK25=\"\")),\"\",IF(AND(AI25=\"1. Dato (Indsæt dato i næste felt)\",LEN(TRIM(AK25))=0),\"Tom\",\"Fejl\")))","v":""},{"$f":"IF(AND($P25<DR$8,AL25=\"\"),\"\",\nIF(OR(\nAND($P25>=DR$8,ISERROR(MATCH(AL25,AL$12:AL$18,0))=FALSE),\nAND($P25<DR$8,AL25=\"\")),\n\"\",IF(LEN(TRIM(AL25))=0,\"Tom\",\"Fejl\")))","v":""},{"$f":"IF(AND($P25<DS$8,AM25=\"\"),\"\",\nIF(\nOR(AL25=\"\",\nAND($P25>=DS$8,AL25=\"1. Dato (Indsæt dato i næste felt)\",ISNUMBER(AM25),AM25>29220,AM25<55154),\nAND(OR(AL25=\"2. Ikke planlagt\",AL25=\"3. Ved ikke\"),AM25=\"\")),\"\",\nIF(AND(AL25=\"1. Dato (Indsæt dato i næste felt)\",LEN(TRIM(AM25))=0),\"Tom\",\"Fejl\")))","v":""},{"$f":"IF(OR(\nAND($P25>=DT$8,ISERROR(MATCH(AN25,AN$12:AN$18,0))=FALSE),\nAND($P25<DT$8,AN25=\"\")),\n\"\",IF(LEN(TRIM(AN25))=0,\"Tom\",\"Fejl\"))","v":""},{"$f":"IF(OR(\nAND($P25>=DU$8,ISERROR(MATCH(AO25,AO$12:AO$18,0))=FALSE),\nAND($P25<DU$8,AO25=\"\")),\n\"\",IF(LEN(TRIM(AO25))=0,\"Tom\",\"Fejl\"))","v":""},{"$f":"IF(OR(\nAND($P25>=DV$8,ISERROR(MATCH(AP25,AP$12:AP$18,0))=FALSE),\nAND($P25<DV$8,AP25=\"\")),\n\"\",IF(LEN(TRIM(AP25))=0,\"Tom\",\"Fejl\"))","v":""},{"$f":"IF(OR(\nAND($P25>=DW$8,ISERROR(MATCH(AQ25,AQ$12:AQ$18,0))=FALSE),\nAND($P25<DW$8,AQ25=\"\")),\n\"\",IF(LEN(TRIM(AQ25))=0,\"Tom\",\"Fejl\"))","v":""},{"$f":"IF(AND($P25<DX$8,AR25=\"\"),\"\",\nIF(\nOR(AQ25=\"\",\nAND($P25>=DX$8,AQ25=\"1. Dato (Indsæt dato i næste felt)\",ISNUMBER(AR25),AR25>29220,AR25<55154),\nAND(OR(AQ25=\"2. Ingen udløbsdato\",AQ25=\"3. Ved ikke\"),AR25=\"\")),\"\",\nIF(AND(AQ25=\"1. Dato (Indsæt dato i næste felt)\",LEN(TRIM(AR25))=0),\"Tom\",\"Fejl\")))","v":""},{"$f":"IF(AND($P25<DY$8,AS25=\"\"),\"\",\nIF(\nOR(AND($P25>=DY$8,ISNUMBER(AS25)=TRUE,AQ25=\"1. Dato (indsæt dato i næste felt)\"),\nAND(OR($P25<DY$8,AQ25=\"2. Ingen udløbsdato\",AQ25=\"3. Ved ikke\",AQ25=\"\"),AS25=\"\")),\"\",IF(AND(AQ25=\"1. Dato (Indsæt dato i næste felt)\",LEN(TRIM(AS25))=0),\"Tom\",\"Fejl\")))","v":""},{"$f":"IF(AND($P25<DZ$8,AT25=\"\"),\"\",\nIF(OR(\nAND($P25>=DZ$8,ISERROR(MATCH(AT25,AT$12:AT$18,0))=FALSE),\nAND($P25<DZ$8,AT25=\"\")),\n\"\",IF(LEN(TRIM(AT25))=0,\"Tom\",\"Fejl\")))","v":""},{"$f":"IF(AND($P25<EA$8,AU25=\"\"),\"\",\nIF(\nOR(AT25=\"\",\nAND($P25>=EA$8,AT25=\"1. Dato (Indsæt dato i næste felt)\",ISNUMBER(AU25),AU25>29220,AU25<55154),\nAND(OR(AT25=\"2. Ikke planlagt\",AT25=\"3. Ved ikke\"),AU25=\"\")),\"\",\nIF(AND(AT25=\"1. Dato (Indsæt dato i næste felt)\",LEN(TRIM(AU25))=0),\"Tom\",\"Fejl\")))","v":""},{"$f":"IF(OR(\nAND($P25>=EB$8,ISERROR(MATCH(AV25,AV$12:AV$18,0))=FALSE),\nAND($P25<EB$8,AV25=\"\")),\n\"\",IF(LEN(TRIM(AV25))=0,\"Tom\",\"Fejl\"))","v":""},{"$f":"IF(OR(\nAND($P25>=EC$8,ISERROR(MATCH(AW25,AW$12:AW$18,0))=FALSE),\nAND($P25<EC$8,AW25=\"\")),\n\"\",IF(LEN(TRIM(AW25))=0,\"Tom\",\"Fejl\"))","v":""},{"$f":"IF(OR(\nAND($P25>=ED$8,ISERROR(MATCH(AX25,AX$12:AX$18,0))=FALSE),\nAND($P25<ED$8,AX25=\"\")),\n\"\",IF(LEN(TRIM(AX25))=0,\"Tom\",\"Fejl\"))","v":""},{"$f":"IF(OR(\nAND($P25>=EE$8,ISERROR(MATCH(AY25,AY$12:AY$18,0))=FALSE),\nAND($P25<EE$8,AY25=\"\")),\n\"\",IF(LEN(TRIM(AY25))=0,\"Tom\",\"Fejl\"))","v":""},{"$f":"IF(AND($P25<EF$8,AZ25=\"\"),\"\",\nIF(\nOR(AY25=\"\",\nAND($P25>=EF$8,AY25=\"1. Dato (Indsæt dato i næste felt)\",ISNUMBER(AZ25),AZ25>29220,AZ25<55154),\nAND(OR(AY25=\"2. Ingen udløbsdato\",AY25=\"3. Ved ikke\"),AZ25=\"\")),\"\",\nIF(AND(AY25=\"1. Dato (Indsæt dato i næste felt)\",LEN(TRIM(AZ25))=0),\"Tom\",\"Fejl\")))","v":""},{"$f":"IF(AND($P25<EG$8,BA25=\"\"),\"\",\nIF(\nOR(AND($P25>=EG$8,ISNUMBER(BA25)=TRUE,AY25=\"1. Dato (indsæt dato i næste felt)\"),\nAND(OR($P25<EG$8,AY25=\"2. Ingen udløbsdato\",AY25=\"3. Ved ikke\",AY25=\"\"),BA25=\"\")),\"\",IF(AND(AY25=\"1. Dato (Indsæt dato i næste felt)\",LEN(TRIM(BA25))=0),\"Tom\",\"Fejl\")))","v":""},{"$f":"IF(AND($P25<EH$8,BB25=\"\"),\"\",\nIF(OR(\nAND($P25>=EH$8,ISERROR(MATCH(BB25,BB$12:BB$18,0))=FALSE),\nAND($P25<EH$8,BB25=\"\")),\n\"\",IF(LEN(TRIM(BB25))=0,\"Tom\",\"Fejl\")))","v":""},{"$f":"IF(AND($P25<EI$8,BC25=\"\"),\"\",\nIF(\nOR(BB25=\"\",\nAND($P25>=EI$8,BB25=\"1. Dato (Indsæt dato i næste felt)\",ISNUMBER(BC25),BC25>29220,BC25<55154),\nAND(OR(BB25=\"2. Ikke planlagt\",BB25=\"3. Ved ikke\"),BC25=\"\")),\"\",\nIF(AND(BB25=\"1. Dato (Indsæt dato i næste felt)\",LEN(TRIM(BC25))=0),\"Tom\",\"Fejl\")))","v":""},{"$f":"IF(OR(\nAND($P25>=EJ$8,ISERROR(MATCH(BD25,BD$12:BD$18,0))=FALSE),\nAND($P25<EJ$8,BD25=\"\")),\n\"\",IF(LEN(TRIM(BD25))=0,\"Tom\",\"Fejl\"))","v":""},{"$f":"IF(OR(\nAND($P25>=EK$8,ISERROR(MATCH(BE25,BE$12:BE$18,0))=FALSE),\nAND($P25<EK$8,BE25=\"\")),\n\"\",IF(LEN(TRIM(BE25))=0,\"Tom\",\"Fejl\"))","v":""},{"$f":"IF(OR(\nAND($P25>=EL$8,ISERROR(MATCH(BF25,BF$12:BF$18,0))=FALSE),\nAND($P25<EL$8,BF25=\"\")),\n\"\",IF(LEN(TRIM(BF25))=0,\"Tom\",\"Fejl\"))","v":""},{"$f":"IF(OR(\nAND($P25>=EM$8,ISERROR(MATCH(BG25,BG$12:BG$18,0))=FALSE),\nAND($P25<EM$8,BG25=\"\")),\n\"\",IF(LEN(TRIM(BG25))=0,\"Tom\",\"Fejl\"))","v":""},{"$f":"IF(AND($P25<EN$8,BH25=\"\"),\"\",\nIF(\nOR(BG25=\"\",\nAND($P25>=EN$8,BG25=\"1. Dato (Indsæt dato i næste felt)\",ISNUMBER(BH25),BH25>29220,BH25<55154),\nAND(OR(BG25=\"2. Ingen udløbsdato\",BG25=\"3. Ved ikke\"),BH25=\"\")),\"\",\nIF(AND(BG25=\"1. Dato (Indsæt dato i næste felt)\",LEN(TRIM(BH25))=0),\"Tom\",\"Fejl\")))","v":""},{"$f":"IF(AND($P25<EO$8,BI25=\"\"),\"\",\nIF(\nOR(AND($P25>=EO$8,ISNUMBER(BI25)=TRUE,BG25=\"1. Dato (indsæt dato i næste felt)\"),\nAND(OR($P25<EO$8,BG25=\"2. Ingen udløbsdato\",BG25=\"3. Ved ikke\",BG25=\"\"),BI25=\"\")),\"\",IF(AND(BG25=\"1. Dato (Indsæt dato i næste felt)\",LEN(TRIM(BI25))=0),\"Tom\",\"Fejl\")))","v":""},{"$f":"IF(AND($P25<EP$8,BJ25=\"\"),\"\",\nIF(OR(\nAND($P25>=EP$8,ISERROR(MATCH(BJ25,BJ$12:BJ$18,0))=FALSE),\nAND($P25<EP$8,BJ25=\"\")),\n\"\",IF(LEN(TRIM(BJ25))=0,\"Tom\",\"Fejl\")))","v":""},{"$f":"IF(AND($P25<EQ$8,BK25=\"\"),\"\",\nIF(\nOR(BJ25=\"\",\nAND($P25>=EQ$8,BJ25=\"1. Dato (Indsæt dato i næste felt)\",ISNUMBER(BK25),BK25>29220,BK25<55154),\nAND(OR(BJ25=\"2. Ikke planlagt\",BJ25=\"3. Ved ikke\"),BK25=\"\")),\"\",\nIF(AND(BJ25=\"1. Dato (Indsæt dato i næste felt)\",LEN(TRIM(BK25))=0),\"Tom\",\"Fejl\")))","v":""},{"$f":"IF(OR(\nAND($P25>=ER$8,ISERROR(MATCH(BL25,BL$12:BL$18,0))=FALSE),\nAND($P25<ER$8,BL25=\"\")),\n\"\",IF(LEN(TRIM(BL25))=0,\"Tom\",\"Fejl\"))","v":""},{"$f":"IF(OR(\nAND($P25>=ES$8,ISERROR(MATCH(BM25,BM$12:BM$18,0))=FALSE),\nAND($P25<ES$8,BM25=\"\")),\n\"\",IF(LEN(TRIM(BM25))=0,\"Tom\",\"Fejl\"))","v":""},{"$f":"IF(LEN(TRIM(BN25))=0,\"Tom\",IF(ISERROR(MATCH(BN25,BN$12:BN$18,0)),\"Fejl\",\"\"))","v":"Tom"},{"$f":"IF(LEN(TRIM(BO25))=0,\"Tom\",IF(ISERROR(MATCH(BO25,BO$12:BO$18,0)),\"Fejl\",\"\"))","v":"Tom"},{"$f":"IF(LEN(TRIM(BP25))=0,\"Tom\",IF(ISERROR(MATCH(BP25,BP$12:BP$18,0)),\"Fejl\",\"\"))","v":"Tom"},{"$f":"IF(LEN(TRIM(BQ25))=0,\"Tom\",IF(ISERROR(MATCH(BQ25,BQ$12:BQ$18,0)),\"Fejl\",\"\"))","v":"Tom"},{"$f":"IF(LEN(TRIM(BR25))=0,\"Tom\",IF(ISERROR(MATCH(BR25,BR$12:BR$18,0)),\"Fejl\",\"\"))","v":"Tom"},{"$f":"IF(BS25=\"\",\"Tom\",\"\")","v":"Tom"},{"$f":"IF(LEN(TRIM(BT25))=0,\"Tom\",IF(ISERROR(MATCH(BT25,BT$12:BT$18,0)),\"Fejl\",\"\"))","v":"Tom"},"Tom","Tom","Tom","Tom","Tom","Tom",{"$f":"IF(LEN(TRIM(CA25))=0,\"Tom\",IF(AND(ISERROR(MATCH(CA25,CA$12:CA$18,0)),ISERROR(MATCH(LOOKUP(1,SEARCH(CA$12:CA$18,CA25),CA$12:CA$18),CA$12:CA$18,0))),\"Fejl\",\"\"))","v":"Tom"},"Tom","Tom",{"$f":"IF(LEN(TRIM(CD25))=0,\"Tom\",IF(OR(ISNUMBER(CD25)=FALSE,SUM(CE25:CF25,CH25)<>CD25,CD25>G25),\"Fejl\",\"\"))","v":"Tom"},{"$f":"IF(LEN(TRIM(CE25))=0,\"Tom\",IF(ISNUMBER(CE25)=FALSE,\"Fejl\",\"\"))","v":"Tom"},{"$f":"IF(LEN(TRIM(CF25))=0,\"Tom\",IF(ISNUMBER(CF25)=FALSE,\"Fejl\",\"\"))","v":"Tom"},{"$f":"IF(LEN(TRIM(CG25))=0,\"Tom\",IF(OR(ISNUMBER(CG25)=FALSE,CG25>SUM(CE25:CF25)),\"Fejl\",\"\"))","v":"Tom"},{"$f":"IF(LEN(TRIM(CH25))=0,\"Tom\",IF(ISNUMBER(CH25)=FALSE,\"Fejl\",\"\"))","v":"Tom"},{"$f":"IF(LEN(TRIM(CI25))=0,\"Tom\",IF(ISNUMBER(CI25)=FALSE,\"Fejl\",\"\"))","v":"Tom"}]

{"sheet":"Datagrundlag","index":3,"n_rows":10,"n_cols":142,"rows_kept":10,"cut":false,"hidden":false,"merged":[]}
[null,"Datagrundlag"]
[]
[null,"Antal it-systemer:",{"$f":"IF(COUNTA($E:$E)-3=0,0,COUNTA(OFFSET($E$9,2,0,COUNTA($E:$E)-3,1)))","v":0},null,null,null,null,null,null,null,null,null,null,null,null,null,null,null,null,null,null,null,null,null,null,null,null,null,null,null,null,null,null,null,null,null,null,null,null,null,null,null,null,null,null,null,null,null,null,null,null,null,null,null,null,null,null,null,null,null,null,null,null,null,null,null,null,null,null,null,null,null,null,null,null,null,null,null,null,null,null,null,null,null,null,"Følgende kolonner anvendes til mellemberegninger og datatransformation, inden det benyttes i \"Data til anb. visninger\" og \"Data til yd. visninger\"."]
[]
[null,"Indeholder kolonnerne al data:",null,{"$f":"IF(rng_NoSys=0,TRUE,IF(COUNTBLANK(OFFSET(D$9,2,0,rng_NoSys,1))=0,TRUE,FALSE))","v":true},null,{"$f":"IF(rng_NoSys=0,TRUE,IF(COUNTBLANK(OFFSET(F$9,2,0,rng_NoSys,1))=0,TRUE,FALSE))","v":true},true,true,true,true,true,true,{"$f":"IF(rng_NoSys=0,TRUE,IF(COUNTBLANK(OFFSET(M$9,2,0,rng_NoSys,1))=0,TRUE,IF(COUNTBLANK(OFFSET(M$9,2,0,rng_NoSys,1))-COUNTIFS(K11:K15,\"Insourcet\",L11:L15,\"Insourcet\")-COUNTIFS(K11:K15,\"Statens IT\",L11:L15,\"Insourcet\")=0,TRUE,FALSE)))","v":true},{"$f":"IF(rng_NoSys=0,TRUE,IF(rng_NoSys-COUNTBLANK(OFFSET(N$9,2,0,rng_NoSys,1))=COUNTIF(OFFSET($M$9,2,0,COUNTA($E$9:$E$1000)-2,1),\">=\"&RIGHT(N$8,1)),TRUE,FALSE))","v":true},{"$f":"IF(rng_NoSys=0,TRUE,IF(rng_NoSys-COUNTBLANK(OFFSET(O$9,2,0,rng_NoSys,1))=COUNTIF(OFFSET($M$9,2,0,COUNTA($E$9:$E$1000)-2,1),\">=\"&RIGHT(O$8,1)),TRUE,FALSE))","v":true},{"$f":"IF(rng_NoSys=0,TRUE,IF(rng_NoSys-COUNTBLANK(OFFSET(P$9,2,0,rng_NoSys,1))=COUNTIF(OFFSET($M$9,2,0,COUNTA($E$9:$E$1000)-2,1),\">=\"&RIGHT(P$8,1)),TRUE,FALSE))","v":true},{"$f":"IF(rng_NoSys=0,TRUE,IF(rng_NoSys-COUNTBLANK(OFFSET(Q$9,2,0,rng_NoSys,1))=COUNTIF(OFFSET($M$9,2,0,COUNTA($E$9:$E$1000)-2,1),\">=\"&RIGHT(Q$8,1)),TRUE,FALSE))","v":true},{"$f":"IF(rng_NoSys=0,TRUE,IF(rng_NoSys-COUNTBLANK(OFFSET(R$9,2,0,rng_NoSys,1))=COUNTIF(OFFSET($M$9,2,0,COUNTA($E$9:$E$1000)-2,1),\">=\"&RIGHT(R$8,1)),TRUE,FALSE))","v":true},{"$f":"IF(rng_NoSys=0,TRUE,IF(COUNTBLANK(OFFSET(S$9,2,0,rng_NoSys,1))=0,TRUE,FALSE))","v":true},{"$f":"IF(rng_NoSys=0,TRUE,IF(COUNTBLANK(OFFSET(T$9,2,0,rng_NoSys,1))=0,TRUE,FALSE))","v":true},{"$f":"IF(rng_NoSys=0,TRUE,IF(COUNTBLANK(OFFSET(U$9,2,0,rng_NoSys,1))=0,TRUE,FALSE))","v":true},{"$f":"IF(rng_NoSys=0,TRUE,IF(COUNTBLANK(OFFSET(V$9,2,0,rng_NoSys,1))=0,TRUE,FALSE))","v":true},{"$f":"IF(rng_NoSys=0,TRUE,IF(rng_NoSys-COUNTBLANK(OFFSET(W$9,2,0,rng_NoSys,1))=COUNTIF(OFFSET($M$9,2,0,COUNTA($E$9:$E$1000)-2,1),\">=\"&MID(W8,13,1)),TRUE,FALSE))","v":true},{"$f":"IF(rng_NoSys=0,TRUE,IF(rng_NoSys-COUNTBLANK(OFFSET(X$9,2,0,rng_NoSys,1))=COUNTIF(OFFSET($M$9,2,0,COUNTA($E$9:$E$1000)-2,1),\">=\"&MID(X8,13,1)),TRUE,FALSE))","v":true},{"$f":"IF(rng_NoSys=0,TRUE,IF(rng_NoSys-COUNTBLANK(OFFSET(Y$9,2,0,rng_NoSys,1))=COUNTIF(OFFSET(X9,2,0,COUNTA($E$9:$E$1000)-2,1),\"1.*\"),TRUE,FALSE))","v":true},{"$f":"IF(rng_NoSys=0,TRUE,IF(rng_NoSys-COUNTBLANK(OFFSET(Z$9,2,0,rng_NoSys,1))=COUNTIF(OFFSET(X9,2,0,COUNTA($E$9:$E$1000)-2,1),\"1.*\"),TRUE,FALSE))","v":true},{"$f":"IF(rng_NoSys=0,TRUE,IF(rng_NoSys-COUNTBLANK(OFFSET(AA$9,2,0,rng_NoSys,1))=COUNTIF(OFFSET($M$9,2,0,COUNTA($E$9:$E$1000)-2,1),\">=\"&MID(AA8,13,1)),TRUE,FALSE))","v":true},{"$f":"IF(rng_NoSys=0,TRUE,IF(rng_NoSys-COUNTBLANK(OFFSET(AB$9,2,0,rng_NoSys,1))=COUNTIF(OFFSET(AA9,2,0,COUNTA($E$9:$E$1000)-2,1),\"1.*\"),TRUE,FALSE))","v":true},{"$f":"IF(rng_NoSys=0,TRUE,IF(rng_NoSys-COUNTBLANK(OFFSET(AC$9,2,0,rng_NoSys,1))=COUNTIF(OFFSET($M$9,2,0,COUNTA($E$9:$E$1000)-2,1),\">=\"&MID(AC8,13,1)),TRUE,FALSE))","v":true},{"$f":"IF(rng_NoSys=0,TRUE,IF(rng_NoSys-COUNTBLANK(OFFSET(AD$9,2,0,rng_NoSys,1))=COUNTIF(OFFSET($M$9,2,0,COUNTA($E$9:$E$1000)-2,1),\">=\"&MID(AD8,14,1)),TRUE,FALSE))","v":true},{"$f":"IF(rng_NoSys=0,TRUE,IF(rng_NoSys-COUNTBLANK(OFFSET(AE$9,2,0,rng_NoSys,1))=COUNTIF(OFFSET($M$9,2,0,COUNTA($E$9:$E$1000)-2,1),\">=\"&MID(AE8,13,1)),TRUE,FALSE))","v":true},{"$f":"IF(rng_NoSys=0,TRUE,IF(rng_NoSys-COUNTBLANK(OFFSET(AF$9,2,0,rng_NoSys,1))=COUNTIF(OFFSET($M$9,2,0,COUNTA($E$9:$E$1000)-2,1),\">=\"&MID(AF8,13,1)),TRUE,FALSE))","v":true},{"$f":"IF(rng_NoSys=0,TRUE,IF(rng_NoSys-COUNTBLANK(OFFSET(AG$9,2,0,rng_NoSys,1))=COUNTIF(OFFSET(AF9,2,0,COUNTA($E$9:$E$1000)-2,1),\"1.*\"),TRUE,FALSE))","v":true},{"$f":"IF(rng_NoSys=0,TRUE,IF(rng_NoSys-COUNTBLANK(OFFSET(AH$9,2,0,rng_NoSys,1))=COUNTIF(OFFSET(AF9,2,0,COUNTA($E$9:$E$1000)-2,1),\"1.*\"),TRUE,FALSE))","v":true},{"$f":"IF(rng_NoSys=0,TRUE,IF(rng_NoSys-COUNTBLANK(OFFSET(AI$9,2,0,rng_NoSys,1))=COUNTIF(OFFSET($M$9,2,0,COUNTA($E$9:$E$1000)-2,1),\">=\"&MID(AI8,13,1)),TRUE,FALSE))","v":true},{"$f":"IF(rng_NoSys=0,TRUE,IF(rng_NoSys-COUNTBLANK(OFFSET(AJ$9,2,0,rng_NoSys,1))=COUNTIF(OFFSET(AI9,2,0,COUNTA($E$9:$E$1000)-2,1),\"1.*\"),TRUE,FALSE))","v":true},{"$f":"IF(rng_NoSys=0,TRUE,IF(rng_NoSys-COUNTBLANK(OFFSET(AK$9,2,0,rng_NoSys,1))=COUNTIF(OFFSET($M$9,2,0,COUNTA($E$9:$E$1000)-2,1),\">=\"&MID(AK8,13,1)),TRUE,FALSE))","v":true},{"$f":"IF(rng_NoSys=0,TRUE,IF(rng_NoSys-COUNTBLANK(OFFSET(AL$9,2,0,rng_NoSys,1))=COUNTIF(OFFSET($M$9,2,0,COUNTA($E$9:$E$1000)-2,1),\">=\"&MID(AL8,14,1)),TRUE,FALSE))","v":true},{"$f":"IF(rng_NoSys=0,TRUE,IF(rng_NoSys-COUNTBLANK(OFFSET(AM$9,2,0,rng_NoSys,1))=COUNTIF(OFFSET($M$9,2,0,COUNTA($E$9:$E$1000)-2,1),\">=\"&MID(AM8,13,1)),TRUE,FALSE))","v":true},{"$f":"IF(rng_NoSys=0,TRUE,IF(rng_NoSys-COUNTBLANK(OFFSET(AN$9,2,0,rng_NoSys,1))=COUNTIF(OFFSET($M$9,2,0,COUNTA($E$9:$E$1000)-2,1),\">=\"&MID(AN8,13,1)),TRUE,FALSE))","v":true},{"$f":"IF(rng_NoSys=0,TRUE,IF(rng_NoSys-COUNTBLANK(OFFSET(AO$9,2,0,rng_NoSys,1))=COUNTIF(OFFSET(AN9,2,0,COUNTA($E$9:$E$1000)-2,1),\"1.*\"),TRUE,FALSE))","v":true},{"$f":"IF(rng_NoSys=0,TRUE,IF(rng_NoSys-COUNTBLANK(OFFSET(AP$9,2,0,rng_NoSys,1))=COUNTIF(OFFSET(AN9,2,0,COUNTA($E$9:$E$1000)-2,1),\"1.*\"),TRUE,FALSE))","v":true},{"$f":"IF(rng_NoSys=0,TRUE,IF(rng_NoSys-COUNTBLANK(OFFSET(AQ$9,2,0,rng_NoSys,1))=COUNTIF(OFFSET($M$9,2,0,COUNTA($E$9:$E$1000)-2,1),\">=\"&MID(AQ8,13,1)),TRUE,FALSE))","v":true},{"$f":"IF(rng_NoSys=0,TRUE,IF(rng_NoSys-COUNTBLANK(OFFSET(AR$9,2,0,rng_NoSys,1))=COUNTIF(OFFSET(AQ9,2,0,COUNTA($E$9:$E$1000)-2,1),\"1.*\"),TRUE,FALSE))","v":true},{"$f":"IF(rng_NoSys=0,TRUE,IF(rng_NoSys-COUNTBLANK(OFFSET(AS$9,2,0,rng_NoSys,1))=COUNTIF(OFFSET($M$9,2,0,COUNTA($E$9:$E$1000)-2,1),\">=\"&MID(AS8,13,1)),TRUE,FALSE))","v":true},{"$f":"IF(rng_NoSys=0,TRUE,IF(rng_NoSys-COUNTBLANK(OFFSET(AT$9,2,0,rng_NoSys,1))=COUNTIF(OFFSET($M$9,2,0,COUNTA($E$9:$E$1000)-2,1),\">=\"&MID(AT8,14,1)),TRUE,FALSE))","v":true},{"$f":"IF(rng_NoSys=0,TRUE,IF(rng_NoSys-COUNTBLANK(OFFSET(AU$9,2,0,rng_NoSys,1))=COUNTIF(OFFSET($M$9,2,0,COUNTA($E$9:$E$1000)-2,1),\">=\"&MID(AU8,13,1)),TRUE,FALSE))","v":true},{"$f":"IF(rng_NoSys=0,TRUE,IF(rng_NoSys-COUNTBLANK(OFFSET(AV$9,2,0,rng_NoSys,1))=COUNTIF(OFFSET($M$9,2,0,COUNTA($E$9:$E$1000)-2,1),\">=\"&MID(AV8,13,1)),TRUE,FALSE))","v":true},{"$f":"IF(rng_NoSys=0,TRUE,IF(rng_NoSys-COUNTBLANK(OFFSET(AW$9,2,0,rng_NoSys,1))=COUNTIF(OFFSET(AV9,2,0,COUNTA($E$9:$E$1000)-2,1),\"1.*\"),TRUE,FALSE))","v":true},{"$f":"IF(rng_NoSys=0,TRUE,IF(rng_NoSys-COUNTBLANK(OFFSET(AX$9,2,0,rng_NoSys,1))=COUNTIF(OFFSET(AV9,2,0,COUNTA($E$9:$E$1000)-2,1),\"1.*\"),TRUE,FALSE))","v":true},{"$f":"IF(rng_NoSys=0,TRUE,IF(rng_NoSys-COUNTBLANK(OFFSET(AY$9,2,0,rng_NoSys,1))=COUNTIF(OFFSET($M$9,2,0,COUNTA($E$9:$E$1000)-2,1),\">=\"&MID(AY8,13,1)),TRUE,FALSE))","v":true},{"$f":"IF(rng_NoSys=0,TRUE,IF(rng_NoSys-COUNTBLANK(OFFSET(AZ$9,2,0,rng_NoSys,1))=COUNTIF(OFFSET(AY9,2,0,COUNTA($E$9:$E$1000)-2,1),\"1.*\"),TRUE,FALSE))","v":true},{"$f":"IF(rng_NoSys=0,TRUE,IF(rng_NoSys-COUNTBLANK(OFFSET(BA$9,2,0,rng_NoSys,1))=COUNTIF(OFFSET($M$9,2,0,COUNTA($E$9:$E$1000)-2,1),\">=\"&MID(BA8,13,1)),TRUE,FALSE))","v":true},{"$f":"IF(rng_NoSys=0,TRUE,IF(rng_NoSys-COUNTBLANK(OFFSET(BB$9,2,0,rng_NoSys,1))=COUNTIF(OFFSET($M$9,2,0,COUNTA($E$9:$E$1000)-2,1),\">=\"&MID(BB8,14,1)),TRUE,FALSE))","v":true},{"$f":"IF(rng_NoSys=0,TRUE,IF(rng_NoSys-COUNTBLANK(OFFSET(BC$9,2,0,rng_NoSys,1))=COUNTIF(OFFSET($M$9,2,0,COUNTA($E$9:$E$1000)-2,1),\">=\"&MID(BC8,13,1)),TRUE,FALSE))","v":true},{"$f":"IF(rng_NoSys=0,TRUE,IF(rng_NoSys-COUNTBLANK(OFFSET(BD$9,2,0,rng_NoSys,1))=COUNTIF(OFFSET($M$9,2,0,COUNTA($E$9:$E$1000)-2,1),\">=\"&MID(BD8,13,1)),TRUE,FALSE))","v":true},{"$f":"IF(rng_NoSys=0,TRUE,IF(rng_NoSys-COUNTBLANK(OFFSET(BE$9,2,0,rng_NoSys,1))=COUNTIF(OFFSET(BD9,2,0,COUNTA($E$9:$E$1000)-2,1),\"1.*\"),TRUE,FALSE))","v":true},{"$f":"IF(rng_NoSys=0,TRUE,IF(rng_NoSys-COUNTBLANK(OFFSET(BF$9,2,0,rng_NoSys,1))=COUNTIF(OFFSET(BD9,2,0,COUNTA($E$9:$E$1000)-2,1),\"1.*\"),TRUE,FALSE))","v":true},{"$f":"IF(rng_NoSys=0,TRUE,IF(rng_NoSys-COUNTBLANK(OFFSET(BG$9,2,0,rng_NoSys,1))=COUNTIF(OFFSET($M$9,2,0,COUNTA($E$9:$E$1000)-2,1),\">=\"&MID(BG8,13,1)),TRUE,FALSE))","v":true},{"$f":"IF(rng_NoSys=0,TRUE,IF(rng_NoSys-COUNTBLANK(OFFSET(BH$9,2,0,rng_NoSys,1))=COUNTIF(OFFSET(BG9,2,0,COUNTA($E$9:$E$1000)-2,1),\"1.*\"),TRUE,FALSE))","v":true},{"$f":"IF(rng_NoSys=0,TRUE,IF(rng_NoSys-COUNTBLANK(OFFSET(BI$9,2,0,rng_NoSys,1))=COUNTIF(OFFSET($M$9,2,0,COUNTA($E$9:$E$1000)-2,1),\">=\"&MID(BI8,13,1)),TRUE,FALSE))","v":true},{"$f":"IF(rng_NoSys=0,TRUE,IF(rng_NoSys-COUNTBLANK(OFFSET(BJ$9,2,0,rng_NoSys,1))=COUNTIF(OFFSET($M$9,2,0,COUNTA($E$9:$E$1000)-2,1),\">=\"&MID(BJ8,14,1)),TRUE,FALSE))","v":true},{"$f":"IF(rng_NoSys=0,TRUE,IF(COUNTBLANK(OFFSET(BK$9,2,0,rng_NoSys,1))=0,TRUE,FALSE))","v":true},true,true,true,true,true,true,true,true,true,true,true,true,true,true,true,true,true,true,true,true,true]
[null,null,null,null,null,null,null,null,null,{"$f":"IF(COUNTA($B$11:$B$99833)=COUNTIF(J$11:J$99833,\"\"),\"Hide\",\"Show\")","v":"Show"},"Show","Show","Show","Show","Show","Show","Show","Show","Show","Show"]
[null,null,null,null,null,null,null,null,null,1,1,2,3,4,5,0,0,0,0,0]
[null,{"$f":"VLOOKUP(B$10,Variabler!$C:$F,2,FALSE)","v":"Spørgsmål A"},{"$f":"VLOOKUP(C$10,Variabler!$C:$F,2,FALSE)","v":"Spørgsmål B"},{"$f":"VLOOKUP(D$10,Variabler!$C:$F,2,FALSE)","v":"Spørgsmål C"},{"$f":"VLOOKUP(E$10,Variabler!$C:$F,2,FALSE)","v":"Spørgsmål E"},{"$f":"VLOOKUP(F$10,Variabler!$C:$F,2,FALSE)","v":"Spørgsmål F"},{"$f":"VLOOKUP(G$10,Variabler!$C:$F,2,FALSE)","v":"Spørgsmål G"},{"$f":"VLOOKUP(H$10,Variabler!$C:$F,2,FALSE)","v":"Spørgsmål H"},{"$f":"VLOOKUP(I$10,Variabler!$C:$F,2,FALSE)","v":"Spørgsmål I"},{"$f":"VLOOKUP(J$10,Variabler!$C:$F,2,FALSE)","v":"Spørgsmål J"},{"$f":"VLOOKUP(K$10,Variabler!$C:$F,2,FALSE)","v":"Spørgsmål K1"},{"$f":"VLOOKUP(L$10,Variabler!$C:$F,2,FALSE)","v":"Spørgsmål K2"},{"$f":"VLOOKUP(M$10,Variabler!$C:$F,2,FALSE)","v":"Spørgsmål L"},{"$f":"VLOOKUP(N$10,Variabler!$C:$F,2,FALSE)","v":"Spørgsmål M1"},{"$f":"VLOOKUP(O$10,Variabler!$C:$F,2,FALSE)","v":"Spørgsmål M2"},{"$f":"VLOOKUP(P$10,Variabler!$C:$F,2,FALSE)","v":"Spørgsmål M3"},{"$f":"VLOOKUP(Q$10,Variabler!$C:$F,2,FALSE)","v":"Spørgsmål M4"},{"$f":"VLOOKUP(R$10,Variabler!$C:$F,2,FALSE)","v":"Spørgsmål M5"},{"$f":"VLOOKUP(S$10,Variabler!$C:$F,2,FALSE)","v":"Spørgsmål 1"},{"$f":"VLOOKUP(T$10,Variabler!$C:$F,2,FALSE)","v":"Spørgsmål 2"},{"$f":"VLOOKUP(U$10,Variabler!$C:$F,2,FALSE)","v":"Spørgsmål 3"},{"$f":"VLOOKUP(V$10,Variabler!$C:$F,2,FALSE)","v":"Spørgsmål 4"},{"$f":"VLOOKUP(W$10,Variabler!$C:$F,2,FALSE)","v":"Spørgsmål 5.1"},{"$f":"VLOOKUP(X$10,Variabler!$C:$F,2,FALSE)","v":"Spørgsmål 6.1.1"},{"$f":"VLOOKUP(Y$10,Variabler!$C:$F,2,FALSE)","v":"Spørgsmål 6.1.2"},{"$f":"VLOOKUP(Z$10,Variabler!$C:$F,2,FALSE)","v":"Spørgsmål 7.1"},{"$f":"VLOOKUP(AA$10,Variabler!$C:$F,2,FALSE)","v":"Spørgsmål 8.1.1"},{"$f":"VLOOKUP(AB$10,Variabler!$C:$F,2,FALSE)","v":"Spørgsmål 8.1.2"},{"$f":"VLOOKUP(AC$10,Variabler!$C:$F,2,FALSE)","v":"Spørgsmål 9.1"},{"$f":"VLOOKUP(AD$10,Variabler!$C:$F,2,FALSE)","v":"Spørgsmål 10.1"},{"$f":"VLOOKUP(AE$10,Variabler!$C:$F,2,FALSE)","v":"Spørgsmål 5.2"},{"$f":"VLOOKUP(AF$10,Variabler!$C:$F,2,FALSE)","v":"Spørgsmål 6.2.1"},{"$f":"VLOOKUP(AG$10,Variabler!$C:$F,2,FALSE)","v":"Spørgsmål 6.2.2"},{"$f":"VLOOKUP(AH$10,Variabler!$C:$F,2,FALSE)","v":"Spørgsmål 7.2"},{"$f":"VLOOKUP(AI$10,Variabler!$C:$F,2,FALSE)","v":"Spørgsmål 8.2.1"},{"$f":"VLOOKUP(AJ$10,Variabler!$C:$F,2,FALSE)","v":"Spørgsmål 8.2.2"},{"$f":"VLOOKUP(AK$10,Variabler!$C:$F,2,FALSE)","v":"Spørgsmål 9.2"},{"$f":"VLOOKUP(AL$10,Variabler!$C:$F,2,FALSE)","v":"Spørgsmål 10.2"},{"$f":"VLOOKUP(AM$10,Variabler!$C:$F,2,FALSE)","v":"Spørgsmål 5.3"},{"$f":"VLOOKUP(AN$10,Variabler!$C:$F,2,FALSE)","v":"Spørgsmål 6.3.1"},{"$f":"VLOOKUP(AO$10,Variabler!$C:$F,2,FALSE)","v":"Spørgsmål 6.3.2"},{"$f":"VLOOKUP(AP$10,Variabler!$C:$F,2,FALSE)","v":"Spørgsmål 7.3"},{"$f":"VLOOKUP(AQ$10,Variabler!$C:$F,2,FALSE)","v":"Spørgsmål 8.3.1"},{"$f":"VLOOKUP(AR$10,Variabler!$C:$F,2,FALSE)","v":"Spørgsmål 8.3.2"},{"$f":"VLOOKUP(AS$10,Variabler!$C:$F,2,FALSE)","v":"Spørgsmål 9.3"},{"$f":"VLOOKUP(AT$10,Variabler!$C:$F,2,FALSE)","v":"Spørgsmål 10.3"},{"$f":"VLOOKUP(AU$10,Variabler!$C:$F,2,FALSE)","v":"Spørgsmål 5.4"},{"$f":"VLOOKUP(AV$10,Variabler!$C:$F,2,FALSE)","v":"Spørgsmål 6.4.1"},{"$f":"VLOOKUP(AW$10,Variabler!$C:$F,2,FALSE)","v":"Spørgsmål 6.4.2"},{"$f":"VLOOKUP(AX$10,Variabler!$C:$F,2,FALSE)","v":"Spørgsmål 7.4"},{"$f":"VLOOKUP(AY$10,Variabler!$C:$F,2,FALSE)","v":"Spørgsmål 8.4.1"},{"$f":"VLOOKUP(AZ$10,Variabler!$C:$F,2,FALSE)","v":"Spørgsmål 8.4.2"},{"$f":"VLOOKUP(BA$10,Variabler!$C:$F,2,FALSE)","v":"Spørgsmål 9.4"},{"$f":"VLOOKUP(BB$10,Variabler!$C:$F,2,FALSE)","v":"Spørgsmål 10.4"},{"$f":"VLOOKUP(BC$10,Variabler!$C:$F,2,FALSE)","v":"Spørgsmål 5.5"},{"$f":"VLOOKUP(BD$10,Variabler!$C:$F,2,FALSE)","v":"Spørgsmål 6.5.1"},{"$f":"VLOOKUP(BE$10,Variabler!$C:$F,2,FALSE)","v":"Spørgsmål 6.5.2"},{"$f":"VLOOKUP(BF$10,Variabler!$C:$F,2,FALSE)","v":"Spørgsmål 7.5"},{"$f":"VLOOKUP(BG$10,Variabler!$C:$F,2,FALSE)","v":"Spørgsmål 8.5.1"},{"$f":"VLOOKUP(BH$10,Variabler!$C:$F,2,FALSE)","v":"Spørgsmål 8.5.2"},{"$f":"VLOOKUP(BI$10,Variabler!$C:$F,2,FALSE)","v":"Spørgsmål 9.5"},{"$f":"VLOOKUP(BJ$10,Variabler!$C:$F,2,FALSE)","v":"Spørgsmål 10.5"},{"$f":"VLOOKUP(BK$10,Variabler!$C:$F,2,FALSE)","v":"Spørgsmål 11"},{"$f":"VLOOKUP(BL$10,Variabler!$C:$F,2,FALSE)","v":"Spørgsmål 12"},{"$f":"VLOOKUP(BM$10,Variabler!$C:$F,2,FALSE)","v":"Spørgsmål 13"},{"$f":"VLOOKUP(BN$10,Variabler!$C:$F,2,FALSE)","v":"Spørgsmål 14"},{"$f":"VLOOKUP(BO$10,Variabler!$C:$F,2,FALSE)","v":"Spørgsmål 15"},{"$f":"VLOOKUP(BP$10,Variabler!$C:$F,2,FALSE)","v":"Spørgsmål 16"},{"$f":"VLOOKUP(BQ$10,Variabler!$C:$F,2,FALSE)","v":"Spørgsmål 17"},{"$f":"VLOOKUP(BR$10,Variabler!$C:$F,2,FALSE)","v":"Spørgsmål 18"},{"$f":"VLOOKUP(BS$10,Variabler!$C:$F,2,FALSE)","v":"Spørgsmål 19"},{"$f":"VLOOKUP(BT$10,Variabler!$C:$F,2,FALSE)","v":"Spørgsmål 20"},{"$f":"VLOOKUP(BU$10,Variabler!$C:$F,2,FALSE)","v":"Spørgsmål 21"},{"$f":"VLOOKUP(BV$10,Variabler!$C:$F,2,FALSE)","v":"Spørgsmål 22"},{"$f":"VLOOKUP(BW$10,Variabler!$C:$F,2,FALSE)","v":"Spørgsmål 23"},{"$f":"VLOOKUP(BX$10,Variabler!$C:$F,2,FALSE)","v":"Spørgsmål 24"},{"$f":"VLOOKUP(BY$10,Variabler!$C:$F,2,FALSE)","v":"Spørgsmål 25"},{"$f":"VLOOKUP(BZ$10,Variabler!$C:$F,2,FALSE)","v":"Spørgsmål 26"},{"$f":"VLOOKUP(CA$10,Variabler!$C:$F,2,FALSE)","v":"Spørgsmål 27"},{"$f":"VLOOKUP(CB$10,Variabler!$C:$F,2,FALSE)","v":"Spørgsmål 28A"},{"$f":"VLOOKUP(CC$10,Variabler!$C:$F,2,FALSE)","v":"Spørgsmål 28B"},{"$f":"VLOOKUP(CD$10,Variabler!$C:$F,2,FALSE)","v":"Spørgsmål 28C"},{"$f":"VLOOKUP(CE$10,Variabler!$C:$F,2,FALSE)","v":"Spørgsmål 28D"},{"$f":"VLOOKUP(CF$10,Variabler!$C:$F,2,FALSE)","v":"Spørgsmål 29"},null,{"$f":"CH10","v":"X1"},"X2","X3","X4","X5","X6","X7","X8","X9","X10","X11",{"$f":"CS10","v":"X12"},"X13","X14","X15","X16","X17","X18",{"$f":"CZ10","v":"X19"},{"$f":"DA10","v":"X20"},{"$f":"DB10","v":"X21"},"X22.1.1","X22.1.2","X22.1.3","X22.2.1","X22.2.2","X22.2.3","X22.3.1","X22.3.2","X22.3.3","X22.4.1","X22.4.2","X22.4.3","X22.5.1","X22.5.2","X22.5.3","X23","X24","X25.1","X25.2","X25.3","X25.4","X25.5","X26","X27","X28","X29","X30","X31","X32","X33","X34","X35","X36","X37","X38","X39"]
[null,{"$f":"VLOOKUP(B$10,Variabler!$C:$F,3,FALSE)","v":"Ministerområde"},{"$f":"VLOOKUP(C$10,Variabler!$C:$F,3,FALSE)","v":"Hvad er myndighedens navn?"},{"$f":"VLOOKUP(D$10,Variabler!$C:$F,3,FALSE)","v":"Hvad er de samlede årlige it-omkostninger i myndigheden eksklusiv overhead og fællesomkostninger?"},{"$f":"VLOOKUP(E$10,Variabler!$C:$F,3,FALSE)","v":"It-systemnavn"},{"$f":"VLOOKUP(F$10,Variabler!$C:$F,3,FALSE)","v":"It-systemejer"},{"$f":"VLOOKUP(G$10,Variabler!$C:$F,3,FALSE)","v":"It-systemejernes organisatoriske placering"},{"$f":"VLOOKUP(H$10,Variabler!$C:$F,3,FALSE)","v":"It-systemets nøglefunktion"},{"$f":"VLOOKUP(I$10,Variabler!$C:$F,3,FALSE)","v":"Primært understøttet forretningsområde"},{"$f":"VLOOKUP(J$10,Variabler!$C:$F,3,FALSE)","v":"It-systemets kritikalitet"},{"$f":"VLOOKUP(K$10,Variabler!$C:$F,3,FALSE)","v":"It-systemets sourcingmodel for drift"},{"$f":"VLOOKUP(L$10,Variabler!$C:$F,3,FALSE)","v":"It-systemets sourcingmodel for vedligehold og udvikling"},{"$f":"VLOOKUP(M$10,Variabler!$C:$F,3,FALSE)","v":"Samlet antal leverandørkontrakter for drift, vedligehold og udvikling"},{"$f":"VLOOKUP(N$10,Variabler!$C:$F,3,FALSE)","v":"Angiv navnene på leverandørkontrakterne og leverandør (leverandør 1)"},{"$f":"VLOOKUP(O$10,Variabler!$C:$F,3,FALSE)","v":"Angiv navnene på leverandørkontrakterne og leverandør (leverandør 2)"},{"$f":"VLOOKUP(P$10,Variabler!$C:$F,3,FALSE)","v":"Angiv navnene på leverandørkontrakterne og leverandør (leverandør 3)"},{"$f":"VLOOKUP(Q$10,Variabler!$C:$F,3,FALSE)","v":"Angiv navnene på leverandørkontrakterne og leverandør (leverandør 4)"},{"$f":"VLOOKUP(R$10,Variabler!$C:$F,3,FALSE)","v":"Angiv navnene på leverandørkontrakterne og leverandør (leverandør 5)"},{"$f":"VLOOKUP(S$10,Variabler!$C:$F,3,FALSE)","v":"Hvor tilfredsstillende er it-systemets understøttelse af forretningsprocesser i dag?"},{"$f":"VLOOKUP(T$10,Variabler!$C:$F,3,FALSE)","v":"I hvilken grad er der omskiftelighed i forretningsgrundlaget for it-systemet?"},{"$f":"VLOOKUP(U$10,Variabler!$C:$F,3,FALSE)","v":"Hvor mange slutbrugere har it-systemet?"},{"$f":"VLOOKUP(V$10,Variabler!$C:$F,3,FALSE)","v":"Hvor tilfredsstillende er it-systemets realiserede tilgængelighed?"},{"$f":"VLOOKUP(W$10,Variabler!$C:$F,3,FALSE)","v":"Hvor tilfredsstillende er myndighedens kontraktstyring af it-systemets kontraktdokumenter i dag?\n"},{"$f":"VLOOKUP(X$10,Variabler!$C:$F,3,FALSE)","v":"Hvad er udløbsdatoen for kontrakten eksklusiv forlængelsesperioden?"},{"$f":"VLOOKUP(Y$10,Variabler!$C:$F,3,FALSE)","v":"Hvad er udløbsdatoen for kontrakten eksklusiv forlængelsesperioden?"},{"$f":"VLOOKUP(Z$10,Variabler!$C:$F,3,FALSE)","v":"Hvor mange forlængelsesmåneder giver kontrakten maksimalt mulighed for?"},{"$f":"VLOOKUP(AA$10,Variabler!$C:$F,3,FALSE)","v":"Hvornår er it-systemets transition til en eventuel ny leverandør planlagt afsluttet?"},{"$f":"VLOOKUP(AB$10,Variabler!$C:$F,3,FALSE)","v":"Hvornår er it-systemets transition til en eventuel ny leverandør planlagt afsluttet?"},{"$f":"VLOOKUP(AC$10,Variabler!$C:$F,3,FALSE)","v":"Er alle væsentlige kontraktdokumenter med videre for it-systemet optaget i et kontraktbibliotek?"},{"$f":"VLOOKUP(AD$10,Variabler!$C:$F,3,FALSE)","v":"Følges faste procedurer for økonomisk controlling imod kontrakt og leverede ydelser?"},{"$f":"VLOOKUP(AE$10,Variabler!$C:$F,3,FALSE)","v":"Hvor tilfredsstillende er myndighedens kontraktstyring af it-systemets kontraktdokumenter i dag?\n"},{"$f":"VLOOKUP(AF$10,Variabler!$C:$F,3,FALSE)","v":"Hvad er udløbsdatoen for kontrakten eksklusiv forlængelsesperioden?"},{"$f":"VLOOKUP(AG$10,Variabler!$C:$F,3,FALSE)","v":"Hvad er udløbsdatoen for kontrakten eksklusiv forlængelsesperioden?"},{"$f":"VLOOKUP(AH$10,Variabler!$C:$F,3,FALSE)","v":"Hvor mange forlængelsesmåneder giver kontrakten maksimalt mulighed for?"},{"$f":"VLOOKUP(AI$10,Variabler!$C:$F,3,FALSE)","v":"Hvornår er it-systemets transition til en eventuel ny leverandør planlagt afsluttet?"},{"$f":"VLOOKUP(AJ$10,Variabler!$C:$F,3,FALSE)","v":"Hvornår er it-systemets transition til en eventuel ny leverandør planlagt afsluttet?"},{"$f":"VLOOKUP(AK$10,Variabler!$C:$F,3,FALSE)","v":"Er alle væsentlige kontraktdokumenter med videre for it-systemet optaget i et kontraktbibliotek?"},{"$f":"VLOOKUP(AL$10,Variabler!$C:$F,3,FALSE)","v":"Følges faste procedurer for økonomisk controlling imod kontrakt og leverede ydelser?"},{"$f":"VLOOKUP(AM$10,Variabler!$C:$F,3,FALSE)","v":"Hvor tilfredsstillende er myndighedens kontraktstyring af it-systemets kontraktdokumenter i dag?\n"},{"$f":"VLOOKUP(AN$10,Variabler!$C:$F,3,FALSE)","v":"Hvad er udløbsdatoen for kontrakten eksklusiv forlængelsesperioden?"},{"$f":"VLOOKUP(AO$10,Variabler!$C:$F,3,FALSE)","v":"Hvad er udløbsdatoen for kontrakten eksklusiv forlængelsesperioden?"},{"$f":"VLOOKUP(AP$10,Variabler!$C:$F,3,FALSE)","v":"Hvor mange forlængelsesmåneder giver kontrakten maksimalt mulighed for?"},{"$f":"VLOOKUP(AQ$10,Variabler!$C:$F,3,FALSE)","v":"Hvornår er it-systemets transition til en eventuel ny leverandør planlagt afsluttet?"},{"$f":"VLOOKUP(AR$10,Variabler!$C:$F,3,FALSE)","v":"Hvornår er it-systemets transition til en eventuel ny leverandør planlagt afsluttet?"},{"$f":"VLOOKUP(AS$10,Variabler!$C:$F,3,FALSE)","v":"Er alle væsentlige kontraktdokumenter med videre for it-systemet optaget i et kontraktbibliotek?"},{"$f":"VLOOKUP(AT$10,Variabler!$C:$F,3,FALSE)","v":"Følges faste procedurer for økonomisk controlling imod kontrakt og leverede ydelser?"},{"$f":"VLOOKUP(AU$10,Variabler!$C:$F,3,FALSE)","v":"Hvor tilfredsstillende er myndighedens kontraktstyring af it-systemets kontraktdokumenter i dag?\n"},{"$f":"VLOOKUP(AV$10,Variabler!$C:$F,3,FALSE)","v":"Hvad er udløbsdatoen for kontrakten eksklusiv forlængelsesperioden?"},{"$f":"VLOOKUP(AW$10,Variabler!$C:$F,3,FALSE)","v":"Hvad er udløbsdatoen for kontrakten eksklusiv forlængelsesperioden?"},{"$f":"VLOOKUP(AX$10,Variabler!$C:$F,3,FALSE)","v":"Hvor mange forlængelsesmåneder giver kontrakten maksimalt mulighed for?"},{"$f":"VLOOKUP(AY$10,Variabler!$C:$F,3,FALSE)","v":"Hvornår er it-systemets transition til en eventuel ny leverandør planlagt afsluttet?"},{"$f":"VLOOKUP(AZ$10,Variabler!$C:$F,3,FALSE)","v":"Hvornår er it-systemets transition til en eventuel ny leverandør planlagt afsluttet?"},{"$f":"VLOOKUP(BA$10,Variabler!$C:$F,3,FALSE)","v":"Er alle væsentlige kontraktdokumenter med videre for it-systemet optaget i et kontraktbibliotek?"},{"$f":"VLOOKUP(BB$10,Variabler!$C:$F,3,FALSE)","v":"Følges faste procedurer for økonomisk controlling imod kontrakt og leverede ydelser?"},{"$f":"VLOOKUP(BC$10,Variabler!$C:$F,3,FALSE)","v":"Hvor tilfredsstillende er myndighedens kontraktstyring af it-systemets kontraktdokumenter i dag?\n"},{"$f":"VLOOKUP(BD$10,Variabler!$C:$F,3,FALSE)","v":"Hvad er udløbsdatoen for kontrakten eksklusiv forlængelsesperioden?"},{"$f":"VLOOKUP(BE$10,Variabler!$C:$F,3,FALSE)","v":"Hvad er udløbsdatoen for kontrakten eksklusiv forlængelsesperioden?"},{"$f":"VLOOKUP(BF$10,Variabler!$C:$F,3,FALSE)","v":"Hvor mange forlængelsesmåneder giver kontrakten maksimalt mulighed for?"},{"$f":"VLOOKUP(BG$10,Variabler!$C:$F,3,FALSE)","v":"Hvornår er it-systemets transition til en eventuel ny leverandør planlagt afsluttet?"},{"$f":"VLOOKUP(BH$10,Variabler!$C:$F,3,FALSE)","v":"Hvornår er it-systemets transition til en eventuel ny leverandør planlagt afsluttet?"},{"$f":"VLOOKUP(BI$10,Variabler!$C:$F,3,FALSE)","v":"Er alle væsentlige kontraktdokumenter med videre for it-systemet optaget i et kontraktbibliotek?"},{"$f":"VLOOKUP(BJ$10,Variabler!$C:$F,3,FALSE)","v":"Følges faste procedurer for økonomisk controlling imod kontrakt og leverede ydelser?"},{"$f":"VLOOKUP(BK$10,Variabler!$C:$F,3,FALSE)","v":"Hvor tilfredsstillende er it-systemets tekniske tilstand i dag?\n"},{"$f":"VLOOKUP(BL$10,Variabler!$C:$F,3,FALSE)","v":"Baserer it-systemets teknologiske komponenter sig primært på versioner, som forventes vedligeholdt af et leverandørmarked fremadrettet?"},{"$f":"VLOOKUP(BM$10,Variabler!$C:$F,3,FALSE)","v":"Understøtter it-systemet, gennem planlagt vedligehold og videreudvikling, alle væsentlige tiltænkte processer i forretningsgrundlaget i de kommende tre år?\n"},{"$f":"VLOOKUP(BN$10,Variabler!$C:$F,3,FALSE)","v":"Er it-systemets primære integrationer baseret på standardadaptere?"},{"$f":"VLOOKUP(BO$10,Variabler!$C:$F,3,FALSE)","v":"I hvilken grad kan it-systemet skaleres kapacitetsmæssigt i forhold til behov (flere brugere, flere data)?\n"},{"$f":"VLOOKUP(BP$10,Variabler!$C:$F,3,FALSE)","v":"Hvilke primære programmeringssprog er it-systemet baseret på?\n"},{"$f":"VLOOKUP(BQ$10,Variabler!$C:$F,3,FALSE)","v":"Er dokumentationen i al væsentlighed retvisende for it-systemets nuværende tilstand?"},{"$f":"VLOOKUP(BR$10,Variabler!$C:$F,3,FALSE)","v":"Hvad er myndighedens rettigheder i forhold til hovedkomponenterne i it-systemet?\n\n"},{"$f":"VLOOKUP(BS$10,Variabler!$C:$F,3,FALSE)","v":"Hvad er myndighedens rettigheder i forhold til data?\n"},{"$f":"VLOOKUP(BT$10,Variabler!$C:$F,3,FALSE)","v":"Har myndigheden mere end én ressource med teknisk viden om it-systemet?\n\n"},{"$f":"VLOOKUP(BU$10,Variabler!$C:$F,3,FALSE)","v":"Er der en opdateret proces for håndtering af nøglepersonsafhængigheder?"},{"$f":"VLOOKUP(BV$10,Variabler!$C:$F,3,FALSE)","v":"Er der etableret formelle procedurer for løbende opsamling og overlevering af information for it-systemet?"},{"$f":"VLOOKUP(BW$10,Variabler!$C:$F,3,FALSE)","v":"Overholder forvaltningen af it-systemet de gældende politikker og retningslinjer, som myndigheden har implementeret i henhold til ISO 27001-standarden?"},{"$f":"VLOOKUP(BX$10,Variabler!$C:$F,3,FALSE)","v":"Imødekommer it-systemet kravene i databeskyttelsesforordningen?"},{"$f":"VLOOKUP(BY$10,Variabler!$C:$F,3,FALSE)","v":"Er alle relevante sikkerhedsopdateringer og patches implementeret?"},{"$f":"VLOOKUP(BZ$10,Variabler!$C:$F,3,FALSE)","v":"Findes der en disaster recovery-plan for it-systemet, og er planen testet?"},{"$f":"VLOOKUP(CA$10,Variabler!$C:$F,3,FALSE)","v":"Hvad er de samlede årlige it-omkostninger til it-systemet?"},{"$f":"VLOOKUP(CB$10,Variabler!$C:$F,3,FALSE)","v":"Sammensætning af omkostninger til it-systemet: Hvad er de årlige omkostninger til drift af it-systemet?\n"},{"$f":"VLOOKUP(CC$10,Variabler!$C:$F,3,FALSE)","v":"Sammensætning af omkostninger til it-systemet: Hvad er de årlige omkostninger til vedligehold af it-systemet?"},{"$f":"VLOOKUP(CD$10,Variabler!$C:$F,3,FALSE)","v":"Sammensætning af omkostninger til it-systemet: Hvor meget udgør de interne personaleomkostninger af drift og vedligehold?"},{"$f":"VLOOKUP(CE$10,Variabler!$C:$F,3,FALSE)","v":"Sammensætning af omkostninger til it-systemet: Hvad er de årlige udviklingsomkostninger til it-systemet?"},{"$f":"VLOOKUP(CF$10,Variabler!$C:$F,3,FALSE)","v":"Hvad er de forventede investeringer i it-systemet i it-handlingsplanens \nperiode?\n"},"Mellemrum","Nummerering af unikke forretningsområder","Forventede investeringer per forretningsområde","Samlede årlige it-omkostninger per forretningsområde","Rangering af forretningsområder baseret på de forventede investeringer per forretningsområde","Rangering af forretningsområder baseret på de samlede årlige it-omkostninger  per forretningsområde","Mellemregning: Tilfredshed med it-systemers understøttelse af forretningsprocesser i forretningsområdet","Mellemregning: Tilfredshed med it-systemers tekniske tilstand i forretningsområdet","Vægtet tilfredshed med it-systemernes forretnings-understøttelse i forretningsområdet","Vægtet tilfredshed  med it-systemernes tekniske tilstand i forretningsområdet","It-systemets rangering baseret på samlede årlige it-omkostninger (gælder kun samfundskritiske it-systemer)","It-systemets rangering baseret på forventede investeringer (gælder kun samfundskritiske it-systemer)","Er it-systemets tekniske tilstand tilfredsstillende?","Årlige vedligeholdelses-omkostninger for it-systemer markeret som 'utilfredsstillende'","Samlede årlige it-omkostninger for it-systemer markeret som 'utilfredsstillende'","Årlige vedligeholdelses-omkostninger for it-systemer markeret som 'tilfredsstillende'","Samlede årlige it-omkostninger for it-systemer markeret som 'tilfredsstillende'","Er it-systemet tilstrækkeligt i kategorien 'Teknisk tilstand'?","Er it-systemet tilstrækkeligt i kategorien 'Kompentencer'?","Er it-systemet tilstrækkeligt i kategorien 'Dokumentation og viden'?","Er it-systemet tilstrækkeligt i kategorien 'Sikkerhed'?","Er it-systemet set tilstrækkeligt i alle kategorier?","Kontrakt 1 - Udløb inklusive forlængelsesmåneder","Kontrakt 1 - Gennemført genudbud","Kontrakt 1 - Genudbydes kontrakten rettidigt?","Kontrakt 2 - Udløb inklusive forlængelsesmåneder","Kontrakt 2 - Gennemført genudbud","Kontrakt 2 - Genudbydes kontrakten rettidigt?","Kontrakt 3 - Udløb inklusive forlængelsesmåneder","Kontrakt 3 - Gennemført genudbud","Kontrakt 3 - Genudbydes kontrakten rettidigt?","Kontrakt 4 - Udløb inklusive forlængelsesmåneder","Kontrakt 4 - Gennemført genudbud","Kontrakt 4 - Genudbydes kontrakten rettidigt?","Kontrakt 5 - Udløb inklusive forlængelsesmåneder","Kontrakt 5 - Gennemført genudbud","Kontrakt 5 - Genudbydes kontrakten rettidigt?","Transformation: Spørgsmål 1","Transformation: Spørgsmål 4","Transformation: Spørgsmål 5.1","Transformation: Spørgsmål 5.2","Transformation: Spørgsmål 5.3","Transformation: Spørgsmål 5.4","Transformation: Spørgsmål 5.5","Transformation: Spørgsmål 11","Rangering af systemer baseret på de samlede årlige it-omkostninger","Lavest vurderede tilfredsstillelse af kontraktstyring af it-systemets kontraktdokumenter i dag?","Tidligere udløbet kontrakt - genudbud ikke planlagt","Ukendt(e) kontraktudløbsdato(er) - genudbud ikke planlagt","Ukendt(e) kontraktudløbsdato(er) - genudbud planlagt","Genudbud planlagt - transition(er) forventes ikke gennemført inden kontraktens/kontrakternes udløb","Kendt(e) kontraktudløbsdato(er) - genudbud ikke planlagt","Ingen kontraktudløb - genudbud ikke planlagt","Genudbud planlagt - ingen dato for udløb af nuværende kontrakt(er)","Genudbud planlagt - transition(er) forventes gennemført inden kontraktens/kontrakternes udløb","Værste score for kontrakt: 1 (dårlig) til 0 (god)","Navn på dårligste kontakt for X28","Navn på dårligste kontakt for X37"]
[null,1,2,3,4,5,6,7,8,9,10,11,12,13,14,15,16,17,18,19,20,21,22,23,24,25,26,27,28,29,30,31,32,33,34,35,36,37,38,39,40,41,42,43,44,45,46,47,48,49,50,51,52,53,54,55,56,57,58,59,60,61,62,63,64,65,66,67,68,69,70,71,72,73,74,75,76,77,78,79,80,81,82,83," ","X1","X2","X3","X4","X5","X6","X7","X8","X9","X10","X11","X12","X13","X14","X15","X16","X17","X18","X19","X20","X21","X22.1.1","X22.1.2","X22.1.3","X22.2.1","X22.2.2","X22.2.3","X22.3.1","X22.3.2","X22.3.3","X22.4.1","X22.4.2","X22.4.3","X22.5.1","X22.5.2","X22.5.3","X23","X24","X25.1","X25.2","X25.3","X25.4","X25.5","X26","X27"]

{"sheet":"Anbefalede visninger","index":4,"n_rows":306,"n_cols":17,"rows_kept":306,"cut":false,"hidden":false,"merged":[[266,11,272,12],[207,11,213,12],[3,16,15,16],[275,8,275,9],[3,1,3,14],[10,11,16,12],[39,11,45,12],[62,11,68,12],[97,11,103,12],[119,11,125,12],[141,11,147,12],[163,11,169,12],[181,11,187,12],[199,11,205,12],[222,11,228,12],[33,6,33,7]]}
[]
[null,"Anbefalede visninger til it-handlingsplanen"]
[]
[null,null,null,null,null,null,null,null,null,null,null,null,null,null,null,null,"\n\nHar du spørgsmål til brugen af datagrundlaget, kan du kontakte Ministeriernes kontor for it-styring i Digitaliseringsstyrelsen. Inden du går i gang, kan du i 'Vejledning til model for porteføljestyring af statslige it-systemer' finde hjælp til brugen af Datagrundlaget.\n\nDu finder vejledningen på Digitaliseringsstyrelsens hjemmeside www.digst.dk"]
[null,"     Anbefalede visninger til it-handlingsplanen"]
[]
[null,null,null,{"$f":"'Data til anb. visninger'!C5","v":"Visning 4.1.2.A: Tilfredshed med it-systemporteføljens forretningsunderstøttelse"}]
[null,null,null,"Vælg cellerne C10:M35 for at kopiere denne visning til it-handlingsplanen"]
[]
[]
[null,null,null,null,null,null,null,null,null,null,null,"Figuren indeholder ikke data fra alle it-systemer"]
[]
[]
[]
[]
[]
[]
[]
[]
[]
[]
[]
[]
[]
[]
[]
[]
[]
[]
[]
[]
[]
[]
[null,null,null,null,null,null,"Primære forretningsområder"]
[]
[null,null,null,{"$f":"'Data til anb. visninger'!C24","v":"Visning 4.2.2.A: Myndighedens it-systemtilstand"}]
[null,null,null,"Vælg cellerne D39:J58 for at kopiere denne visning til it-handlingsplanen"]
[]
[]
[null,null,null,null,null,null,null,null,null,null,null,"Figuren indeholder ikke data fra alle it-systemer"]
[]
[]
[]
[]
[]
[]
[]
[]
[]
[]
[]
[]
[]
[]
[]
[]
[]
[]
[null,null,null,{"$f":"'Data til anb. visninger'!I24","v":"Visning 4.2.3.A: Myndighedens vedligeholdelsesratio"}]
[null,null,null,"Vælg cellerne D62:M93 for at kopiere denne visning til it-handlingsplanen"]
[]
[]
[null,null,null,null,null,null,null,null,null,null,null,"Figuren indeholder ikke data fra alle it-systemer"]
[]
[]
[]
[]
[]
[]
[]
[null,null,null,null,null,null,null,null,"Nr.","It-system navn","Årlige total-omkostninger","Årlige vedlige-holdelses-omkostninger"]
[null,null,null,null,null,null,null,null,{"$f":"'Data til anb. visninger'!I27","v":{"$error":"#N/A"}},{"$f":"'Data til anb. visninger'!J27","v":{"$error":"#N/A"}},{"$f":"'Data til anb. visninger'!K27","v":{"$error":"#N/A"}},{"$f":"'Data til anb. visninger'!L27","v":{"$error":"#N/A"}}]
[null,null,null,null,null,null,null,null,{"$f":"'Data til anb. visninger'!I28","v":{"$error":"#N/A"}},{"$f":"'Data til anb. visninger'!J28","v":{"$error":"#N/A"}},{"$f":"'Data til anb. visninger'!K28","v":{"$error":"#N/A"}},{"$f":"'Data til anb. visninger'!L28","v":{"$error":"#N/A"}}]
[null,null,null,null,null,null,null,null,{"$f":"'Data til anb. visninger'!I29","v":{"$error":"#N/A"}},{"$f":"'Data til anb. visninger'!J29","v":{"$error":"#N/A"}},{"$f":"'Data til anb. visninger'!K29","v":{"$error":"#N/A"}},{"$f":"'Data til anb. visninger'!L29","v":{"$error":"#N/A"}}]
[null,null,null,null,null,null,null,null,{"$f":"'Data til anb. visninger'!I30","v":{"$error":"#N/A"}},{"$f":"'Data til anb. visninger'!J30","v":{"$error":"#N/A"}},{"$f":"'Data til anb. visninger'!K30","v":{"$error":"#N/A"}},{"$f":"'Data til anb. visninger'!L30","v":{"$error":"#N/A"}}]
[null,null,null,null,null,null,null,null,{"$f":"'Data til anb. visninger'!I31","v":{"$error":"#N/A"}},{"$f":"'Data til anb. visninger'!J31","v":{"$error":"#N/A"}},{"$f":"'Data til anb. visninger'!K31","v":{"$error":"#N/A"}},{"$f":"'Data til anb. visninger'!L31","v":{"$error":"#N/A"}}]
[null,null,null,null,null,null,null,null,{"$f":"'Data til anb. visninger'!I32","v":{"$error":"#N/A"}},{"$f":"'Data til anb. visninger'!J32","v":{"$error":"#N/A"}},{"$f":"'Data til anb. visninger'!K32","v":{"$error":"#N/A"}},{"$f":"'Data til anb. visninger'!L32","v":{"$error":"#N/A"}}]
[null,null,null,null,null,null,null,null,{"$f":"'Data til anb. visninger'!I33","v":{"$error":"#N/A"}},{"$f":"'Data til anb. visninger'!J33","v":{"$error":"#N/A"}},{"$f":"'Data til anb. visninger'!K33","v":{"$error":"#N/A"}},{"$f":"'Data til anb. visninger'!L33","v":{"$error":"#N/A"}}]
[null,null,null,null,null,null,null,null,{"$f":"'Data til anb. visninger'!I34","v":{"$error":"#N/A"}},{"$f":"'Data til anb. visninger'!J34","v":{"$error":"#N/A"}},{"$f":"'Data til anb. visninger'!K34","v":{"$error":"#N/A"}},{"$f":"'Data til anb. visninger'!L34","v":{"$error":"#N/A"}}]
[null,null,null,null,null,null,null,null,{"$f":"'Data til anb. visninger'!I35","v":{"$error":"#N/A"}},{"$f":"'Data til anb. visninger'!J35","v":{"$error":"#N/A"}},{"$f":"'Data til anb. visninger'!K35","v":{"$error":"#N/A"}},{"$f":"'Data til anb. visninger'!L35","v":{"$error":"#N/A"}}]
[null,null,null,null,null,null,null,null,{"$f":"'Data til anb. visninger'!I36","v":{"$error":"#N/A"}},{"$f":"'Data til anb. visninger'!J36","v":{"$error":"#N/A"}},{"$f":"'Data til anb. visninger'!K36","v":{"$error":"#N/A"}},{"$f":"'Data til anb. visninger'!L36","v":{"$error":"#N/A"}}]
[null,null,null,null,null,null,null,null,{"$f":"'Data til anb. visninger'!I37","v":{"$error":"#N/A"}},{"$f":"'Data til anb. visninger'!J37","v":{"$error":"#N/A"}},{"$f":"'Data til anb. visninger'!K37","v":{"$error":"#N/A"}},{"$f":"'Data til anb. visninger'!L37","v":{"$error":"#N/A"}}]
[null,null,null,null,null,null,null,null,{"$f":"'Data til anb. visninger'!I38","v":{"$error":"#N/A"}},{"$f":"'Data til anb. visninger'!J38","v":{"$error":"#N/A"}},{"$f":"'Data til anb. visninger'!K38","v":{"$error":"#N/A"}},{"$f":"'Data til anb. visninger'!L38","v":{"$error":"#N/A"}}]
[null,null,null,null,null,null,null,null,{"$f":"'Data til anb. visninger'!I39","v":{"$error":"#N/A"}},{"$f":"'Data til anb. visninger'!J39","v":{"$error":"#N/A"}},{"$f":"'Data til anb. visninger'!K39","v":{"$error":"#N/A"}},{"$f":"'Data til anb. visninger'!L39","v":{"$error":"#N/A"}}]
[null,null,null,null,null,null,null,null,{"$f":"'Data til anb. visninger'!I40","v":{"$error":"#N/A"}},{"$f":"'Data til anb. visninger'!J40","v":{"$error":"#N/A"}},{"$f":"'Data til anb. visninger'!K40","v":{"$error":"#N/A"}},{"$f":"'Data til anb. visninger'!L40","v":{"$error":"#N/A"}}]
[null,null,null,null,null,null,null,null,{"$f":"'Data til anb. visninger'!I41","v":{"$error":"#N/A"}},{"$f":"'Data til anb. visninger'!J41","v":{"$error":"#N/A"}},{"$f":"'Data til anb. visninger'!K41","v":{"$error":"#N/A"}},{"$f":"'Data til anb. visninger'!L41","v":{"$error":"#N/A"}}]
[null,null,null,null,null,null,null,null,{"$f":"'Data til anb. visninger'!I42","v":{"$error":"#N/A"}},{"$f":"'Data til anb. visninger'!J42","v":{"$error":"#N/A"}},{"$f":"'Data til anb. visninger'!K42","v":{"$error":"#N/A"}},{"$f":"'Data til anb. visninger'!L42","v":{"$error":"#N/A"}}]
[null,null,null,null,null,null,null,null,{"$f":"'Data til anb. visninger'!I43","v":{"$error":"#N/A"}},{"$f":"'Data til anb. visninger'!J43","v":{"$error":"#N/A"}},{"$f":"'Data til anb. visninger'!K43","v":{"$error":"#N/A"}},{"$f":"'Data til anb. visninger'!L43","v":{"$error":"#N/A"}}]
[null,null,null,null,null,null,null,null,{"$f":"'Data til anb. visninger'!I44","v":{"$error":"#N/A"}},{"$f":"'Data til anb. visninger'!J44","v":{"$error":"#N/A"}},{"$f":"'Data til anb. visninger'!K44","v":{"$error":"#N/A"}},{"$f":"'Data til anb. visninger'!L44","v":{"$error":"#N/A"}}]
[null,null,null,null,null,null,null,null,{"$f":"'Data til anb. visninger'!I45","v":{"$error":"#N/A"}},{"$f":"'Data til anb. visninger'!J45","v":{"$error":"#N/A"}},{"$f":"'Data til anb. visninger'!K45","v":{"$error":"#N/A"}},{"$f":"'Data til anb. visninger'!L45","v":{"$error":"#N/A"}}]
[null,null,null,null,null,null,null,null,{"$f":"'Data til anb. visninger'!I46","v":{"$error":"#N/A"}},{"$f":"'Data til anb. visninger'!J46","v":{"$error":"#N/A"}},{"$f":"'Data til anb. visninger'!K46","v":{"$error":"#N/A"}},{"$f":"'Data til anb. visninger'!L46","v":{"$error":"#N/A"}}]
[]
[]
[null,null,null,{"$f":"'Data til anb. visninger'!C49","v":"Visning 4.2.4.A: Ressourcer og proces for håndtering af nøglepersonsafhængigheder"}]
[null,null,null,"Vælg cellerne D97:J115 for at kopiere denne visning til it-handlingsplanen"]
[]
[]
[null,null,null,null,null,null,null,null,null,null,null,"Figuren indeholder ikke data fra alle it-systemer"]
[]
[]
[]
[]
[]
[]
[]
[]
[]
[]
[]
[]
[]
[]
[]
[]
[]
[null,null,null,{"$f":"'Data til anb. visninger'!I49","v":"Visning 4.2.5.A: Ressourcer og dokumentation"}]
[null,null,null,"Vælg cellerne D119:J137 for at kopiere denne visning til it-handlingsplanen"]
[]
[]
[null,null,null,null,null,null,null,null,null,null,null,"Figuren indeholder ikke data fra alle it-systemer"]
[]
[]
[]
[]
[]
[]
[]
[]
[]
[]
[]
[]
[]
[]
[]
[]
[]
[null,null,null,{"$f":"'Data til anb. visninger'!C56","v":"Visning 4.2.6.A: Informationssikkerhed"}]
[null,null,null,"Vælg cellerne D141:J159 for at kopiere denne visning til it-handlingsplanen"]
[]
[]
[null,null,null,null,null,null,null,null,null,null,null,"Figuren indeholder ikke data fra alle it-systemer"]
[]
[]
[]
[]
[]
[]
[]
[]
[]
[]
[]
[]
[]
[]
[]
[]
[]
[null,null,null,{"$f":"'Data til anb. visninger'!C67","v":"Visning 4.3.3.A: Myndighedens sourcingsammensætning for drift"}]
[null,null,null,"Vælg cellerne D163:J177 for at kopiere denne visning til it-handlingsplanen"]
[]
[]
[null,null,null,null,null,null,null,null,null,null,null,"Figuren indeholder ikke data fra alle it-systemer"]
[]
[]
[]
[]
[]
[]
[]
[]
[]
[]
[]
[]
[]
[null,null,null,{"$f":"'Data til anb. visninger'!I67","v":"Visning 4.3.3.B: Myndighedens sourcingsammensætning for vedligehold og udvikling"}]
[null,null,null,"Vælg cellerne D181:J195 for at kopiere denne visning til it-handlingsplanen"]
[]
[]
[null,null,null,null,null,null,null,null,null,null,null,"Figuren indeholder ikke data fra alle it-systemer"]
[]
[]
[]
[]
[]
[]
[]
[]
[]
[]
[]
[]
[]
[null,null,null,{"$f":"'Data til anb. visninger'!C74","v":"Visning 4.3.5.A: Myndighedens udbudsplan"}]
[null,null,null,"Vælg cellerne D199:L218 for at kopiere denne visning til it-handlingsplanen"]
[]
[]
[null,null,null,null,null,null,null,null,null,null,null,"Figuren indeholder ikke data fra alle it-systemer"]
[]
[]
[]
[]
[]
[]
[]
[null,null,null,null,null,null,null,null,null,null,null,"Figuren indeholder ikke alle kontrakter"]
[]
[]
[]
[]
[]
[]
[]
[]
[]
[]
[null,null,null,{"$f":"'Data til anb. visninger'!C88","v":"Visning 4.4.2.A: Forsyningssikkerhed for myndighedens samfundskritiske it-systemer"}]
[null,null,null,"Vælg cellerne E222:J262 for at kopiere denne visning til it-handlingsplanen"]
[]
[]
[null,null,null,null,null,null,null,null,null,null,null,"Figuren indeholder ikke data fra alle it-systemer"]
[]
[]
[]
[]
[]
[]
[]
[]
[]
[]
[]
[]
[]
[]
[]
[]
[]
[]
[]
[]
[]
[]
[]
[]
[]
[]
[]
[]
[]
[]
[]
[]
[]
[]
[]
[]
[]
[]
[]
[null,null,null,{"$f":"'Data til anb. visninger'!C98","v":"Visning 4.4.3.A: Forretningsunderstøttelse, teknisk tilstand og årlige omkostninger for samfundskritiske it-systemer"}]
[null,null,null,"Vælg cellerne C266:N298 for at kopiere denne visning til it-handlingsplanen"]
[]
[]
[null,null,null,null,null,null,null,null,null,null,null,"Figuren indeholder ikke data fra alle it-systemer"]
[]
[]
[]
[]
[]
[]
[]
[]
[null,null,null,null,null,null,null,null,"Samfundskritisk it-system",null,"Samlede årlige it-omkostninger","Tilfredshed\n(For.underst.)","Tilfredshed\n(Tek. tilstand)"]
[null,null,null,null,null,null,null,null,{"$f":"IF(ISERROR('Data til anb. visninger'!C101),\"\",'Data til anb. visninger'!C101)","v":""},{"$f":"IF(ISERROR('Data til anb. visninger'!E101),\"\",'Data til anb. visninger'!E101)","v":""},{"$f":"IF(ISERROR('Data til anb. visninger'!C101),\"\",'Data til anb. visninger'!D101)","v":""},{"$f":"IF(ISERROR('Data til anb. visninger'!F101),\"\",'Data til anb. visninger'!F101)","v":""},{"$f":"IF(ISERROR('Data til anb. visninger'!G101),\"\",'Data til anb. visninger'!G101)","v":""}]
[null,null,null,null,null,null,null,null,{"$f":"IF(ISERROR('Data til anb. visninger'!C102),\"\",'Data til anb. visninger'!C102)","v":""},{"$f":"IF(ISERROR('Data til anb. visninger'!E102),\"\",'Data til anb. visninger'!E102)","v":""},{"$f":"IF(ISERROR('Data til anb. visninger'!C102),\"\",'Data til anb. visninger'!D102)","v":""},{"$f":"IF(ISERROR('Data til anb. visninger'!F102),\"\",'Data til anb. visninger'!F102)","v":""},{"$f":"IF(ISERROR('Data til anb. visninger'!G102),\"\",'Data til anb. visninger'!G102)","v":""}]
[null,null,null,null,null,null,null,null,{"$f":"IF(ISERROR('Data til anb. visninger'!C103),\"\",'Data til anb. visninger'!C103)","v":""},{"$f":"IF(ISERROR('Data til anb. visninger'!E103),\"\",'Data til anb. visninger'!E103)","v":""},{"$f":"IF(ISERROR('Data til anb. visninger'!C103),\"\",'Data til anb. visninger'!D103)","v":""},{"$f":"IF(ISERROR('Data til anb. visninger'!F103),\"\",'Data til anb. visninger'!F103)","v":""},{"$f":"IF(ISERROR('Data til anb. visninger'!G103),\"\",'Data til anb. visninger'!G103)","v":""}]
[null,null,null,null,null,null,null,null,{"$f":"IF(ISERROR('Data til anb. visninger'!C104),\"\",'Data til anb. visninger'!C104)","v":""},{"$f":"IF(ISERROR('Data til anb. visninger'!E104),\"\",'Data til anb. visninger'!E104)","v":""},{"$f":"IF(ISERROR('Data til anb. visninger'!C104),\"\",'Data til anb. visninger'!D104)","v":""},{"$f":"IF(ISERROR('Data til anb. visninger'!F104),\"\",'Data til anb. visninger'!F104)","v":""},{"$f":"IF(ISERROR('Data til anb. visninger'!G104),\"\",'Data til anb. visninger'!G104)","v":""}]
[null,null,null,null,null,null,null,null,{"$f":"IF(ISERROR('Data til anb. visninger'!C105),\"\",'Data til anb. visninger'!C105)","v":""},{"$f":"IF(ISERROR('Data til anb. visninger'!E105),\"\",'Data til anb. visninger'!E105)","v":""},{"$f":"IF(ISERROR('Data til anb. visninger'!C105),\"\",'Data til anb. visninger'!D105)","v":""},{"$f":"IF(ISERROR('Data til anb. visninger'!F105),\"\",'Data til anb. visninger'!F105)","v":""},{"$f":"IF(ISERROR('Data til anb. visninger'!G105),\"\",'Data til anb. visninger'!G105)","v":""}]
[null,null,null,null,null,null,null,null,{"$f":"IF(ISERROR('Data til anb. visninger'!C106),\"\",'Data til anb. visninger'!C106)","v":""},{"$f":"IF(ISERROR('Data til anb. visninger'!E106),\"\",'Data til anb. visninger'!E106)","v":""},{"$f":"IF(ISERROR('Data til anb. visninger'!C106),\"\",'Data til anb. visninger'!D106)","v":""},{"$f":"IF(ISERROR('Data til anb. visninger'!F106),\"\",'Data til anb. visninger'!F106)","v":""},{"$f":"IF(ISERROR('Data til anb. visninger'!G106),\"\",'Data til anb. visninger'!G106)","v":""}]
[null,null,null,null,null,null,null,null,{"$f":"IF(ISERROR('Data til anb. visninger'!C107),\"\",'Data til anb. visninger'!C107)","v":""},{"$f":"IF(ISERROR('Data til anb. visninger'!E107),\"\",'Data til anb. visninger'!E107)","v":""},{"$f":"IF(ISERROR('Data til anb. visninger'!C107),\"\",'Data til anb. visninger'!D107)","v":""},{"$f":"IF(ISERROR('Data til anb. visninger'!F107),\"\",'Data til anb. visninger'!F107)","v":""},{"$f":"IF(ISERROR('Data til anb. visninger'!G107),\"\",'Data til anb. visninger'!G107)","v":""}]
[null,null,null,null,null,null,null,null,{"$f":"IF(ISERROR('Data til anb. visninger'!C108),\"\",'Data til anb. visninger'!C108)","v":""},{"$f":"IF(ISERROR('Data til anb. visninger'!E108),\"\",'Data til anb. visninger'!E108)","v":""},{"$f":"IF(ISERROR('Data til anb. visninger'!C108),\"\",'Data til anb. visninger'!D108)","v":""},{"$f":"IF(ISERROR('Data til anb. visninger'!F108),\"\",'Data til anb. visninger'!F108)","v":""},{"$f":"IF(ISERROR('Data til anb. visninger'!G108),\"\",'Data til anb. visninger'!G108)","v":""}]
[null,null,null,null,null,null,null,null,{"$f":"IF(ISERROR('Data til anb. visninger'!C109),\"\",'Data til anb. visninger'!C109)","v":""},{"$f":"IF(ISERROR('Data til anb. visninger'!E109),\"\",'Data til anb. visninger'!E109)","v":""},{"$f":"IF(ISERROR('Data til anb. visninger'!C109),\"\",'Data til anb. visninger'!D109)","v":""},{"$f":"IF(ISERROR('Data til anb. visninger'!F109),\"\",'Data til anb. visninger'!F109)","v":""},{"$f":"IF(ISERROR('Data til anb. visninger'!G109),\"\",'Data til anb. visninger'!G109)","v":""}]
[null,null,null,null,null,null,null,null,{"$f":"IF(ISERROR('Data til anb. visninger'!C110),\"\",'Data til anb. visninger'!C110)","v":""},{"$f":"IF(ISERROR('Data til anb. visninger'!E110),\"\",'Data til anb. visninger'!E110)","v":""},{"$f":"IF(ISERROR('Data til anb. visninger'!C110),\"\",'Data til anb. visninger'!D110)","v":""},{"$f":"IF(ISERROR('Data til anb. visninger'!F110),\"\",'Data til anb. visninger'!F110)","v":""},{"$f":"IF(ISERROR('Data til anb. visninger'!G110),\"\",'Data til anb. visninger'!G110)","v":""}]
[null,null,null,null,null,null,null,null,{"$f":"IF(ISERROR('Data til anb. visninger'!C111),\"\",'Data til anb. visninger'!C111)","v":""},{"$f":"IF(ISERROR('Data til anb. visninger'!E111),\"\",'Data til anb. visninger'!E111)","v":""},{"$f":"IF(ISERROR('Data til anb. visninger'!C111),\"\",'Data til anb. visninger'!D111)","v":""},{"$f":"IF(ISERROR('Data til anb. visninger'!F111),\"\",'Data til anb. visninger'!F111)","v":""},{"$f":"IF(ISERROR('Data til anb. visninger'!G111),\"\",'Data til anb. visninger'!G111)","v":""}]
[null,null,null,null,null,null,null,null,{"$f":"IF(ISERROR('Data til anb. visninger'!C112),\"\",'Data til anb. visninger'!C112)","v":""},{"$f":"IF(ISERROR('Data til anb. visninger'!E112),\"\",'Data til anb. visninger'!E112)","v":""},{"$f":"IF(ISERROR('Data til anb. visninger'!C112),\"\",'Data til anb. visninger'!D112)","v":""},{"$f":"IF(ISERROR('Data til anb. visninger'!F112),\"\",'Data til anb. visninger'!F112)","v":""},{"$f":"IF(ISERROR('Data til anb. visninger'!G112),\"\",'Data til anb. visninger'!G112)","v":""}]
[null,null,null,null,null,null,null,null,{"$f":"IF(ISERROR('Data til anb. visninger'!C113),\"\",'Data til anb. visninger'!C113)","v":""},{"$f":"IF(ISERROR('Data til anb. visninger'!E113),\"\",'Data til anb. visninger'!E113)","v":""},{"$f":"IF(ISERROR('Data til anb. visninger'!C113),\"\",'Data til anb. visninger'!D113)","v":""},{"$f":"IF(ISERROR('Data til anb. visninger'!F113),\"\",'Data til anb. visninger'!F113)","v":""},{"$f":"IF(ISERROR('Data til anb. visninger'!G113),\"\",'Data til anb. visninger'!G113)","v":""}]
[null,null,null,null,null,null,null,null,{"$f":"IF(ISERROR('Data til anb. visninger'!C114),\"\",'Data til anb. visninger'!C114)","v":""},{"$f":"IF(ISERROR('Data til anb. visninger'!E114),\"\",'Data til anb. visninger'!E114)","v":""},{"$f":"IF(ISERROR('Data til anb. visninger'!C114),\"\",'Data til anb. visninger'!D114)","v":""},{"$f":"IF(ISERROR('Data til anb. visninger'!F114),\"\",'Data til anb. visninger'!F114)","v":""},{"$f":"IF(ISERROR('Data til anb. visninger'!G114),\"\",'Data til anb. visninger'!G114)","v":""}]
[null,null,null,null,null,null,null,null,{"$f":"IF(ISERROR('Data til anb. visninger'!C115),\"\",'Data til anb. visninger'!C115)","v":""},{"$f":"IF(ISERROR('Data til anb. visninger'!E115),\"\",'Data til anb. visninger'!E115)","v":""},{"$f":"IF(ISERROR('Data til anb. visninger'!C115),\"\",'Data til anb. visninger'!D115)","v":""},{"$f":"IF(ISERROR('Data til anb. visninger'!F115),\"\",'Data til anb. visninger'!F115)","v":""},{"$f":"IF(ISERROR('Data til anb. visninger'!G115),\"\",'Data til anb. visninger'!G115)","v":""}]
[null,null,null,null,null,null,null,null,{"$f":"IF(ISERROR('Data til anb. visninger'!C116),\"\",'Data til anb. visninger'!C116)","v":""},{"$f":"IF(ISERROR('Data til anb. visninger'!E116),\"\",'Data til anb. visninger'!E116)","v":""},{"$f":"IF(ISERROR('Data til anb. visninger'!C116),\"\",'Data til anb. visninger'!D116)","v":""},{"$f":"IF(ISERROR('Data til anb. visninger'!F116),\"\",'Data til anb. visninger'!F116)","v":""},{"$f":"IF(ISERROR('Data til anb. visninger'!G116),\"\",'Data til anb. visninger'!G116)","v":""}]
[null,null,null,null,null,null,null,null,{"$f":"IF(ISERROR('Data til anb. visninger'!C117),\"\",'Data til anb. visninger'!C117)","v":""},{"$f":"IF(ISERROR('Data til anb. visninger'!E117),\"\",'Data til anb. visninger'!E117)","v":""},{"$f":"IF(ISERROR('Data til anb. visninger'!C117),\"\",'Data til anb. visninger'!D117)","v":""},{"$f":"IF(ISERROR('Data til anb. visninger'!F117),\"\",'Data til anb. visninger'!F117)","v":""},{"$f":"IF(ISERROR('Data til anb. visninger'!G117),\"\",'Data til anb. visninger'!G117)","v":""}]
[null,null,null,null,null,null,null,null,{"$f":"IF(ISERROR('Data til anb. visninger'!C118),\"\",'Data til anb. visninger'!C118)","v":""},{"$f":"IF(ISERROR('Data til anb. visninger'!E118),\"\",'Data til anb. visninger'!E118)","v":""},{"$f":"IF(ISERROR('Data til anb. visninger'!C118),\"\",'Data til anb. visninger'!D118)","v":""},{"$f":"IF(ISERROR('Data til anb. visninger'!F118),\"\",'Data til anb. visninger'!F118)","v":""},{"$f":"IF(ISERROR('Data til anb. visninger'!G118),\"\",'Data til anb. visninger'!G118)","v":""}]
[null,null,null,null,null,null,null,null,{"$f":"IF(ISERROR('Data til anb. visninger'!C119),\"\",'Data til anb. visninger'!C119)","v":""},{"$f":"IF(ISERROR('Data til anb. visninger'!E119),\"\",'Data til anb. visninger'!E119)","v":""},{"$f":"IF(ISERROR('Data til anb. visninger'!C119),\"\",'Data til anb. visninger'!D119)","v":""},{"$f":"IF(ISERROR('Data til anb. visninger'!F119),\"\",'Data til anb. visninger'!F119)","v":""},{"$f":"IF(ISERROR('Data til anb. visninger'!G119),\"\",'Data til anb. visninger'!G119)","v":""}]
[null,null,null,null,null,null,null,null,{"$f":"IF(ISERROR('Data til anb. visninger'!C120),\"\",'Data til anb. visninger'!C120)","v":""},{"$f":"IF(ISERROR('Data til anb. visninger'!E120),\"\",'Data til anb. visninger'!E120)","v":""},{"$f":"IF(ISERROR('Data til anb. visninger'!C120),\"\",'Data til anb. visninger'!D120)","v":""},{"$f":"IF(ISERROR('Data til anb. visninger'!F120),\"\",'Data til anb. visninger'!F120)","v":""},{"$f":"IF(ISERROR('Data til anb. visninger'!G120),\"\",'Data til anb. visninger'!G120)","v":""}]
[null,null,null,null,null,null,null,null,{"$f":"IF(ISERROR('Data til anb. visninger'!C121),\"\",'Data til anb. visninger'!C121)","v":""},{"$f":"IF(ISERROR('Data til anb. visninger'!E121),\"\",'Data til anb. visninger'!E121)","v":""},{"$f":"IF(ISERROR('Data til anb. visninger'!C121),\"\",'Data til anb. visninger'!D121)","v":""},{"$f":"IF(ISERROR('Data til anb. visninger'!F121),\"\",'Data til anb. visninger'!F121)","v":""},{"$f":"IF(ISERROR('Data til anb. visninger'!G121),\"\",'Data til anb. visninger'!G121)","v":""}]
[null,null,null,null,null,null,null,null,{"$f":"IF(ISERROR('Data til anb. visninger'!C122),\"\",'Data til anb. visninger'!C122)","v":""},{"$f":"IF(ISERROR('Data til anb. visninger'!E122),\"\",'Data til anb. visninger'!E122)","v":""},{"$f":"IF(ISERROR('Data til anb. visninger'!C122),\"\",'Data til anb. visninger'!D122)","v":""},{"$f":"IF(ISERROR('Data til anb. visninger'!F122),\"\",'Data til anb. visninger'!F122)","v":""},{"$f":"IF(ISERROR('Data til anb. visninger'!G122),\"\",'Data til anb. visninger'!G122)","v":""}]
[null,null,null,null,null,null,null,null,{"$f":"IF(ISERROR('Data til anb. visninger'!C123),\"\",'Data til anb. visninger'!C123)","v":""},{"$f":"IF(ISERROR('Data til anb. visninger'!E123),\"\",'Data til anb. visninger'!E123)","v":""},{"$f":"IF(ISERROR('Data til anb. visninger'!C123),\"\",'Data til anb. visninger'!D123)","v":""},{"$f":"IF(ISERROR('Data til anb. visninger'!F123),\"\",'Data til anb. visninger'!F123)","v":""},{"$f":"IF(ISERROR('Data til anb. visninger'!G123),\"\",'Data til anb. visninger'!G123)","v":""}]
[null,null,null,null,null,null,null,null,{"$f":"IF(ISERROR('Data til anb. visninger'!C124),\"\",'Data til anb. visninger'!C124)","v":""},{"$f":"IF(ISERROR('Data til anb. visninger'!E124),\"\",'Data til anb. visninger'!E124)","v":""},{"$f":"IF(ISERROR('Data til anb. visninger'!C124),\"\",'Data til anb. visninger'!D124)","v":""},{"$f":"IF(ISERROR('Data til anb. visninger'!F124),\"\",'Data til anb. visninger'!F124)","v":""},{"$f":"IF(ISERROR('Data til anb. visninger'!G124),\"\",'Data til anb. visninger'!G124)","v":""}]
[null,null,null,null,null,null,null,null,{"$f":"IF(ISERROR('Data til anb. visninger'!C125),\"\",'Data til anb. visninger'!C125)","v":""},{"$f":"IF(ISERROR('Data til anb. visninger'!E125),\"\",'Data til anb. visninger'!E125)","v":""},{"$f":"IF(ISERROR('Data til anb. visninger'!C125),\"\",'Data til anb. visninger'!D125)","v":""},{"$f":"IF(ISERROR('Data til anb. visninger'!F125),\"\",'Data til anb. visninger'!F125)","v":""},{"$f":"IF(ISERROR('Data til anb. visninger'!G125),\"\",'Data til anb. visninger'!G125)","v":""}]
[null,null,null,null,null,null,null,null,{"$f":"IF(ISERROR('Data til anb. visninger'!C126),\"\",'Data til anb. visninger'!C126)","v":""},{"$f":"IF(ISERROR('Data til anb. visninger'!E126),\"\",'Data til anb. visninger'!E126)","v":""},{"$f":"IF(ISERROR('Data til anb. visninger'!C126),\"\",'Data til anb. visninger'!D126)","v":""},{"$f":"IF(ISERROR('Data til anb. visninger'!F126),\"\",'Data til anb. visninger'!F126)","v":""},{"$f":"IF(ISERROR('Data til anb. visninger'!G126),\"\",'Data til anb. visninger'!G126)","v":""}]
[null,null,null,null,null,null,null,null,{"$f":"IF(ISERROR('Data til anb. visninger'!C127),\"\",'Data til anb. visninger'!C127)","v":""},{"$f":"IF(ISERROR('Data til anb. visninger'!E127),\"\",'Data til anb. visninger'!E127)","v":""},{"$f":"IF(ISERROR('Data til anb. visninger'!C127),\"\",'Data til anb. visninger'!D127)","v":""},{"$f":"IF(ISERROR('Data til anb. visninger'!F127),\"\",'Data til anb. visninger'!F127)","v":""},{"$f":"IF(ISERROR('Data til anb. visninger'!G127),\"\",'Data til anb. visninger'!G127)","v":""}]
[null,null,null,null,null,null,null,null,{"$f":"IF(ISERROR('Data til anb. visninger'!C128),\"\",'Data til anb. visninger'!C128)","v":""},{"$f":"IF(ISERROR('Data til anb. visninger'!E128),\"\",'Data til anb. visninger'!E128)","v":""},{"$f":"IF(ISERROR('Data til anb. visninger'!C128),\"\",'Data til anb. visninger'!D128)","v":""},{"$f":"IF(ISERROR('Data til anb. visninger'!F128),\"\",'Data til anb. visninger'!F128)","v":""},{"$f":"IF(ISERROR('Data til anb. visninger'!G128),\"\",'Data til anb. visninger'!G128)","v":""}]
[null,null,null,null,null,null,null,null,{"$f":"IF(ISERROR('Data til anb. visninger'!C129),\"\",'Data til anb. visninger'!C129)","v":""},{"$f":"IF(ISERROR('Data til anb. visninger'!E129),\"\",'Data til anb. visninger'!E129)","v":""},{"$f":"IF(ISERROR('Data til anb. visninger'!C129),\"\",'Data til anb. visninger'!D129)","v":""},{"$f":"IF(ISERROR('Data til anb. visninger'!F129),\"\",'Data til anb. visninger'!F129)","v":""},{"$f":"IF(ISERROR('Data til anb. visninger'!G129),\"\",'Data til anb. visninger'!G129)","v":""}]
[null,null,null,null,null,null,null,null,{"$f":"IF(ISERROR('Data til anb. visninger'!C130),\"\",'Data til anb. visninger'!C130)","v":""},{"$f":"IF(ISERROR('Data til anb. visninger'!E130),\"\",'Data til anb. visninger'!E130)","v":""},{"$f":"IF(ISERROR('Data til anb. visninger'!C130),\"\",'Data til anb. visninger'!D130)","v":""},{"$f":"IF(ISERROR('Data til anb. visninger'!F130),\"\",'Data til anb. visninger'!F130)","v":""},{"$f":"IF(ISERROR('Data til anb. visninger'!G130),\"\",'Data til anb. visninger'!G130)","v":""}]

{"sheet":"Yderligere visninger","index":5,"n_rows":205,"n_cols":17,"rows_kept":205,"cut":false,"hidden":false,"merged":[[28,9,28,10],[29,9,29,10],[25,9,25,10],[26,9,26,10],[27,9,27,10],[184,10,190,11],[204,10,210,11],[36,10,42,11],[61,10,67,11],[105,10,111,11],[144,10,150,11],[46,9,46,10],[47,9,47,10],[48,9,48,10],[54,9,54,10],[49,9,49,10],[50,9,50,10],[51,9,51,10],[44,8,44,10],[134,8,134,9],[135,8,135,9],[3,16,24,16],[3,1,3,14],[19,8,19,10],[20,9,20,10],[21,9,21,10],[22,9,22,10],[23,9,23,10],[24,9,24,10],[10,10,16,11],[52,9,52,10],[69,8,69,9],[53,9,53,10],[45,9,45,10],[136,8,136,9],[130,8,130,9],[131,8,131,9],[132,8,132,9],[133,8,133,9],[176,4,176,5],[177,4,177,5],[172,4,172,5],[173,4,173,5],[174,4,174,5],[169,4,169,5],[170,4,170,5],[171,4,171,5],[129,8,129,9],[175,4,175,5],[134,4,134,5],[135,4,135,5],[136,4,136,5],[137,4,137,5],[129,4,129,5],[130,4,130,5],[131,4,131,5],[132,4,132,5],[133,4,133,5],[137,8,137,9]]}
[]
[null,"Yderligere visninger til it-handlingsplanen"]
[]
[null,null,null,null,null,null,null,null,null,null,null,null,null,null,null,null,"\n\nHar du spørgsmål til brugen af datagrundlaget, kan du kontakte Ministeriernes kontor for it-styring i Digitaliseringsstyrelsen. Inden du går i gang, kan du i 'Vejledning til model for porteføljestyring af statslige it-systemer' finde hjælp til brugen af datagrundlaget.\n\nDu finder vejledningen på Digitaliseringsstyrelsens hjemmeside www.digst.dk"]
[null,null,"   Yderligere visninger til it-handlingsplanen"]
[]
[null,null,null,{"$f":"'Data til yd. visninger'!C5","v":"Visning I: Planlagte it-systemrettede investeringer sammenholdt med tilfredshed med forretningsunderstøttelsen"}]
[null,null,null,"Vælg cellerne D10:M32 for at kopiere denne visning til it-handlingsplanen"]
[]
[]
[null,null,null,null,null,null,null,null,null,null,"Figuren indeholder ikke data fra alle it-systemer"]
[]
[]
[]
[]
[]
[]
[]
[]
[null,null,null,null,null,null,null,null,"Primære forretningsområder",null,null,"Forventede investeringer","Vægtet tilfredshed1 (For.underst.)"]
[null,null,null,null,null,null,null,null,{"$f":"IF(J21=\"\",\"\",IFERROR('Data til yd. visninger'!C8,\"\"))","v":""},{"$f":"IFERROR('Data til yd. visninger'!D8,\"\")","v":""},null,{"$f":"IFERROR('Data til yd. visninger'!E8,\"\")","v":""},{"$f":"IFERROR('Data til yd. visninger'!F8,\"\")","v":""}]
[null,null,null,null,null,null,null,null,{"$f":"IF(J22=\"\",\"\",IFERROR('Data til yd. visninger'!C9,\"\"))","v":""},{"$f":"IFERROR('Data til yd. visninger'!D9,\"\")","v":""},null,{"$f":"IFERROR('Data til yd. visninger'!E9,\"\")","v":""},{"$f":"IFERROR('Data til yd. visninger'!F9,\"\")","v":""}]
[null,null,null,null,null,null,null,null,{"$f":"IF(J23=\"\",\"\",IFERROR('Data til yd. visninger'!C10,\"\"))","v":""},{"$f":"IFERROR('Data til yd. visninger'!D10,\"\")","v":""},null,{"$f":"IFERROR('Data til yd. visninger'!E10,\"\")","v":""},{"$f":"IFERROR('Data til yd. visninger'!F10,\"\")","v":""}]
[null,null,null,null,null,null,null,null,{"$f":"IF(J24=\"\",\"\",IFERROR('Data til yd. visninger'!C11,\"\"))","v":""},{"$f":"IFERROR('Data til yd. visninger'!D11,\"\")","v":""},null,{"$f":"IFERROR('Data til yd. visninger'!E11,\"\")","v":""},{"$f":"IFERROR('Data til yd. visninger'!F11,\"\")","v":""}]
[null,null,null,null,null,null,null,null,{"$f":"IF(J25=\"\",\"\",IFERROR('Data til yd. visninger'!C12,\"\"))","v":""},{"$f":"IFERROR('Data til yd. visninger'!D12,\"\")","v":""},null,{"$f":"IFERROR('Data til yd. visninger'!E12,\"\")","v":""},{"$f":"IFERROR('Data til yd. visninger'!F12,\"\")","v":""}]
[null,null,null,null,null,null,null,null,{"$f":"IF(J26=\"\",\"\",IFERROR('Data til yd. visninger'!C13,\"\"))","v":""},{"$f":"IFERROR('Data til yd. visninger'!D13,\"\")","v":""},null,{"$f":"IFERROR('Data til yd. visninger'!E13,\"\")","v":""},{"$f":"IFERROR('Data til yd. visninger'!F13,\"\")","v":""}]
[null,null,null,null,null,null,null,null,{"$f":"IF(J27=\"\",\"\",IFERROR('Data til yd. visninger'!C14,\"\"))","v":""},{"$f":"IFERROR('Data til yd. visninger'!D14,\"\")","v":""},null,{"$f":"IFERROR('Data til yd. visninger'!E14,\"\")","v":""},{"$f":"IFERROR('Data til yd. visninger'!F14,\"\")","v":""}]
[null,null,null,null,null,null,null,null,{"$f":"IF(J28=\"\",\"\",IFERROR('Data til yd. visninger'!C15,\"\"))","v":""},{"$f":"IFERROR('Data til yd. visninger'!D15,\"\")","v":""},null,{"$f":"IFERROR('Data til yd. visninger'!E15,\"\")","v":""},{"$f":"IFERROR('Data til yd. visninger'!F15,\"\")","v":""}]
[]
[]
[]
[]
[null,null,null,{"$f":"'Data til yd. visninger'!C18","v":"Visning II: Planlagte it-systemrettede investeringer sammenholdt med tilfredshed med it-systemernes tekniske tilstand"}]
[null,null,null,"Vælg cellerne D36:M57 for at kopiere denne visning til it-handlingsplanen"]
[]
[]
[null,null,null,null,null,null,null,null,null,null,"Figuren indeholder ikke data fra alle it-systemer"]
[]
[]
[]
[]
[]
[]
[]
[null,null,null,null,null,null,null,null,"Primære forretningsområder",null,null,"Forventede investeringer","Vægtet tilfredshed1 (Tek. tilstand)"]
[null,null,null,null,null,null,null,null,{"$f":"IF(J46=\"\",\"\",IFERROR('Data til yd. visninger'!C21,\"\"))","v":""},{"$f":"IFERROR('Data til yd. visninger'!D21,\"\")","v":""},{"$f":"IFERROR('Data til yd. visninger'!E21,\"\")","v":""},{"$f":"IFERROR('Data til yd. visninger'!E21,\"\")","v":""},{"$f":"IFERROR('Data til yd. visninger'!F21,\"\")","v":""}]
[null,null,null,null,null,null,null,null,{"$f":"IF(J47=\"\",\"\",IFERROR('Data til yd. visninger'!C22,\"\"))","v":""},{"$f":"IFERROR('Data til yd. visninger'!D22,\"\")","v":""},{"$f":"IFERROR('Data til yd. visninger'!E22,\"\")","v":""},{"$f":"IFERROR('Data til yd. visninger'!E22,\"\")","v":""},{"$f":"IFERROR('Data til yd. visninger'!F22,\"\")","v":""}]
[null,null,null,null,null,null,null,null,{"$f":"IF(J48=\"\",\"\",IFERROR('Data til yd. visninger'!C23,\"\"))","v":""},{"$f":"IFERROR('Data til yd. visninger'!D23,\"\")","v":""},{"$f":"IFERROR('Data til yd. visninger'!E23,\"\")","v":""},{"$f":"IFERROR('Data til yd. visninger'!E23,\"\")","v":""},{"$f":"IFERROR('Data til yd. visninger'!F23,\"\")","v":""}]
[null,null,null,null,null,null,null,null,{"$f":"IF(J49=\"\",\"\",IFERROR('Data til yd. visninger'!C24,\"\"))","v":""},{"$f":"IFERROR('Data til yd. visninger'!D24,\"\")","v":""},{"$f":"IFERROR('Data til yd. visninger'!E24,\"\")","v":""},{"$f":"IFERROR('Data til yd. visninger'!E24,\"\")","v":""},{"$f":"IFERROR('Data til yd. visninger'!F24,\"\")","v":""}]
[null,null,null,null,null,null,null,null,{"$f":"IF(J50=\"\",\"\",IFERROR('Data til yd. visninger'!C25,\"\"))","v":""},{"$f":"IFERROR('Data til yd. visninger'!D25,\"\")","v":""},{"$f":"IFERROR('Data til yd. visninger'!E25,\"\")","v":""},{"$f":"IFERROR('Data til yd. visninger'!E25,\"\")","v":""},{"$f":"IFERROR('Data til yd. visninger'!F25,\"\")","v":""}]
[null,null,null,null,null,null,null,null,{"$f":"IF(J51=\"\",\"\",IFERROR('Data til yd. visninger'!C26,\"\"))","v":""},{"$f":"IFERROR('Data til yd. visninger'!D26,\"\")","v":""},{"$f":"IFERROR('Data til yd. visninger'!E26,\"\")","v":""},{"$f":"IFERROR('Data til yd. visninger'!E26,\"\")","v":""},{"$f":"IFERROR('Data til yd. visninger'!F26,\"\")","v":""}]
[null,null,null,null,null,null,null,null,{"$f":"IF(J52=\"\",\"\",IFERROR('Data til yd. visninger'!C27,\"\"))","v":""},{"$f":"IFERROR('Data til yd. visninger'!D27,\"\")","v":""},{"$f":"IFERROR('Data til yd. visninger'!E27,\"\")","v":""},{"$f":"IFERROR('Data til yd. visninger'!E27,\"\")","v":""},{"$f":"IFERROR('Data til yd. visninger'!F27,\"\")","v":""}]
[null,null,null,null,null,null,null,null,{"$f":"IF(J53=\"\",\"\",IFERROR('Data til yd. visninger'!C28,\"\"))","v":""},{"$f":"IFERROR('Data til yd. visninger'!D28,\"\")","v":""},{"$f":"IFERROR('Data til yd. visninger'!E28,\"\")","v":""},{"$f":"IFERROR('Data til yd. visninger'!E28,\"\")","v":""},{"$f":"IFERROR('Data til yd. visninger'!F28,\"\")","v":""}]
[]
[]
[]
[]
[null,null,null,{"$f":"'Data til yd. visninger'!C31","v":"Visning III: Forretningsunderstøttelse, teknisk tilstand og forventede investeringer for samfundskritiske it-systemer"}]
[null,null,null,"Vælg cellerne C61:M101 for at kopiere denne visning til it-handlingsplanen"]
[]
[]
[null,null,null,null,null,null,null,null,null,null,"Figuren indeholder ikke data fra alle it-systemer"]
[]
[]
[]
[]
[]
[]
[]
[null,null,null,null,null,null,null,null,"Samfundskritisk it-system",null,"Forventede investeringer","Tilfredshed (For.underst.)","Tilfredshed\n(Tek. tilstand)"]
[null,null,null,null,null,null,null,null,{"$f":"IF(ISERROR(CHAR(64+'Data til yd. visninger'!C34)),\"\",CHAR(64+'Data til yd. visninger'!C34))","v":""},{"$f":"IF(ISERROR('Data til yd. visninger'!E34),\"\",'Data til yd. visninger'!E34)","v":""},{"$f":"IF(ISERROR('Data til yd. visninger'!D34),\"\",'Data til yd. visninger'!D34)","v":""},{"$f":"IF(ISERROR('Data til yd. visninger'!F34),\"\",'Data til yd. visninger'!F34)","v":""},{"$f":"IF(ISERROR('Data til yd. visninger'!G34),\"\",'Data til yd. visninger'!G34)","v":""}]
[null,null,null,null,null,null,null,null,{"$f":"IF(ISERROR(CHAR(64+'Data til yd. visninger'!C35)),\"\",CHAR(64+'Data til yd. visninger'!C35))","v":""},{"$f":"IF(ISERROR('Data til yd. visninger'!E35),\"\",'Data til yd. visninger'!E35)","v":""},{"$f":"IF(ISERROR('Data til yd. visninger'!D35),\"\",'Data til yd. visninger'!D35)","v":""},{"$f":"IF(ISERROR('Data til yd. visninger'!F35),\"\",'Data til yd. visninger'!F35)","v":""},{"$f":"IF(ISERROR('Data til yd. visninger'!G35),\"\",'Data til yd. visninger'!G35)","v":""}]
[null,null,null,null,null,null,null,null,{"$f":"IF(ISERROR(CHAR(64+'Data til yd. visninger'!C36)),\"\",CHAR(64+'Data til yd. visninger'!C36))","v":""},{"$f":"IF(ISERROR('Data til yd. visninger'!E36),\"\",'Data til yd. visninger'!E36)","v":""},{"$f":"IF(ISERROR('Data til yd. visninger'!D36),\"\",'Data til yd. visninger'!D36)","v":""},{"$f":"IF(ISERROR('Data til yd. visninger'!F36),\"\",'Data til yd. visninger'!F36)","v":""},{"$f":"IF(ISERROR('Data til yd. visninger'!G36),\"\",'Data til yd. visninger'!G36)","v":""}]
[null,null,null,null,null,null,null,null,{"$f":"IF(ISERROR(CHAR(64+'Data til yd. visninger'!C37)),\"\",CHAR(64+'Data til yd. visninger'!C37))","v":""},{"$f":"IF(ISERROR('Data til yd. visninger'!E37),\"\",'Data til yd. visninger'!E37)","v":""},{"$f":"IF(ISERROR('Data til yd. visninger'!D37),\"\",'Data til yd. visninger'!D37)","v":""},{"$f":"IF(ISERROR('Data til yd. visninger'!F37),\"\",'Data til yd. visninger'!F37)","v":""},{"$f":"IF(ISERROR('Data til yd. visninger'!G37),\"\",'Data til yd. visninger'!G37)","v":""}]
[null,null,null,null,null,null,null,null,{"$f":"IF(ISERROR(CHAR(64+'Data til yd. visninger'!C38)),\"\",CHAR(64+'Data til yd. visninger'!C38))","v":""},{"$f":"IF(ISERROR('Data til yd. visninger'!E38),\"\",'Data til yd. visninger'!E38)","v":""},{"$f":"IF(ISERROR('Data til yd. visninger'!D38),\"\",'Data til yd. visninger'!D38)","v":""},{"$f":"IF(ISERROR('Data til yd. visninger'!F38),\"\",'Data til yd. visninger'!F38)","v":""},{"$f":"IF(ISERROR('Data til yd. visninger'!G38),\"\",'Data til yd. visninger'!G38)","v":""}]
[null,null,null,null,null,null,null,null,{"$f":"IF(ISERROR(CHAR(64+'Data til yd. visninger'!C39)),\"\",CHAR(64+'Data til yd. visninger'!C39))","v":""},{"$f":"IF(ISERROR('Data til yd. visninger'!E39),\"\",'Data til yd. visninger'!E39)","v":""},{"$f":"IF(ISERROR('Data til yd. visninger'!D39),\"\",'Data til yd. visninger'!D39)","v":""},{"$f":"IF(ISERROR('Data til yd. visninger'!F39),\"\",'Data til yd. visninger'!F39)","v":""},{"$f":"IF(ISERROR('Data til yd. visninger'!G39),\"\",'Data til yd. visninger'!G39)","v":""}]
[null,null,null,null,null,null,null,null,{"$f":"IF(ISERROR(CHAR(64+'Data til yd. visninger'!C40)),\"\",CHAR(64+'Data til yd. visninger'!C40))","v":""},{"$f":"IF(ISERROR('Data til yd. visninger'!E40),\"\",'Data til yd. visninger'!E40)","v":""},{"$f":"IF(ISERROR('Data til yd. visninger'!D40),\"\",'Data til yd. visninger'!D40)","v":""},{"$f":"IF(ISERROR('Data til yd. visninger'!F40),\"\",'Data til yd. visninger'!F40)","v":""},{"$f":"IF(ISERROR('Data til yd. visninger'!G40),\"\",'Data til yd. visninger'!G40)","v":""}]
[null,null,null,null,null,null,null,null,{"$f":"IF(ISERROR(CHAR(64+'Data til yd. visninger'!C41)),\"\",CHAR(64+'Data til yd. visninger'!C41))","v":""},{"$f":"IF(ISERROR('Data til yd. visninger'!E41),\"\",'Data til yd. visninger'!E41)","v":""},{"$f":"IF(ISERROR('Data til yd. visninger'!D41),\"\",'Data til yd. visninger'!D41)","v":""},{"$f":"IF(ISERROR('Data til yd. visninger'!F41),\"\",'Data til yd. visninger'!F41)","v":""},{"$f":"IF(ISERROR('Data til yd. visninger'!G41),\"\",'Data til yd. visninger'!G41)","v":""}]
[null,null,null,null,null,null,null,null,{"$f":"IF(ISERROR(CHAR(64+'Data til yd. visninger'!C42)),\"\",CHAR(64+'Data til yd. visninger'!C42))","v":""},{"$f":"IF(ISERROR('Data til yd. visninger'!E42),\"\",'Data til yd. visninger'!E42)","v":""},{"$f":"IF(ISERROR('Data til yd. visninger'!D42),\"\",'Data til yd. visninger'!D42)","v":""},{"$f":"IF(ISERROR('Data til yd. visninger'!F42),\"\",'Data til yd. visninger'!F42)","v":""},{"$f":"IF(ISERROR('Data til yd. visninger'!G42),\"\",'Data til yd. visninger'!G42)","v":""}]
[null,null,null,null,null,null,null,null,{"$f":"IF(ISERROR(CHAR(64+'Data til yd. visninger'!C43)),\"\",CHAR(64+'Data til yd. visninger'!C43))","v":""},{"$f":"IF(ISERROR('Data til yd. visninger'!E43),\"\",'Data til yd. visninger'!E43)","v":""},{"$f":"IF(ISERROR('Data til yd. visninger'!D43),\"\",'Data til yd. visninger'!D43)","v":""},{"$f":"IF(ISERROR('Data til yd. visninger'!F43),\"\",'Data til yd. visninger'!F43)","v":""},{"$f":"IF(ISERROR('Data til yd. visninger'!G43),\"\",'Data til yd. visninger'!G43)","v":""}]
[null,null,null,null,null,null,null,null,{"$f":"IF(ISERROR(CHAR(64+'Data til yd. visninger'!C44)),\"\",CHAR(64+'Data til yd. visninger'!C44))","v":""},{"$f":"IF(ISERROR('Data til yd. visninger'!E44),\"\",'Data til yd. visninger'!E44)","v":""},{"$f":"IF(ISERROR('Data til yd. visninger'!D44),\"\",'Data til yd. visninger'!D44)","v":""},{"$f":"IF(ISERROR('Data til yd. visninger'!F44),\"\",'Data til yd. visninger'!F44)","v":""},{"$f":"IF(ISERROR('Data til yd. visninger'!G44),\"\",'Data til yd. visninger'!G44)","v":""}]
[null,null,null,null,null,null,null,null,{"$f":"IF(ISERROR(CHAR(64+'Data til yd. visninger'!C45)),\"\",CHAR(64+'Data til yd. visninger'!C45))","v":""},{"$f":"IF(ISERROR('Data til yd. visninger'!E45),\"\",'Data til yd. visninger'!E45)","v":""},{"$f":"IF(ISERROR('Data til yd. visninger'!D45),\"\",'Data til yd. visninger'!D45)","v":""},{"$f":"IF(ISERROR('Data til yd. visninger'!F45),\"\",'Data til yd. visninger'!F45)","v":""},{"$f":"IF(ISERROR('Data til yd. visninger'!G45),\"\",'Data til yd. visninger'!G45)","v":""}]
[null,null,null,null,null,null,null,null,{"$f":"IF(ISERROR(CHAR(64+'Data til yd. visninger'!C46)),\"\",CHAR(64+'Data til yd. visninger'!C46))","v":""},{"$f":"IF(ISERROR('Data til yd. visninger'!E46),\"\",'Data til yd. visninger'!E46)","v":""},{"$f":"IF(ISERROR('Data til yd. visninger'!D46),\"\",'Data til yd. visninger'!D46)","v":""},{"$f":"IF(ISERROR('Data til yd. visninger'!F46),\"\",'Data til yd. visninger'!F46)","v":""},{"$f":"IF(ISERROR('Data til yd. visninger'!G46),\"\",'Data til yd. visninger'!G46)","v":""}]
[null,null,null,null,null,null,null,null,{"$f":"IF(ISERROR(CHAR(64+'Data til yd. visninger'!C47)),\"\",CHAR(64+'Data til yd. visninger'!C47))","v":""},{"$f":"IF(ISERROR('Data til yd. visninger'!E47),\"\",'Data til yd. visninger'!E47)","v":""},{"$f":"IF(ISERROR('Data til yd. visninger'!D47),\"\",'Data til yd. visninger'!D47)","v":""},{"$f":"IF(ISERROR('Data til yd. visninger'!F47),\"\",'Data til yd. visninger'!F47)","v":""},{"$f":"IF(ISERROR('Data til yd. visninger'!G47),\"\",'Data til yd. visninger'!G47)","v":""}]
[null,null,null,null,null,null,null,null,{"$f":"IF(ISERROR(CHAR(64+'Data til yd. visninger'!C48)),\"\",CHAR(64+'Data til yd. visninger'!C48))","v":""},{"$f":"IF(ISERROR('Data til yd. visninger'!E48),\"\",'Data til yd. visninger'!E48)","v":""},{"$f":"IF(ISERROR('Data til yd. visninger'!D48),\"\",'Data til yd. visninger'!D48)","v":""},{"$f":"IF(ISERROR('Data til yd. visninger'!F48),\"\",'Data til yd. visninger'!F48)","v":""},{"$f":"IF(ISERROR('Data til yd. visninger'!G48),\"\",'Data til yd. visninger'!G48)","v":""}]
[null,null,null,null,null,null,null,null,{"$f":"IF(ISERROR(CHAR(64+'Data til yd. visninger'!C49)),\"\",CHAR(64+'Data til yd. visninger'!C49))","v":""},{"$f":"IF(ISERROR('Data til yd. visninger'!E49),\"\",'Data til yd. visninger'!E49)","v":""},{"$f":"IF(ISERROR('Data til yd. visninger'!D49),\"\",'Data til yd. visninger'!D49)","v":""},{"$f":"IF(ISERROR('Data til yd. visninger'!F49),\"\",'Data til yd. visninger'!F49)","v":""},{"$f":"IF(ISERROR('Data til yd. visninger'!G49),\"\",'Data til yd. visninger'!G49)","v":""}]
[null,null,null,null,null,null,null,null,{"$f":"IF(ISERROR(CHAR(64+'Data til yd. visninger'!C50)),\"\",CHAR(64+'Data til yd. visninger'!C50))","v":""},{"$f":"IF(ISERROR('Data til yd. visninger'!E50),\"\",'Data til yd. visninger'!E50)","v":""},{"$f":"IF(ISERROR('Data til yd. visninger'!D50),\"\",'Data til yd. visninger'!D50)","v":""},{"$f":"IF(ISERROR('Data til yd. visninger'!F50),\"\",'Data til yd. visninger'!F50)","v":""},{"$f":"IF(ISERROR('Data til yd. visninger'!G50),\"\",'Data til yd. visninger'!G50)","v":""}]
[null,null,null,null,null,null,null,null,{"$f":"IF(ISERROR(CHAR(64+'Data til yd. visninger'!C51)),\"\",CHAR(64+'Data til yd. visninger'!C51))","v":""},{"$f":"IF(ISERROR('Data til yd. visninger'!E51),\"\",'Data til yd. visninger'!E51)","v":""},{"$f":"IF(ISERROR('Data til yd. visninger'!D51),\"\",'Data til yd. visninger'!D51)","v":""},{"$f":"IF(ISERROR('Data til yd. visninger'!F51),\"\",'Data til yd. visninger'!F51)","v":""},{"$f":"IF(ISERROR('Data til yd. visninger'!G51),\"\",'Data til yd. visninger'!G51)","v":""}]
[null,null,null,null,null,null,null,null,{"$f":"IF(ISERROR(CHAR(64+'Data til yd. visninger'!C52)),\"\",CHAR(64+'Data til yd. visninger'!C52))","v":""},{"$f":"IF(ISERROR('Data til yd. visninger'!E52),\"\",'Data til yd. visninger'!E52)","v":""},{"$f":"IF(ISERROR('Data til yd. visninger'!D52),\"\",'Data til yd. visninger'!D52)","v":""},{"$f":"IF(ISERROR('Data til yd. visninger'!F52),\"\",'Data til yd. visninger'!F52)","v":""},{"$f":"IF(ISERROR('Data til yd. visninger'!G52),\"\",'Data til yd. visninger'!G52)","v":""}]
[null,null,null,null,null,null,null,null,{"$f":"IF(ISERROR(CHAR(64+'Data til yd. visninger'!C53)),\"\",CHAR(64+'Data til yd. visninger'!C53))","v":""},{"$f":"IF(ISERROR('Data til yd. visninger'!E53),\"\",'Data til yd. visninger'!E53)","v":""},{"$f":"IF(ISERROR('Data til yd. visninger'!D53),\"\",'Data til yd. visninger'!D53)","v":""},{"$f":"IF(ISERROR('Data til yd. visninger'!F53),\"\",'Data til yd. visninger'!F53)","v":""},{"$f":"IF(ISERROR('Data til yd. visninger'!G53),\"\",'Data til yd. visninger'!G53)","v":""}]
[null,null,null,null,null,null,null,null,{"$f":"IF(ISERROR(CHAR(64+'Data til yd. visninger'!C54)),\"\",CHAR(64+'Data til yd. visninger'!C54))","v":""},{"$f":"IF(ISERROR('Data til yd. visninger'!E54),\"\",'Data til yd. visninger'!E54)","v":""},{"$f":"IF(ISERROR('Data til yd. visninger'!D54),\"\",'Data til yd. visninger'!D54)","v":""},{"$f":"IF(ISERROR('Data til yd. visninger'!F54),\"\",'Data til yd. visninger'!F54)","v":""},{"$f":"IF(ISERROR('Data til yd. visninger'!G54),\"\",'Data til yd. visninger'!G54)","v":""}]
[null,null,null,null,null,null,null,null,{"$f":"IF(ISERROR(CHAR(64+'Data til yd. visninger'!C55)),\"\",CHAR(64+'Data til yd. visninger'!C55))","v":""},{"$f":"IF(ISERROR('Data til yd. visninger'!E55),\"\",'Data til yd. visninger'!E55)","v":""},{"$f":"IF(ISERROR('Data til yd. visninger'!D55),\"\",'Data til yd. visninger'!D55)","v":""},{"$f":"IF(ISERROR('Data til yd. visninger'!F55),\"\",'Data til yd. visninger'!F55)","v":""},{"$f":"IF(ISERROR('Data til yd. visninger'!G55),\"\",'Data til yd. visninger'!G55)","v":""}]
[null,null,null,null,null,null,null,null,{"$f":"IF(ISERROR(CHAR(64+'Data til yd. visninger'!C56)),\"\",CHAR(64+'Data til yd. visninger'!C56))","v":""},{"$f":"IF(ISERROR('Data til yd. visninger'!E56),\"\",'Data til yd. visninger'!E56)","v":""},{"$f":"IF(ISERROR('Data til yd. visninger'!D56),\"\",'Data til yd. visninger'!D56)","v":""},{"$f":"IF(ISERROR('Data til yd. visninger'!F56),\"\",'Data til yd. visninger'!F56)","v":""},{"$f":"IF(ISERROR('Data til yd. visninger'!G56),\"\",'Data til yd. visninger'!G56)","v":""}]
[null,null,null,null,null,null,null,null,{"$f":"IF(ISERROR(CHAR(64+'Data til yd. visninger'!C57)),\"\",CHAR(64+'Data til yd. visninger'!C57))","v":""},{"$f":"IF(ISERROR('Data til yd. visninger'!E57),\"\",'Data til yd. visninger'!E57)","v":""},{"$f":"IF(ISERROR('Data til yd. visninger'!D57),\"\",'Data til yd. visninger'!D57)","v":""},{"$f":"IF(ISERROR('Data til yd. visninger'!F57),\"\",'Data til yd. visninger'!F57)","v":""},{"$f":"IF(ISERROR('Data til yd. visninger'!G57),\"\",'Data til yd. visninger'!G57)","v":""}]
[null,null,null,null,null,null,null,null,{"$f":"IF(ISERROR(CHAR(64+'Data til yd. visninger'!C58)),\"\",CHAR(64+'Data til yd. visninger'!C58))","v":""},{"$f":"IF(ISERROR('Data til yd. visninger'!E58),\"\",'Data til yd. visninger'!E58)","v":""},{"$f":"IF(ISERROR('Data til yd. visninger'!D58),\"\",'Data til yd. visninger'!D58)","v":""},{"$f":"IF(ISERROR('Data til yd. visninger'!F58),\"\",'Data til yd. visninger'!F58)","v":""},{"$f":"IF(ISERROR('Data til yd. visninger'!G58),\"\",'Data til yd. visninger'!G58)","v":""}]
[null,null,null,null,null,null,null,null,{"$f":"IF(ISERROR(CHAR(64+'Data til yd. visninger'!C59)),\"\",CHAR(64+'Data til yd. visninger'!C59))","v":""},{"$f":"IF(ISERROR('Data til yd. visninger'!E59),\"\",'Data til yd. visninger'!E59)","v":""},{"$f":"IF(ISERROR('Data til yd. visninger'!D59),\"\",'Data til yd. visninger'!D59)","v":""},{"$f":"IF(ISERROR('Data til yd. visninger'!F59),\"\",'Data til yd. visninger'!F59)","v":""},{"$f":"IF(ISERROR('Data til yd. visninger'!G59),\"\",'Data til yd. visninger'!G59)","v":""}]
[null,null,null,null,null,null,null,null,{"$f":"IF(ISERROR(CHAR(64+'Data til yd. visninger'!C60)),\"\",CHAR(64+'Data til yd. visninger'!C60))","v":""},{"$f":"IF(ISERROR('Data til yd. visninger'!E60),\"\",'Data til yd. visninger'!E60)","v":""},{"$f":"IF(ISERROR('Data til yd. visninger'!D60),\"\",'Data til yd. visninger'!D60)","v":""},{"$f":"IF(ISERROR('Data til yd. visninger'!F60),\"\",'Data til yd. visninger'!F60)","v":""},{"$f":"IF(ISERROR('Data til yd. visninger'!G60),\"\",'Data til yd. visninger'!G60)","v":""}]
[null,null,null,null,null,null,null,null,{"$f":"IF(ISERROR(CHAR(64+'Data til yd. visninger'!C61)),\"\",CHAR(64+'Data til yd. visninger'!C61))","v":""},{"$f":"IF(ISERROR('Data til yd. visninger'!E61),\"\",'Data til yd. visninger'!E61)","v":""},{"$f":"IF(ISERROR('Data til yd. visninger'!D61),\"\",'Data til yd. visninger'!D61)","v":""},{"$f":"IF(ISERROR('Data til yd. visninger'!F61),\"\",'Data til yd. visninger'!F61)","v":""},{"$f":"IF(ISERROR('Data til yd. visninger'!G61),\"\",'Data til yd. visninger'!G61)","v":""}]
[null,null,null,null,null,null,null,null,{"$f":"IF(ISERROR(CHAR(64+'Data til yd. visninger'!C62)),\"\",CHAR(64+'Data til yd. visninger'!C62))","v":""},{"$f":"IF(ISERROR('Data til yd. visninger'!E62),\"\",'Data til yd. visninger'!E62)","v":""},{"$f":"IF(ISERROR('Data til yd. visninger'!D62),\"\",'Data til yd. visninger'!D62)","v":""},{"$f":"IF(ISERROR('Data til yd. visninger'!F62),\"\",'Data til yd. visninger'!F62)","v":""},{"$f":"IF(ISERROR('Data til yd. visninger'!G62),\"\",'Data til yd. visninger'!G62)","v":""}]
[null,null,null,null,null,null,null,null,{"$f":"IF(ISERROR(CHAR(64+'Data til yd. visninger'!C63)),\"\",CHAR(64+'Data til yd. visninger'!C63))","v":""},{"$f":"IF(ISERROR('Data til yd. visninger'!E63),\"\",'Data til yd. visninger'!E63)","v":""},{"$f":"IF(ISERROR('Data til yd. visninger'!D63),\"\",'Data til yd. visninger'!D63)","v":""},{"$f":"IF(ISERROR('Data til yd. visninger'!F63),\"\",'Data til yd. visninger'!F63)","v":""},{"$f":"IF(ISERROR('Data til yd. visninger'!G63),\"\",'Data til yd. visninger'!G63)","v":""}]
[]
[null,null,null,{"$f":"'Data til yd. visninger'!C66","v":"Visning IV: Interne omk. og omk. til drift/vedligehold/udvikling pr. forretningsområde"}]
[null,null,null,"Vælg cellerne D105:L142 for at kopiere denne visning til it-handlingsplanen"]
[]
[]
[null,null,null,null,null,null,null,null,null,null,"Figuren indeholder ikke data fra alle it-systemer"]
[]
[]
[]
[]
[]
[]
[]
[]
[]
[]
[]
[]
[]
[]
[]
[]
[]
[]
[]
[]
[]
[]
[]
[null,null,null,"Rangering","Forretningsområde",null,"Eksterne omkostninger til drift og vedligehold (i mio. kr.)","Interne personale-omkostninger til drift og vedligehold (i mio. kr.)","Eksterne og interne omkostninger til udvikling (i mio. kr.)"]
[null,null,null,{"$f":"IFERROR(IF(ISERROR('Data til yd. visninger'!C69),\"\",RANK('Data til yd. visninger'!C69,'Data til yd. visninger'!$C$69:$C$76,0)),\"\")","v":1},{"$f":"IFERROR(VLOOKUP($D131,'Data til yd. visninger'!$C$69:$G$76,2,0),\"\")","v":""},null,{"$f":"IFERROR(VLOOKUP($D131,'Data til yd. visninger'!$C$69:$G$76,3,0),\"\")","v":""},{"$f":"IFERROR(VLOOKUP($D131,'Data til yd. visninger'!$C$69:$G$76,4,0),\"\")","v":""},{"$f":"IFERROR(VLOOKUP($D131,'Data til yd. visninger'!$C$69:$G$76,5,0),\"\")","v":""}]
[null,null,null,{"$f":"IFERROR(IF(ISERROR('Data til yd. visninger'!C70),\"\",RANK('Data til yd. visninger'!C70,'Data til yd. visninger'!$C$69:$C$76,0)),\"\")","v":""},{"$f":"IFERROR(VLOOKUP($D132,'Data til yd. visninger'!$C$69:$G$76,2,0),\"\")","v":""},null,{"$f":"IFERROR(VLOOKUP($D132,'Data til yd. visninger'!$C$69:$G$76,3,0),\"\")","v":""},{"$f":"IFERROR(VLOOKUP($D132,'Data til yd. visninger'!$C$69:$G$76,4,0),\"\")","v":""},{"$f":"IFERROR(VLOOKUP($D132,'Data til yd. visninger'!$C$69:$G$76,5,0),\"\")","v":""}]
[null,null,null,{"$f":"IFERROR(IF(ISERROR('Data til yd. visninger'!C71),\"\",RANK('Data til yd. visninger'!C71,'Data til yd. visninger'!$C$69:$C$76,0)),\"\")","v":""},{"$f":"IFERROR(VLOOKUP($D133,'Data til yd. visninger'!$C$69:$G$76,2,0),\"\")","v":""},null,{"$f":"IFERROR(VLOOKUP($D133,'Data til yd. visninger'!$C$69:$G$76,3,0),\"\")","v":""},{"$f":"IFERROR(VLOOKUP($D133,'Data til yd. visninger'!$C$69:$G$76,4,0),\"\")","v":""},{"$f":"IFERROR(VLOOKUP($D133,'Data til yd. visninger'!$C$69:$G$76,5,0),\"\")","v":""}]
[null,null,null,{"$f":"IFERROR(IF(ISERROR('Data til yd. visninger'!C72),\"\",RANK('Data til yd. visninger'!C72,'Data til yd. visninger'!$C$69:$C$76,0)),\"\")","v":""},{"$f":"IFERROR(VLOOKUP($D134,'Data til yd. visninger'!$C$69:$G$76,2,0),\"\")","v":""},null,{"$f":"IFERROR(VLOOKUP($D134,'Data til yd. visninger'!$C$69:$G$76,3,0),\"\")","v":""},{"$f":"IFERROR(VLOOKUP($D134,'Data til yd. visninger'!$C$69:$G$76,4,0),\"\")","v":""},{"$f":"IFERROR(VLOOKUP($D134,'Data til yd. visninger'!$C$69:$G$76,5,0),\"\")","v":""}]
[null,null,null,{"$f":"IFERROR(IF(ISERROR('Data til yd. visninger'!C73),\"\",RANK('Data til yd. visninger'!C73,'Data til yd. visninger'!$C$69:$C$76,0)),\"\")","v":""},{"$f":"IFERROR(VLOOKUP($D135,'Data til yd. visninger'!$C$69:$G$76,2,0),\"\")","v":""},null,{"$f":"IFERROR(VLOOKUP($D135,'Data til yd. visninger'!$C$69:$G$76,3,0),\"\")","v":""},{"$f":"IFERROR(VLOOKUP($D135,'Data til yd. visninger'!$C$69:$G$76,4,0),\"\")","v":""},{"$f":"IFERROR(VLOOKUP($D135,'Data til yd. visninger'!$C$69:$G$76,5,0),\"\")","v":""}]
[null,null,null,{"$f":"IFERROR(IF(ISERROR('Data til yd. visninger'!C74),\"\",RANK('Data til yd. visninger'!C74,'Data til yd. visninger'!$C$69:$C$76,0)),\"\")","v":""},{"$f":"IFERROR(VLOOKUP($D136,'Data til yd. visninger'!$C$69:$G$76,2,0),\"\")","v":""},null,{"$f":"IFERROR(VLOOKUP($D136,'Data til yd. visninger'!$C$69:$G$76,3,0),\"\")","v":""},{"$f":"IFERROR(VLOOKUP($D136,'Data til yd. visninger'!$C$69:$G$76,4,0),\"\")","v":""},{"$f":"IFERROR(VLOOKUP($D136,'Data til yd. visninger'!$C$69:$G$76,5,0),\"\")","v":""}]
[null,null,null,{"$f":"IFERROR(IF(ISERROR('Data til yd. visninger'!C75),\"\",RANK('Data til yd. visninger'!C75,'Data til yd. visninger'!$C$69:$C$76,0)),\"\")","v":""},{"$f":"IFERROR(VLOOKUP($D137,'Data til yd. visninger'!$C$69:$G$76,2,0),\"\")","v":""},null,{"$f":"IFERROR(VLOOKUP($D137,'Data til yd. visninger'!$C$69:$G$76,3,0),\"\")","v":""},{"$f":"IFERROR(VLOOKUP($D137,'Data til yd. visninger'!$C$69:$G$76,4,0),\"\")","v":""},{"$f":"IFERROR(VLOOKUP($D137,'Data til yd. visninger'!$C$69:$G$76,5,0),\"\")","v":""}]
[null,null,null,{"$f":"IFERROR(IF(ISERROR('Data til yd. visninger'!C76),\"\",RANK('Data til yd. visninger'!C76,'Data til yd. visninger'!$C$69:$C$76,0)),\"\")","v":""},{"$f":"IFERROR(VLOOKUP($D138,'Data til yd. visninger'!$C$69:$G$76,2,0),\"\")","v":""},null,{"$f":"IFERROR(VLOOKUP($D138,'Data til yd. visninger'!$C$69:$G$76,3,0),\"\")","v":""},{"$f":"IFERROR(VLOOKUP($D138,'Data til yd. visninger'!$C$69:$G$76,4,0),\"\")","v":""},{"$f":"IFERROR(VLOOKUP($D138,'Data til yd. visninger'!$C$69:$G$76,5,0),\"\")","v":""}]
[]
[]
[null,null,null,{"$f":"'Data til yd. visninger'!I66","v":"Visning V: Samlede it-systemomk. pr. forretningsområde"}]
[null,null,null,"Vælg cellerne D146:L171 for at kopiere denne visning til it-handlingsplanen"]
[]
[]
[null,null,null,null,null,null,null,null,null,null,"Figuren indeholder ikke data fra alle it-systemer"]
[]
[]
[]
[]
[]
[]
[]
[]
[]
[]
[]
[]
[]
[]
[]
[]
[]
[]
[]
[]
[]
[]
[]
[]
[null,null,null,"Rangering","Forretningsområde",null,"Samlede årlige it-systemomkostninger (i mio. kr.)"]
[null,null,null,{"$f":"IFERROR(IF(ISERROR('Data til yd. visninger'!I69),\"\",RANK('Data til yd. visninger'!I69,'Data til yd. visninger'!$I$69:$I$76,0)),\"\")","v":""},{"$f":"IFERROR(VLOOKUP($D171,'Data til yd. visninger'!$I$69:$K$76,2,0),\"\")","v":""},null,{"$f":"IFERROR(VLOOKUP($D171,'Data til yd. visninger'!$I$69:$K$76,3,0),\"\")","v":""}]
[null,null,null,{"$f":"IFERROR(IF(ISERROR('Data til yd. visninger'!I70),\"\",RANK('Data til yd. visninger'!I70,'Data til yd. visninger'!$I$69:$I$76,0)),\"\")","v":""},{"$f":"IFERROR(VLOOKUP($D172,'Data til yd. visninger'!$I$69:$K$76,2,0),\"\")","v":""},null,{"$f":"IFERROR(VLOOKUP($D172,'Data til yd. visninger'!$I$69:$K$76,3,0),\"\")","v":""}]
[null,null,null,{"$f":"IFERROR(IF(ISERROR('Data til yd. visninger'!I71),\"\",RANK('Data til yd. visninger'!I71,'Data til yd. visninger'!$I$69:$I$76,0)),\"\")","v":""},{"$f":"IFERROR(VLOOKUP($D173,'Data til yd. visninger'!$I$69:$K$76,2,0),\"\")","v":""},null,{"$f":"IFERROR(VLOOKUP($D173,'Data til yd. visninger'!$I$69:$K$76,3,0),\"\")","v":""}]
[null,null,null,{"$f":"IFERROR(IF(ISERROR('Data til yd. visninger'!I72),\"\",RANK('Data til yd. visninger'!I72,'Data til yd. visninger'!$I$69:$I$76,0)),\"\")","v":""},{"$f":"IFERROR(VLOOKUP($D174,'Data til yd. visninger'!$I$69:$K$76,2,0),\"\")","v":""},null,{"$f":"IFERROR(VLOOKUP($D174,'Data til yd. visninger'!$I$69:$K$76,3,0),\"\")","v":""}]
[null,null,null,{"$f":"IFERROR(IF(ISERROR('Data til yd. visninger'!I73),\"\",RANK('Data til yd. visninger'!I73,'Data til yd. visninger'!$I$69:$I$76,0)),\"\")","v":""},{"$f":"IFERROR(VLOOKUP($D175,'Data til yd. visninger'!$I$69:$K$76,2,0),\"\")","v":""},null,{"$f":"IFERROR(VLOOKUP($D175,'Data til yd. visninger'!$I$69:$K$76,3,0),\"\")","v":""}]
[null,null,null,{"$f":"IFERROR(IF(ISERROR('Data til yd. visninger'!I74),\"\",RANK('Data til yd. visninger'!I74,'Data til yd. visninger'!$I$69:$I$76,0)),\"\")","v":""},{"$f":"IFERROR(VLOOKUP($D176,'Data til yd. visninger'!$I$69:$K$76,2,0),\"\")","v":""},null,{"$f":"IFERROR(VLOOKUP($D176,'Data til yd. visninger'!$I$69:$K$76,3,0),\"\")","v":""}]
[null,null,null,{"$f":"IFERROR(IF(ISERROR('Data til yd. visninger'!I75),\"\",RANK('Data til yd. visninger'!I75,'Data til yd. visninger'!$I$69:$I$76,0)),\"\")","v":""},{"$f":"IFERROR(VLOOKUP($D177,'Data til yd. visninger'!$I$69:$K$76,2,0),\"\")","v":""},null,{"$f":"IFERROR(VLOOKUP($D177,'Data til yd. visninger'!$I$69:$K$76,3,0),\"\")","v":""}]
[null,null,null,{"$f":"IFERROR(IF(ISERROR('Data til yd. visninger'!I76),\"\",RANK('Data til yd. visninger'!I76,'Data til yd. visninger'!$I$69:$I$76,0)),\"\")","v":""},{"$f":"IFERROR(VLOOKUP($D178,'Data til yd. visninger'!$I$69:$K$76,2,0),\"\")","v":""},null,{"$f":"IFERROR(VLOOKUP($D178,'Data til yd. visninger'!$I$69:$K$76,3,0),\"\")","v":""}]
[]
[]
[null,null,null,{"$f":"'Data til yd. visninger'!C79","v":"Visning VI: Myndighedens sammensætning af omkostninger til it-systemer"}]
[null,null,null,"Vælg cellerne D175:L1191 for at kopiere denne visning til it-handlingsplanen"]
[]
[]
[null,null,null,null,null,null,null,null,null,null,"Figuren indeholder ikke data fra alle it-systemer"]
[]
[]
[]
[]
[]
[]
[]
[]
[]
[]
[]
[]
[]
[]
[]
[null,null,null,{"$f":"'Data til yd. visninger'!C89","v":"Visning VII: It-systemernes samlede årlige it-omkostninger fordelt efter kritikalitet"}]
[null,null,null,"Vælg cellerne C195:L219 for at kopiere denne visning til it-handlingsplanen"]
[]
[]
[null,null,null,null,null,null,null,null,null,null,"Figuren indeholder ikke data fra alle it-systemer"]

{"sheet":"Heatmap","index":6,"n_rows":13,"n_cols":54,"rows_kept":13,"cut":false,"hidden":false,"merged":[[11,1,12,1],[7,8,7,10]]}
[]
[null,"Heatmap"]
[]
[]
[]
[{"$f":"A5+1","v":1},{"$f":"IF(INDEX(rng_DatagrundlagData,MATCH($A6,IF(rng_HeatChooseS=\"Original\",rng_SOriginal,rng_SSort),0),MATCH(F$9,rng_QOriginal,0))=\"\",\"\",INDEX(rng_DatagrundlagData,MATCH($A6,IF(rng_HeatChooseS=\"Original\",rng_SOriginal,rng_SSort),0),MATCH(F$9,rng_QOriginal,0)))","v":{"$error":"#REF!"}},{"$f":"IFERROR(\nIF(C$13=$AN$13,INDEX(rng_Supplier1,MATCH($A6,IF(rng_HeatChooseS=\"Original\",rng_SOriginal,rng_SSort),0),1),\nIF(C$13=$AO$13,INDEX(rng_Supplier2,MATCH($A6,IF(rng_HeatChooseS=\"Original\",rng_SOriginal,rng_SSort),0),1),\nIF(INDEX(rng_DatagrundlagData,MATCH($A6,IF(rng_HeatChooseS=\"Original\",rng_SOriginal,rng_SSort),0),MATCH(MATCH(C$13,Variabler!$E$5:$E$87,0),rng_DatagrundlagNoQ,0))=\"\",\"\",INDEX(rng_DatagrundlagData,MATCH($A6,IF(rng_HeatChooseS=\"Original\",rng_SOriginal,rng_SSort),0),MATCH(MATCH(C$13,Variabler!$E$5:$E$87,0),rng_DatagrundlagNoQ,0))))),\"\")","v":""},{"$f":"IFERROR(\nIF(D$13=$AN$13,INDEX(rng_Supplier1,MATCH($A6,IF(rng_HeatChooseS=\"Original\",rng_SOriginal,rng_SSort),0),1),\nIF(D$13=$AO$13,INDEX(rng_Supplier2,MATCH($A6,IF(rng_HeatChooseS=\"Original\",rng_SOriginal,rng_SSort),0),1),\nIF(INDEX(rng_DatagrundlagData,MATCH($A6,IF(rng_HeatChooseS=\"Original\",rng_SOriginal,rng_SSort),0),MATCH(MATCH(D$13,Variabler!$E$5:$E$87,0),rng_DatagrundlagNoQ,0))=\"\",\"\",INDEX(rng_DatagrundlagData,MATCH($A6,IF(rng_HeatChooseS=\"Original\",rng_SOriginal,rng_SSort),0),MATCH(MATCH(D$13,Variabler!$E$5:$E$87,0),rng_DatagrundlagNoQ,0))))),\"\")","v":""},{"$f":"IFERROR(\nIF(E$13=$AN$13,INDEX(rng_Supplier1,MATCH($A6,IF(rng_HeatChooseS=\"Original\",rng_SOriginal,rng_SSort),0),1),\nIF(E$13=$AO$13,INDEX(rng_Supplier2,MATCH($A6,IF(rng_HeatChooseS=\"Original\",rng_SOriginal,rng_SSort),0),1),\nIF(INDEX(rng_DatagrundlagData,MATCH($A6,IF(rng_HeatChooseS=\"Original\",rng_SOriginal,rng_SSort),0),MATCH(MATCH(E$13,Variabler!$E$5:$E$87,0),rng_DatagrundlagNoQ,0))=\"\",\"\",INDEX(rng_DatagrundlagData,MATCH($A6,IF(rng_HeatChooseS=\"Original\",rng_SOriginal,rng_SSort),0),MATCH(MATCH(E$13,Variabler!$E$5:$E$87,0),rng_DatagrundlagNoQ,0))))),\"\")","v":""},{"$f":"IFERROR(\nIF(F$13=$AN$13,INDEX(rng_Supplier1,MATCH($A6,IF(rng_HeatChooseS=\"Original\",rng_SOriginal,rng_SSort),0),1),\nIF(F$13=$AO$13,INDEX(rng_Supplier2,MATCH($A6,IF(rng_HeatChooseS=\"Original\",rng_SOriginal,rng_SSort),0),1),\nIF(INDEX(rng_DatagrundlagData,MATCH($A6,IF(rng_HeatChooseS=\"Original\",rng_SOriginal,rng_SSort),0),MATCH(MATCH(F$13,Variabler!$E$5:$E$87,0),rng_DatagrundlagNoQ,0))=\"\",\"\",INDEX(rng_DatagrundlagData,MATCH($A6,IF(rng_HeatChooseS=\"Original\",rng_SOriginal,rng_SSort),0),MATCH(MATCH(F$13,Variabler!$E$5:$E$87,0),rng_DatagrundlagNoQ,0))))),\"\")","v":""},{"$f":"IFERROR(\nIF(G$13=$AN$13,INDEX(rng_Supplier1,MATCH($A6,IF(rng_HeatChooseS=\"Original\",rng_SOriginal,rng_SSort),0),1),\nIF(G$13=$AO$13,INDEX(rng_Supplier2,MATCH($A6,IF(rng_HeatChooseS=\"Original\",rng_SOriginal,rng_SSort),0),1),\nIF(INDEX(rng_DatagrundlagData,MATCH($A6,IF(rng_HeatChooseS=\"Original\",rng_SOriginal,rng_SSort),0),MATCH(MATCH(G$13,Variabler!$E$5:$E$87,0),rng_DatagrundlagNoQ,0))=\"\",\"\",INDEX(rng_DatagrundlagData,MATCH($A6,IF(rng_HeatChooseS=\"Original\",rng_SOriginal,rng_SSort),0),MATCH(MATCH(G$13,Variabler!$E$5:$E$87,0),rng_DatagrundlagNoQ,0))))),\"\")","v":""},{"$f":"IFERROR(\nIF(H$13=$AN$13,INDEX(rng_Supplier1,MATCH($A6,IF(rng_HeatChooseS=\"Original\",rng_SOriginal,rng_SSort),0),1),\nIF(H$13=$AO$13,INDEX(rng_Supplier2,MATCH($A6,IF(rng_HeatChooseS=\"Original\",rng_SOriginal,rng_SSort),0),1),\nIF(INDEX(rng_DatagrundlagData,MATCH($A6,IF(rng_HeatChooseS=\"Original\",rng_SOriginal,rng_SSort),0),MATCH(MATCH(H$13,Variabler!$E$5:$E$87,0),rng_DatagrundlagNoQ,0))=\"\",\"\",INDEX(rng_DatagrundlagData,MATCH($A6,IF(rng_HeatChooseS=\"Original\",rng_SOriginal,rng_SSort),0),MATCH(MATCH(H$13,Variabler!$E$5:$E$87,0),rng_DatagrundlagNoQ,0))))),\"\")","v":""},{"$f":"IFERROR(\nIF(I$13=$AN$13,INDEX(rng_Supplier1,MATCH($A6,IF(rng_HeatChooseS=\"Original\",rng_SOriginal,rng_SSort),0),1),\nIF(I$13=$AO$13,INDEX(rng_Supplier2,MATCH($A6,IF(rng_HeatChooseS=\"Original\",rng_SOriginal,rng_SSort),0),1),\nIF(INDEX(rng_DatagrundlagData,MATCH($A6,IF(rng_HeatChooseS=\"Original\",rng_SOriginal,rng_SSort),0),MATCH(MATCH(I$13,Variabler!$E$5:$E$87,0),rng_DatagrundlagNoQ,0))=\"\",\"\",INDEX(rng_DatagrundlagData,MATCH($A6,IF(rng_HeatChooseS=\"Original\",rng_SOriginal,rng_SSort),0),MATCH(MATCH(I$13,Variabler!$E$5:$E$87,0),rng_DatagrundlagNoQ,0))))),\"\")","v":""},{"$f":"IFERROR(\nIF(J$13=$AN$13,INDEX(rng_Supplier1,MATCH($A6,IF(rng_HeatChooseS=\"Original\",rng_SOriginal,rng_SSort),0),1),\nIF(J$13=$AO$13,INDEX(rng_Supplier2,MATCH($A6,IF(rng_HeatChooseS=\"Original\",rng_SOriginal,rng_SSort),0),1),\nIF(INDEX(rng_DatagrundlagData,MATCH($A6,IF(rng_HeatChooseS=\"Original\",rng_SOriginal,rng_SSort),0),MATCH(MATCH(J$13,Variabler!$E$5:$E$87,0),rng_DatagrundlagNoQ,0))=\"\",\"\",INDEX(rng_DatagrundlagData,MATCH($A6,IF(rng_HeatChooseS=\"Original\",rng_SOriginal,rng_SSort),0),MATCH(MATCH(J$13,Variabler!$E$5:$E$87,0),rng_DatagrundlagNoQ,0))))),\"\")","v":""},{"$f":"IFERROR(\nIF(K$13=$AN$13,INDEX(rng_Supplier1,MATCH($A6,IF(rng_HeatChooseS=\"Original\",rng_SOriginal,rng_SSort),0),1),\nIF(K$13=$AO$13,INDEX(rng_Supplier2,MATCH($A6,IF(rng_HeatChooseS=\"Original\",rng_SOriginal,rng_SSort),0),1),\nIF(INDEX(rng_DatagrundlagData,MATCH($A6,IF(rng_HeatChooseS=\"Original\",rng_SOriginal,rng_SSort),0),MATCH(MATCH(K$13,Variabler!$E$5:$E$87,0),rng_DatagrundlagNoQ,0))=\"\",\"\",INDEX(rng_DatagrundlagData,MATCH($A6,IF(rng_HeatChooseS=\"Original\",rng_SOriginal,rng_SSort),0),MATCH(MATCH(K$13,Variabler!$E$5:$E$87,0),rng_DatagrundlagNoQ,0))))),\"\")","v":""},{"$f":"IFERROR(\nIF(L$13=$AN$13,INDEX(rng_Supplier1,MATCH($A6,IF(rng_HeatChooseS=\"Original\",rng_SOriginal,rng_SSort),0),1),\nIF(L$13=$AO$13,INDEX(rng_Supplier2,MATCH($A6,IF(rng_HeatChooseS=\"Original\",rng_SOriginal,rng_SSort),0),1),\nIF(INDEX(rng_DatagrundlagData,MATCH($A6,IF(rng_HeatChooseS=\"Original\",rng_SOriginal,rng_SSort),0),MATCH(MATCH(L$13,Variabler!$E$5:$E$87,0),rng_DatagrundlagNoQ,0))=\"\",\"\",INDEX(rng_DatagrundlagData,MATCH($A6,IF(rng_HeatChooseS=\"Original\",rng_SOriginal,rng_SSort),0),MATCH(MATCH(L$13,Variabler!$E$5:$E$87,0),rng_DatagrundlagNoQ,0))))),\"\")","v":""},{"$f":"IFERROR(\nIF(M$13=$AN$13,INDEX(rng_Supplier1,MATCH($A6,IF(rng_HeatChooseS=\"Original\",rng_SOriginal,rng_SSort),0),1),\nIF(M$13=$AO$13,INDEX(rng_Supplier2,MATCH($A6,IF(rng_HeatChooseS=\"Original\",rng_SOriginal,rng_SSort),0),1),\nIF(INDEX(rng_DatagrundlagData,MATCH($A6,IF(rng_HeatChooseS=\"Original\",rng_SOriginal,rng_SSort),0),MATCH(MATCH(M$13,Variabler!$E$5:$E$87,0),rng_DatagrundlagNoQ,0))=\"\",\"\",INDEX(rng_DatagrundlagData,MATCH($A6,IF(rng_HeatChooseS=\"Original\",rng_SOriginal,rng_SSort),0),MATCH(MATCH(M$13,Variabler!$E$5:$E$87,0),rng_DatagrundlagNoQ,0))))),\"\")","v":""},{"$f":"IFERROR(\nIF(N$13=$AN$13,INDEX(rng_Supplier1,MATCH($A6,IF(rng_HeatChooseS=\"Original\",rng_SOriginal,rng_SSort),0),1),\nIF(N$13=$AO$13,INDEX(rng_Supplier2,MATCH($A6,IF(rng_HeatChooseS=\"Original\",rng_SOriginal,rng_SSort),0),1),\nIF(INDEX(rng_DatagrundlagData,MATCH($A6,IF(rng_HeatChooseS=\"Original\",rng_SOriginal,rng_SSort),0),MATCH(MATCH(N$13,Variabler!$E$5:$E$87,0),rng_DatagrundlagNoQ,0))=\"\",\"\",INDEX(rng_DatagrundlagData,MATCH($A6,IF(rng_HeatChooseS=\"Original\",rng_SOriginal,rng_SSort),0),MATCH(MATCH(N$13,Variabler!$E$5:$E$87,0),rng_DatagrundlagNoQ,0))))),\"\")","v":""},{"$f":"IFERROR(\nIF(O$13=$AN$13,INDEX(rng_Supplier1,MATCH($A6,IF(rng_HeatChooseS=\"Original\",rng_SOriginal,rng_SSort),0),1),\nIF(O$13=$AO$13,INDEX(rng_Supplier2,MATCH($A6,IF(rng_HeatChooseS=\"Original\",rng_SOriginal,rng_SSort),0),1),\nIF(INDEX(rng_DatagrundlagData,MATCH($A6,IF(rng_HeatChooseS=\"Original\",rng_SOriginal,rng_SSort),0),MATCH(MATCH(O$13,Variabler!$E$5:$E$87,0),rng_DatagrundlagNoQ,0))=\"\",\"\",INDEX(rng_DatagrundlagData,MATCH($A6,IF(rng_HeatChooseS=\"Original\",rng_SOriginal,rng_SSort),0),MATCH(MATCH(O$13,Variabler!$E$5:$E$87,0),rng_DatagrundlagNoQ,0))))),\"\")","v":""},{"$f":"IFERROR(\nIF(P$13=$AN$13,INDEX(rng_Supplier1,MATCH($A6,IF(rng_HeatChooseS=\"Original\",rng_SOriginal,rng_SSort),0),1),\nIF(P$13=$AO$13,INDEX(rng_Supplier2,MATCH($A6,IF(rng_HeatChooseS=\"Original\",rng_SOriginal,rng_SSort),0),1),\nIF(INDEX(rng_DatagrundlagData,MATCH($A6,IF(rng_HeatChooseS=\"Original\",rng_SOriginal,rng_SSort),0),MATCH(MATCH(P$13,Variabler!$E$5:$E$87,0),rng_DatagrundlagNoQ,0))=\"\",\"\",INDEX(rng_DatagrundlagData,MATCH($A6,IF(rng_HeatChooseS=\"Original\",rng_SOriginal,rng_SSort),0),MATCH(MATCH(P$13,Variabler!$E$5:$E$87,0),rng_DatagrundlagNoQ,0))))),\"\")","v":""},{"$f":"IFERROR(\nIF(Q$13=$AN$13,INDEX(rng_Supplier1,MATCH($A6,IF(rng_HeatChooseS=\"Original\",rng_SOriginal,rng_SSort),0),1),\nIF(Q$13=$AO$13,INDEX(rng_Supplier2,MATCH($A6,IF(rng_HeatChooseS=\"Original\",rng_SOriginal,rng_SSort),0),1),\nIF(INDEX(rng_DatagrundlagData,MATCH($A6,IF(rng_HeatChooseS=\"Original\",rng_SOriginal,rng_SSort),0),MATCH(MATCH(Q$13,Variabler!$E$5:$E$87,0),rng_DatagrundlagNoQ,0))=\"\",\"\",INDEX(rng_DatagrundlagData,MATCH($A6,IF(rng_HeatChooseS=\"Original\",rng_SOriginal,rng_SSort),0),MATCH(MATCH(Q$13,Variabler!$E$5:$E$87,0),rng_DatagrundlagNoQ,0))))),\"\")","v":""},{"$f":"IFERROR(\nIF(R$13=$AN$13,INDEX(rng_Supplier1,MATCH($A6,IF(rng_HeatChooseS=\"Original\",rng_SOriginal,rng_SSort),0),1),\nIF(R$13=$AO$13,INDEX(rng_Supplier2,MATCH($A6,IF(rng_HeatChooseS=\"Original\",rng_SOriginal,rng_SSort),0),1),\nIF(INDEX(rng_DatagrundlagData,MATCH($A6,IF(rng_HeatChooseS=\"Original\",rng_SOriginal,rng_SSort),0),MATCH(MATCH(R$13,Variabler!$E$5:$E$87,0),rng_DatagrundlagNoQ,0))=\"\",\"\",INDEX(rng_DatagrundlagData,MATCH($A6,IF(rng_HeatChooseS=\"Original\",rng_SOriginal,rng_SSort),0),MATCH(MATCH(R$13,Variabler!$E$5:$E$87,0),rng_DatagrundlagNoQ,0))))),\"\")","v":""},{"$f":"IFERROR(\nIF(S$13=$AN$13,INDEX(rng_Supplier1,MATCH($A6,IF(rng_HeatChooseS=\"Original\",rng_SOriginal,rng_SSort),0),1),\nIF(S$13=$AO$13,INDEX(rng_Supplier2,MATCH($A6,IF(rng_HeatChooseS=\"Original\",rng_SOriginal,rng_SSort),0),1),\nIF(INDEX(rng_DatagrundlagData,MATCH($A6,IF(rng_HeatChooseS=\"Original\",rng_SOriginal,rng_SSort),0),MATCH(MATCH(S$13,Variabler!$E$5:$E$87,0),rng_DatagrundlagNoQ,0))=\"\",\"\",INDEX(rng_DatagrundlagData,MATCH($A6,IF(rng_HeatChooseS=\"Original\",rng_SOriginal,rng_SSort),0),MATCH(MATCH(S$13,Variabler!$E$5:$E$87,0),rng_DatagrundlagNoQ,0))))),\"\")","v":""},{"$f":"IFERROR(\nIF(T$13=$AN$13,INDEX(rng_Supplier1,MATCH($A6,IF(rng_HeatChooseS=\"Original\",rng_SOriginal,rng_SSort),0),1),\nIF(T$13=$AO$13,INDEX(rng_Supplier2,MATCH($A6,IF(rng_HeatChooseS=\"Original\",rng_SOriginal,rng_SSort),0),1),\nIF(INDEX(rng_DatagrundlagData,MATCH($A6,IF(rng_HeatChooseS=\"Original\",rng_SOriginal,rng_SSort),0),MATCH(MATCH(T$13,Variabler!$E$5:$E$87,0),rng_DatagrundlagNoQ,0))=\"\",\"\",INDEX(rng_DatagrundlagData,MATCH($A6,IF(rng_HeatChooseS=\"Original\",rng_SOriginal,rng_SSort),0),MATCH(MATCH(T$13,Variabler!$E$5:$E$87,0),rng_DatagrundlagNoQ,0))))),\"\")","v":""},{"$f":"IFERROR(\nIF(U$13=$AN$13,INDEX(rng_Supplier1,MATCH($A6,IF(rng_HeatChooseS=\"Original\",rng_SOriginal,rng_SSort),0),1),\nIF(U$13=$AO$13,INDEX(rng_Supplier2,MATCH($A6,IF(rng_HeatChooseS=\"Original\",rng_SOriginal,rng_SSort),0),1),\nIF(INDEX(rng_DatagrundlagData,MATCH($A6,IF(rng_HeatChooseS=\"Original\",rng_SOriginal,rng_SSort),0),MATCH(MATCH(U$13,Variabler!$E$5:$E$87,0),rng_DatagrundlagNoQ,0))=\"\",\"\",INDEX(rng_DatagrundlagData,MATCH($A6,IF(rng_HeatChooseS=\"Original\",rng_SOriginal,rng_SSort),0),MATCH(MATCH(U$13,Variabler!$E$5:$E$87,0),rng_DatagrundlagNoQ,0))))),\"\")","v":""},null,null,null,null,null,null,null,null,null,{"$f":"AE5+1","v":1},null,{"$f":"SUM(OFFSET(AI6,0,1,1,rng_HeatNoQ))","v":0},null,{"$f":"Datagrundlag!E3","v":0},{"$f":"IFERROR(OFFSET(rng_OffsetHeaders,MATCH(Datagrundlag!J3,INDIRECT(VLOOKUP(AJ$9,Variabler!$C:$F,4,FALSE)),0)+1,MATCH(VLOOKUP(AJ$9,Variabler!$C:$F,4,FALSE),rng_AnswerHead,0),1,1),\"No data\")","v":"No data"},{"$f":"IFERROR(OFFSET(rng_OffsetHeaders,MATCH(Datagrundlag!S3,INDIRECT(VLOOKUP(AK$9,Variabler!$C:$F,4,FALSE)),0)+1,MATCH(VLOOKUP(AK$9,Variabler!$C:$F,4,FALSE),rng_AnswerHead,0),1,1),\"No data\")","v":"No data"},{"$f":"IFERROR(OFFSET(rng_OffsetHeaders,MATCH(Datagrundlag!T3,INDIRECT(VLOOKUP(AL$9,Variabler!$C:$F,4,FALSE)),0)+1,MATCH(VLOOKUP(AL$9,Variabler!$C:$F,4,FALSE),rng_AnswerHead,0),1,1),\"No data\")","v":"No data"},{"$f":"IFERROR(OFFSET(rng_OffsetHeaders,MATCH(Datagrundlag!V3,INDIRECT(VLOOKUP(AM$9,Variabler!$C:$F,4,FALSE)),0)+1,MATCH(VLOOKUP(AM$9,Variabler!$C:$F,4,FALSE),rng_AnswerHead,0),1,1),\"No data\")","v":"No data"},{"$f":"IFERROR(1-(IF(Datagrundlag!$EA3=\"\",\"No Data\",Datagrundlag!$EA3)-1)*0.25,\"No data\")","v":"No data"},{"$f":"IFERROR(IF(Datagrundlag!$EJ3=\"\",\"No Data\",Datagrundlag!$EJ3),\"No data\")","v":"No Data"},{"$f":"IFERROR(OFFSET(rng_OffsetHeaders,MATCH(Datagrundlag!BK3,INDIRECT(VLOOKUP(AP$9,Variabler!$C:$F,4,FALSE)),0)+1,MATCH(VLOOKUP(AP$9,Variabler!$C:$F,4,FALSE),rng_AnswerHead,0),1,1),\"No data\")","v":"No data"},{"$f":"IFERROR(OFFSET(rng_OffsetHeaders,MATCH(Datagrundlag!BL3,INDIRECT(VLOOKUP(AQ$9,Variabler!$C:$F,4,FALSE)),0)+1,MATCH(VLOOKUP(AQ$9,Variabler!$C:$F,4,FALSE),rng_AnswerHead,0),1,1),\"No data\")","v":"No data"},{"$f":"IFERROR(OFFSET(rng_OffsetHeaders,MATCH(Datagrundlag!BM3,INDIRECT(VLOOKUP(AR$9,Variabler!$C:$F,4,FALSE)),0)+1,MATCH(VLOOKUP(AR$9,Variabler!$C:$F,4,FALSE),rng_AnswerHead,0),1,1),\"No data\")","v":"No data"},{"$f":"IFERROR(OFFSET(rng_OffsetHeaders,MATCH(Datagrundlag!BN3,INDIRECT(VLOOKUP(AS$9,Variabler!$C:$F,4,FALSE)),0)+1,MATCH(VLOOKUP(AS$9,Variabler!$C:$F,4,FALSE),rng_AnswerHead,0),1,1),\"No data\")","v":"No data"},{"$f":"IFERROR(OFFSET(rng_OffsetHeaders,MATCH(Datagrundlag!BO3,INDIRECT(VLOOKUP(AT$9,Variabler!$C:$F,4,FALSE)),0)+1,MATCH(VLOOKUP(AT$9,Variabler!$C:$F,4,FALSE),rng_AnswerHead,0),1,1),\"No data\")","v":"No data"},{"$f":"IFERROR(OFFSET(rng_OffsetHeaders,MATCH(Datagrundlag!BQ3,INDIRECT(VLOOKUP(AU$9,Variabler!$C:$F,4,FALSE)),0)+1,MATCH(VLOOKUP(AU$9,Variabler!$C:$F,4,FALSE),rng_AnswerHead,0),1,1),\"No data\")","v":"No data"},{"$f":"IFERROR(OFFSET(rng_OffsetHeaders,MATCH(Datagrundlag!BT3,INDIRECT(VLOOKUP(AV$9,Variabler!$C:$F,4,FALSE)),0)+1,MATCH(VLOOKUP(AV$9,Variabler!$C:$F,4,FALSE),rng_AnswerHead,0),1,1),\"No data\")","v":"No data"},{"$f":"IFERROR(OFFSET(rng_OffsetHeaders,MATCH(Datagrundlag!BU3,INDIRECT(VLOOKUP(AW$9,Variabler!$C:$F,4,FALSE)),0)+1,MATCH(VLOOKUP(AW$9,Variabler!$C:$F,4,FALSE),rng_AnswerHead,0),1,1),\"No data\")","v":"No data"},{"$f":"IFERROR(OFFSET(rng_OffsetHeaders,MATCH(Datagrundlag!BV3,INDIRECT(VLOOKUP(AX$9,Variabler!$C:$F,4,FALSE)),0)+1,MATCH(VLOOKUP(AX$9,Variabler!$C:$F,4,FALSE),rng_AnswerHead,0),1,1),\"No data\")","v":"No data"},{"$f":"IFERROR(OFFSET(rng_OffsetHeaders,MATCH(Datagrundlag!BW3,INDIRECT(VLOOKUP(AY$9,Variabler!$C:$F,4,FALSE)),0)+1,MATCH(VLOOKUP(AY$9,Variabler!$C:$F,4,FALSE),rng_AnswerHead,0),1,1),\"No data\")","v":"No data"},{"$f":"IFERROR(OFFSET(rng_OffsetHeaders,MATCH(Datagrundlag!BX3,INDIRECT(VLOOKUP(AZ$9,Variabler!$C:$F,4,FALSE)),0)+1,MATCH(VLOOKUP(AZ$9,Variabler!$C:$F,4,FALSE),rng_AnswerHead,0),1,1),\"No data\")","v":"No data"},{"$f":"IFERROR(OFFSET(rng_OffsetHeaders,MATCH(Datagrundlag!BY3,INDIRECT(VLOOKUP(BA$9,Variabler!$C:$F,4,FALSE)),0)+1,MATCH(VLOOKUP(BA$9,Variabler!$C:$F,4,FALSE),rng_AnswerHead,0),1,1),\"No data\")","v":"No data"},{"$f":"IFERROR(OFFSET(rng_OffsetHeaders,MATCH(Datagrundlag!BZ3,INDIRECT(VLOOKUP(BB$9,Variabler!$C:$F,4,FALSE)),0)+1,MATCH(VLOOKUP(BB$9,Variabler!$C:$F,4,FALSE),rng_AnswerHead,0),1,1),\"No data\")","v":"No data"}]
[null,"Vælg rækkefølge af spørgsmål",null,"Original",null,null,null,null,"Indhold af aktive celle:"]
[null,"Vælg rækkefølge af systemer",null,"Original"]
[null,null,9,18,19,21,22,23,62,63,64,65,66,68,71,72,73,74,75,76,77,null,null,null,null,null,null,null,null,null,"Original No.",null,null,null,null,9,18,19,21,22,23,62,63,64,65,66,68,71,72,73,74,75,76,77]
[null,null,null,null,null,null,null,null,null,null,null,null,null,null,null,null,null,null,null,null,null,null,null,null,null,null,null,null,null,null,null,"SORT",null,null,null,64,65,9,66,68,73,71,18,19,21,72,22,23,62,63,76,77,75,74]
[null,null,null,null,null,null,null,null,null,null,null,null,null,null,null,null,null,null,null,null,null,null,null,null,null,null,null,null,null,null,null,null,"SUM",null,null,{"$f":"IFERROR(SUM(OFFSET(AJ$13,1,0,rng_SystemCount,1)),0)","v":0},0,0,0,0,0,0,0,0,0,0,0,0,0,0,0,0,0,0]
[null,null,{"$f":"IFERROR(INDEX(Variabler!$D:$E,MATCH(Heatmap!C$13,Variabler!$E:$E,0),1),\"Leverandørforhold\")","v":"Spørgsmål J"},{"$f":"IFERROR(INDEX(Variabler!$D:$E,MATCH(Heatmap!D$13,Variabler!$E:$E,0),1),\"Leverandørforhold\")","v":"Spørgsmål 1"},{"$f":"IFERROR(INDEX(Variabler!$D:$E,MATCH(Heatmap!E$13,Variabler!$E:$E,0),1),\"Leverandørforhold\")","v":"Spørgsmål 2"},{"$f":"IFERROR(INDEX(Variabler!$D:$E,MATCH(Heatmap!F$13,Variabler!$E:$E,0),1),\"Leverandørforhold\")","v":"Spørgsmål 4"},{"$f":"IFERROR(INDEX(Variabler!$D:$E,MATCH(Heatmap!G$13,Variabler!$E:$E,0),1),\"Leverandørforhold\")","v":"Leverandørforhold"},{"$f":"IFERROR(INDEX(Variabler!$D:$E,MATCH(Heatmap!H$13,Variabler!$E:$E,0),1),\"Leverandørforhold\")","v":"Leverandørforhold"},{"$f":"IFERROR(INDEX(Variabler!$D:$E,MATCH(Heatmap!I$13,Variabler!$E:$E,0),1),\"Leverandørforhold\")","v":"Spørgsmål 11"},{"$f":"IFERROR(INDEX(Variabler!$D:$E,MATCH(Heatmap!J$13,Variabler!$E:$E,0),1),\"Leverandørforhold\")","v":"Spørgsmål 12"},{"$f":"IFERROR(INDEX(Variabler!$D:$E,MATCH(Heatmap!K$13,Variabler!$E:$E,0),1),\"Leverandørforhold\")","v":"Spørgsmål 13"},{"$f":"IFERROR(INDEX(Variabler!$D:$E,MATCH(Heatmap!L$13,Variabler!$E:$E,0),1),\"Leverandørforhold\")","v":"Spørgsmål 14"},{"$f":"IFERROR(INDEX(Variabler!$D:$E,MATCH(Heatmap!M$13,Variabler!$E:$E,0),1),\"Leverandørforhold\")","v":"Spørgsmål 15"},{"$f":"IFERROR(INDEX(Variabler!$D:$E,MATCH(Heatmap!N$13,Variabler!$E:$E,0),1),\"Leverandørforhold\")","v":"Spørgsmål 17"},{"$f":"IFERROR(INDEX(Variabler!$D:$E,MATCH(Heatmap!O$13,Variabler!$E:$E,0),1),\"Leverandørforhold\")","v":"Spørgsmål 20"},{"$f":"IFERROR(INDEX(Variabler!$D:$E,MATCH(Heatmap!P$13,Variabler!$E:$E,0),1),\"Leverandørforhold\")","v":"Spørgsmål 21"},{"$f":"IFERROR(INDEX(Variabler!$D:$E,MATCH(Heatmap!Q$13,Variabler!$E:$E,0),1),\"Leverandørforhold\")","v":"Spørgsmål 22"},{"$f":"IFERROR(INDEX(Variabler!$D:$E,MATCH(Heatmap!R$13,Variabler!$E:$E,0),1),\"Leverandørforhold\")","v":"Spørgsmål 23"},{"$f":"IFERROR(INDEX(Variabler!$D:$E,MATCH(Heatmap!S$13,Variabler!$E:$E,0),1),\"Leverandørforhold\")","v":"Spørgsmål 24"},{"$f":"IFERROR(INDEX(Variabler!$D:$E,MATCH(Heatmap!T$13,Variabler!$E:$E,0),1),\"Leverandørforhold\")","v":"Spørgsmål 25"},{"$f":"IFERROR(INDEX(Variabler!$D:$E,MATCH(Heatmap!U$13,Variabler!$E:$E,0),1),\"Leverandørforhold\")","v":"Spørgsmål 26"}]
[null,null,{"$f":"INDEX(rng_HeatQ,MATCH(C$9,IF(rng_HeatChooseQ=\"Original\",rng_QOriginal,rng_QSort),0))","v":"It-systemets kritikalitet"},"Hvor tilfredsstillende er it-systemets understøttelse af forretningsprocesser i dag?","I hvilken grad er der omskiftelighed i forretningsgrundlaget for it-systemet?","Hvor tilfredsstillende er it-systemets realiserede tilgængelighed?","Hvor tilfredsstillende er myndighedens kontraktstyring af it-systemets kontraktdokumenter i dag? (Værste kontrakt)\n","Planlægning af udbud sammenholdt med udløb af kontrakter (Værste kontrakt)",{"$f":"INDEX(rng_HeatQ,MATCH(I$9,IF(rng_HeatChooseQ=\"Original\",rng_QOriginal,rng_QSort),0))","v":"Hvor tilfredsstillende er it-systemets tekniske tilstand i dag?\n"},{"$f":"INDEX(rng_HeatQ,MATCH(J$9,IF(rng_HeatChooseQ=\"Original\",rng_QOriginal,rng_QSort),0))","v":"Baserer it-systemets teknologiske komponenter sig primært på versioner, som forventes vedligeholdt af et leverandørmarked fremadrettet?"},{"$f":"INDEX(rng_HeatQ,MATCH(K$9,IF(rng_HeatChooseQ=\"Original\",rng_QOriginal,rng_QSort),0))","v":"Understøtter it-systemet, gennem planlagt vedligehold og videreudvikling, alle væsentlige tiltænkte processer i forretningsgrundlaget i de kommende tre år?\n"},{"$f":"INDEX(rng_HeatQ,MATCH(L$9,IF(rng_HeatChooseQ=\"Original\",rng_QOriginal,rng_QSort),0))","v":"Er it-systemets primære integrationer baseret på standardadaptere?"},"I hvilken grad kan it-systemet skaleres kapacitetsmæssigt i forhold til behov (flere brugere, flere data)?\n","Er dokumentationen i al væsentlighed retvisende for it-systemets nuværende tilstand?","Har myndigheden mere end én ressource med teknisk viden om it-systemet?\n\n","Er der en opdateret proces for håndtering af nøglepersonsafhængigheder?","Er der etableret formelle procedurer for løbende opsamling og overlevering af information for it-systemet?","Overholder forvaltningen af it-systemet de gældende politikker og retningslinjer, som myndigheden har implementeret i henhold til ISO 27001-standarden?","Imødekommer it-systemet kravene i databeskyttelsesforordningen?","Er alle relevante sikkerhedsopdateringer og patches implementeret?","Findes der en disaster recovery-plan for it-systemet, og er planen testet?",null,null,null,null,null,null,null,null,null,null,null,null,null,null,{"$f":"VLOOKUP(AJ$9,Variabler!$C:$F,3,FALSE)","v":"It-systemets kritikalitet"},{"$f":"VLOOKUP(AK$9,Variabler!$C:$F,3,FALSE)","v":"Hvor tilfredsstillende er it-systemets understøttelse af forretningsprocesser i dag?"},{"$f":"VLOOKUP(AL$9,Variabler!$C:$F,3,FALSE)","v":"I hvilken grad er der omskiftelighed i forretningsgrundlaget for it-systemet?"},{"$f":"VLOOKUP(AM$9,Variabler!$C:$F,3,FALSE)","v":"Hvor tilfredsstillende er it-systemets realiserede tilgængelighed?"},"Hvor tilfredsstillende er myndighedens kontraktstyring af it-systemets kontraktdokumenter i dag? (Værste kontrakt)\n","Planlægning af udbud sammenholdt med udløb af kontrakter (Værste kontrakt)",{"$f":"VLOOKUP(AP$9,Variabler!$C:$F,3,FALSE)","v":"Hvor tilfredsstillende er it-systemets tekniske tilstand i dag?\n"},{"$f":"VLOOKUP(AQ$9,Variabler!$C:$F,3,FALSE)","v":"Baserer it-systemets teknologiske komponenter sig primært på versioner, som forventes vedligeholdt af et leverandørmarked fremadrettet?"},{"$f":"VLOOKUP(AR$9,Variabler!$C:$F,3,FALSE)","v":"Understøtter it-systemet, gennem planlagt vedligehold og videreudvikling, alle væsentlige tiltænkte processer i forretningsgrundlaget i de kommende tre år?\n"},{"$f":"VLOOKUP(AS$9,Variabler!$C:$F,3,FALSE)","v":"Er it-systemets primære integrationer baseret på standardadaptere?"},{"$f":"VLOOKUP(AT$9,Variabler!$C:$F,3,FALSE)","v":"I hvilken grad kan it-systemet skaleres kapacitetsmæssigt i forhold til behov (flere brugere, flere data)?\n"},{"$f":"VLOOKUP(AU$9,Variabler!$C:$F,3,FALSE)","v":"Er dokumentationen i al væsentlighed retvisende for it-systemets nuværende tilstand?"},{"$f":"VLOOKUP(AV$9,Variabler!$C:$F,3,FALSE)","v":"Har myndigheden mere end én ressource med teknisk viden om it-systemet?\n\n"},{"$f":"VLOOKUP(AW$9,Variabler!$C:$F,3,FALSE)","v":"Er der en opdateret proces for håndtering af nøglepersonsafhængigheder?"},{"$f":"VLOOKUP(AX$9,Variabler!$C:$F,3,FALSE)","v":"Er der etableret formelle procedurer for løbende opsamling og overlevering af information for it-systemet?"},{"$f":"VLOOKUP(AY$9,Variabler!$C:$F,3,FALSE)","v":"Overholder forvaltningen af it-systemet de gældende politikker og retningslinjer, som myndigheden har implementeret i henhold til ISO 27001-standarden?"},{"$f":"VLOOKUP(AZ$9,Variabler!$C:$F,3,FALSE)","v":"Imødekommer it-systemet kravene i databeskyttelsesforordningen?"},{"$f":"VLOOKUP(BA$9,Variabler!$C:$F,3,FALSE)","v":"Er alle relevante sikkerhedsopdateringer og patches implementeret?"},{"$f":"VLOOKUP(BB$9,Variabler!$C:$F,3,FALSE)","v":"Findes der en disaster recovery-plan for it-systemet, og er planen testet?"}]

{"sheet":"Data til anb. visninger","index":7,"n_rows":130,"n_cols":15,"rows_kept":130,"cut":false,"hidden":false,"merged":[[50,11,50,12],[51,9,51,10],[51,11,51,12],[52,9,52,10],[52,11,52,12],[98,4,98,10],[50,3,50,4],[51,3,51,4],[52,3,52,4],[50,5,50,6],[51,5,51,6],[52,5,52,6],[50,9,50,10]]}
[null,"Beregninger til it-handlingsplanens anbefalede visninger"]
[]
[null,null,"Visninger til Nedslagspunkt 1 - Forretningsunderstøttelse"]
[]
[null,null,"Visning 4.1.2.A: Tilfredshed med it-systemporteføljens forretningsunderstøttelse"]
[null,null,null,null,null,null,null,null,"Antal forretningsområder:",{"$f":"8-COUNTBLANK(C11:C18)","v":0}]
[]
[null,null,"Data sorteret efter forekomst i datagrundlaget (ikke anvendt i visningen):",null,null,null,null,null,"Data sorteret i alfabetisk rækkefølge (anvendt i visningen):"]
[null,null,"Tilfredshed med forretningsunderstøttelsen",null,null,null,null,null,"Tilfredshed med forretningsunderstøttelsen"]
[null,null,"Navn fra oversigten","Forretningskritisk","Ikke kritisk","Samfundskritisk","Total",null,"Navn fra oversigten","Forretningskritisk","Ikke kritisk","Samfundskritisk","Total"]
[null,1,{"$f":"IF(MAX(Spm.X1)<'Data til anb. visninger'!B11,\"\",IFERROR(INDEX(Spm.I,MATCH(B11,Spm.X1,0)),\"\"))","v":""},{"$f":"IFERROR(AVERAGEIFS(Spm.X23,Spm.I,$C11,Spm.J,D$10),\"\")","v":""},"","",{"$f":"IFERROR(AVERAGEIFS(Spm.X23,Spm.I,$C11),\"\")","v":""},{"$f":"IF(C11=\"\",\"\",COUNTIF(OFFSET($C$11,,,$J$6),\"<\"&C11)+1)","v":""},{"$f":"IFERROR(INDEX(C$11:C$18,MATCH($B11,$H$11:$H$18,0)),\"\")","v":""},{"$f":"IFERROR(INDEX(D$11:D$18,MATCH($B11,$H$11:$H$18,0)),\"\")","v":""},"","",{"$f":"IFERROR(INDEX(G$11:G$18,MATCH($B11,$H$11:$H$18,0)),\"\")","v":""}]
[null,2,{"$f":"IF(MAX(Spm.X1)<'Data til anb. visninger'!B12,\"\",IFERROR(INDEX(Spm.I,MATCH(B12,Spm.X1,0)),\"\"))","v":""},"","","","",{"$f":"IF(C12=\"\",\"\",COUNTIF(OFFSET($C$11,,,$J$6),\"<\"&C12)+1)","v":""},{"$f":"IFERROR(INDEX(C$11:C$18,MATCH($B12,$H$11:$H$18,0)),\"\")","v":""},"","","",""]
[null,3,{"$f":"IF(MAX(Spm.X1)<'Data til anb. visninger'!B13,\"\",IFERROR(INDEX(Spm.I,MATCH(B13,Spm.X1,0)),\"\"))","v":""},"","","","","","","","","",""]
[null,4,{"$f":"IF(MAX(Spm.X1)<'Data til anb. visninger'!B14,\"\",IFERROR(INDEX(Spm.I,MATCH(B14,Spm.X1,0)),\"\"))","v":""},"","","","","","","","","",""]
[null,5,{"$f":"IF(MAX(Spm.X1)<'Data til anb. visninger'!B15,\"\",IFERROR(INDEX(Spm.I,MATCH(B15,Spm.X1,0)),\"\"))","v":""},"","","","","","","","","",""]
[null,6,{"$f":"IF(MAX(Spm.X1)<'Data til anb. visninger'!B16,\"\",IFERROR(INDEX(Spm.I,MATCH(B16,Spm.X1,0)),\"\"))","v":""},"","","","","","","","","",""]
[null,7,{"$f":"IF(MAX(Spm.X1)<'Data til anb. visninger'!B17,\"\",IFERROR(INDEX(Spm.I,MATCH(B17,Spm.X1,0)),\"\"))","v":""},"","","","","","","","","",""]
[null,8,{"$f":"IF(MAX(Spm.X1)<'Data til anb. visninger'!B18,\"\",IFERROR(INDEX(Spm.I,MATCH(B18,Spm.X1,0)),\"\"))","v":""},"","","","","","","","","",""]
[]
[null,null,null,null,null,null,null,null,null,{"$f":"J10&\"e it-systemer\"","v":"Forretningskritiske it-systemer"},{"$f":"K10&\"e it-systemer\"","v":"Ikke kritiske it-systemer"},{"$f":"L10&\"e it-systemer\"","v":"Samfundskritiske it-systemer"}]
[]
[null,null,"Visninger til Nedslagspunkt 2 - It-systemtilstand og informationssikkerhed"]
[]
[null,null,"Visning 4.2.2.A: Myndighedens it-systemtilstand",null,null,null,null,null,"Visning 4.2.3.A: Myndighedens vedligeholdelsesratio"]
[]
[null,null,"Gruppering","It-systemer med utilstrækkeligheder i it-systemtilstanden i denne dimension","It-systemer med ingen utilstrækkeligheder i it-systemtilstanden i denne dimension, \nmen utilstrækkeligheder i andre dimensioner","It-systemer med ingen utilstrækkeligheder i de fire dimensioner","Relevante spørgsmål",null,"It-system nr.","It-system navn","Årlige totalomkostninger","årlige vedligeholdelses-omkostninger"]
[null,null,"Teknisk tilstand",{"$f":"COUNTIF(Spm.X17,0)","v":0},{"$f":"SUM(Spm.X17)-F27","v":0},{"$f":"SUM(Spm.X21)","v":0},"Spg.12, Spg.13",{"$f":"C59&\"e it-systemer\"","v":"Ikke kritiske it-systemer"},{"$f":"IF(OR(MAX($I$26:I26)=MAX(Spm.X27),I26=\"\"),NA(),MAX($I$26:I26)+1)","v":{"$error":"#N/A"}},{"$f":"INDEX(Spm.E,MATCH(I27,Spm.X27,0),1)","v":{"$error":"#N/A"}},{"$f":"INDEX(Spm.27,MATCH(I27,Spm.X27,0),1)","v":{"$error":"#N/A"}},{"$f":"INDEX(Spm.28B,MATCH(I27,Spm.X27,0),1)","v":{"$error":"#N/A"}}]
[null,null,"Dokumentation og viden",{"$f":"COUNTIF(Spm.X19,0)","v":0},{"$f":"SUM(Spm.X19)-F28","v":0},{"$f":"SUM(Spm.X21)","v":0},"Spg.17, Spg.22",{"$f":"C60&\"e it-systemer\"","v":"Forretningskritiske it-systemer"},{"$f":"IF(OR(MAX($I$26:I27)=MAX(Spm.X27),I27=\"\"),NA(),MAX($I$26:I27)+1)","v":{"$error":"#N/A"}},{"$error":"#N/A"},{"$error":"#N/A"},{"$error":"#N/A"}]
[null,null,"Kompetencer",{"$f":"COUNTIF(Spm.X18,0)","v":0},{"$f":"SUM(Spm.X18)-F29","v":0},{"$f":"SUM(Spm.X21)","v":0},"Spg.20, Spg.21",{"$f":"C61&\"e it-systemer\"","v":"Samfundskritiske it-systemer"},{"$f":"IF(OR(MAX($I$26:I28)=MAX(Spm.X27),I28=\"\"),NA(),MAX($I$26:I28)+1)","v":{"$error":"#N/A"}},{"$error":"#N/A"},{"$error":"#N/A"},{"$error":"#N/A"}]
[null,null,"Sikkerhed",{"$f":"COUNTIF(Spm.X20,0)","v":0},{"$f":"SUM(Spm.X20)-F30","v":0},{"$f":"SUM(Spm.X21)","v":0},"Spg.23, Spg.24, Spg.25, Spg.26",null,{"$f":"IF(OR(MAX($I$26:I29)=MAX(Spm.X27),I29=\"\"),NA(),MAX($I$26:I29)+1)","v":{"$error":"#N/A"}},{"$error":"#N/A"},{"$error":"#N/A"},{"$error":"#N/A"}]
[null,null,null,null,null,null,null,null,{"$f":"IF(OR(MAX($I$26:I30)=MAX(Spm.X27),I30=\"\"),NA(),MAX($I$26:I30)+1)","v":{"$error":"#N/A"}},{"$error":"#N/A"},{"$error":"#N/A"},{"$error":"#N/A"}]
[null,null,null,null,null,null,null,null,{"$f":"IF(OR(MAX($I$26:I31)=MAX(Spm.X27),I31=\"\"),NA(),MAX($I$26:I31)+1)","v":{"$error":"#N/A"}},{"$error":"#N/A"},{"$error":"#N/A"},{"$error":"#N/A"}]
[null,null,null,null,null,null,null,null,{"$f":"IF(OR(MAX($I$26:I32)=MAX(Spm.X27),I32=\"\"),NA(),MAX($I$26:I32)+1)","v":{"$error":"#N/A"}},{"$error":"#N/A"},{"$error":"#N/A"},{"$error":"#N/A"}]
[null,null,null,null,null,null,null,null,{"$f":"IF(OR(MAX($I$26:I33)=MAX(Spm.X27),I33=\"\"),NA(),MAX($I$26:I33)+1)","v":{"$error":"#N/A"}},{"$error":"#N/A"},{"$error":"#N/A"},{"$error":"#N/A"}]
[null,null,null,null,null,null,null,null,{"$f":"IF(OR(MAX($I$26:I34)=MAX(Spm.X27),I34=\"\"),NA(),MAX($I$26:I34)+1)","v":{"$error":"#N/A"}},{"$error":"#N/A"},{"$error":"#N/A"},{"$error":"#N/A"}]
[null,null,null,null,null,null,null,null,{"$f":"IF(OR(MAX($I$26:I35)=MAX(Spm.X27),I35=\"\"),NA(),MAX($I$26:I35)+1)","v":{"$error":"#N/A"}},{"$error":"#N/A"},{"$error":"#N/A"},{"$error":"#N/A"}]
[null,null,null,null,null,null,null,null,{"$f":"IF(OR(MAX($I$26:I36)=MAX(Spm.X27),I36=\"\"),NA(),MAX($I$26:I36)+1)","v":{"$error":"#N/A"}},{"$error":"#N/A"},{"$error":"#N/A"},{"$error":"#N/A"}]
[null,null,null,null,null,null,null,null,{"$f":"IF(OR(MAX($I$26:I37)=MAX(Spm.X27),I37=\"\"),NA(),MAX($I$26:I37)+1)","v":{"$error":"#N/A"}},{"$error":"#N/A"},{"$error":"#N/A"},{"$error":"#N/A"}]
[null,null,null,null,null,null,null,null,{"$f":"IF(OR(MAX($I$26:I38)=MAX(Spm.X27),I38=\"\"),NA(),MAX($I$26:I38)+1)","v":{"$error":"#N/A"}},{"$error":"#N/A"},{"$error":"#N/A"},{"$error":"#N/A"}]
[null,null,null,null,null,null,null,null,{"$f":"IF(OR(MAX($I$26:I39)=MAX(Spm.X27),I39=\"\"),NA(),MAX($I$26:I39)+1)","v":{"$error":"#N/A"}},{"$error":"#N/A"},{"$error":"#N/A"},{"$error":"#N/A"}]
[null,null,null,null,null,null,null,null,{"$f":"IF(OR(MAX($I$26:I40)=MAX(Spm.X27),I40=\"\"),NA(),MAX($I$26:I40)+1)","v":{"$error":"#N/A"}},{"$error":"#N/A"},{"$error":"#N/A"},{"$error":"#N/A"}]
[null,null,null,null,null,null,null,null,{"$f":"IF(OR(MAX($I$26:I41)=MAX(Spm.X27),I41=\"\"),NA(),MAX($I$26:I41)+1)","v":{"$error":"#N/A"}},{"$error":"#N/A"},{"$error":"#N/A"},{"$error":"#N/A"}]
[null,null,null,null,null,null,null,null,{"$f":"IF(OR(MAX($I$26:I42)=MAX(Spm.X27),I42=\"\"),NA(),MAX($I$26:I42)+1)","v":{"$error":"#N/A"}},{"$error":"#N/A"},{"$error":"#N/A"},{"$error":"#N/A"}]
[null,null,null,null,null,null,null,null,{"$f":"IF(OR(MAX($I$26:I43)=MAX(Spm.X27),I43=\"\"),NA(),MAX($I$26:I43)+1)","v":{"$error":"#N/A"}},{"$error":"#N/A"},{"$error":"#N/A"},{"$error":"#N/A"}]
[null,null,null,null,null,null,null,null,{"$f":"IF(OR(MAX($I$26:I44)=MAX(Spm.X27),I44=\"\"),NA(),MAX($I$26:I44)+1)","v":{"$error":"#N/A"}},{"$error":"#N/A"},{"$error":"#N/A"},{"$error":"#N/A"}]
[null,null,null,null,null,null,null,null,{"$f":"IF(OR(MAX($I$26:I45)=MAX(Spm.X27),I45=\"\"),NA(),MAX($I$26:I45)+1)","v":{"$error":"#N/A"}},{"$error":"#N/A"},{"$error":"#N/A"},{"$error":"#N/A"}]
[]
[]
[null,null,"Visning 4.2.4.A: Ressourcer og proces for håndtering af nøglepersonsafhængigheder",null,null,null,null,null,"Visning 4.2.5.A: Ressourcer og dokumentation"]
[]
[null,null," ","Ingen opdateret proces for håndtering\naf nøglepersonsafhængigheder findes",null,"Opdateret proces for håndtering\naf nøglepersonsafhængigheder findes",null,null," ","Dokumentation er i al væsentlighed ikke retvisende for it-systemet",null,"Dokumentation er i al væsentlighed retvisende for it-systemet"]
[null,null,"Én eller ingen ressourcer med teknisk viden om it-systemet",{"$f":"SUM(COUNTIFS(Spm.20,{\"2. Nej\",\"3. Ved ikke\"},Spm.21,{\"2. Nej\";\"3. Ved ikke\"}))","v":0},null,{"$f":"SUM(COUNTIFS(Spm.20,{\"2. Nej\",\"3. Ved ikke\"},Spm.21,{\"1. Ja\"}))","v":0},null,null,"Én eller ingen ressourcer med teknisk viden om it-systemet",{"$f":"SUM(COUNTIFS(Spm.20,{\"2. Nej\",\"3. Ved ikke\"},Spm.17,{\"2. Nej\";\"3. Ved ikke\"}))","v":0},null,{"$f":"SUM(COUNTIFS(Spm.20,{\"2. Nej\",\"3. Ved ikke\"},Spm.17,{\"1. Ja\"}))","v":0}]
[null,null,"Flere ressourcer med teknisk viden om it-systemet",{"$f":"SUM(COUNTIFS(Spm.20,{\"1. Ja\"},Spm.21,{\"2. Nej\",\"3. Ved ikke\"}))","v":0},null,{"$f":"SUM(COUNTIFS(Spm.20,{\"1. Ja\"},Spm.21,{\"1. Ja\"}))","v":0},null,null,"Flere ressourcer med teknisk viden om it-systemet",{"$f":"SUM(COUNTIFS(Spm.20,{\"1. Ja\"},Spm.17,{\"2. Nej\",\"3. Ved ikke\"}))","v":0},null,{"$f":"SUM(COUNTIFS(Spm.20,{\"1. Ja\"},Spm.17,{\"1. Ja\"}))","v":0}]
[]
[]
[null,null,"Visning 4.2.6.A: Informationssikkerhed"]
[]
[null,null,"It-systemkritikalitet","Forvaltningen af it-systemet overholder de gældende politikker og retningslinjer, som myndigheden har implementeret i henhold til ISO 27001-standarden, og it-systemet imødekommer kravene i databeskyttelsesforordningen","Forvaltningen af it-systemet overholder de gældende politikker og retningslinjer, som myndigheden har implementeret i henhold til ISO 27001-standarden, men it-systemet imødekommer ikke kravene i databeskyttelsesforordningen","Forvaltningen af it-systemet overholder ikke de gældende politikker og retningslinjer, som myndigheden har implementeret i henhold til ISO 27001-standarden, men it-systemet imødekommer kravene i databeskyttelsesforordningen","Forvaltningen af it-systemet overholder ikke de gældende politikker og retningslinjer, som myndigheden har implementeret i henhold til ISO 27001-standarden, og it-systemet imødekommer ikke kravene i databeskyttelsesforordningen"]
[null,null,"Ikke kritisk",{"$f":"SUM(COUNTIFS(Spm.J,$C59,Spm.23,{\"1. Ja\",\"*Ikke relevant*\"},Spm.24,{\"*Ja,*\";\"*Ikke relevant*\"}))","v":0},{"$f":"SUM(COUNTIFS(Spm.J,$C59,Spm.23,{\"1. Ja\",\"*Ikke relevant*\"},Spm.24,\"*Nej*\"))","v":0},{"$f":"SUM(COUNTIFS(Spm.J,$C59,Spm.23,\"2. Nej\",Spm.24,{\"*Ja,*\",\"*Ikke relevant*\"}))","v":0},{"$f":"COUNTIF(Spm.J,C59)-SUM('Data til anb. visninger'!D59:F59)","v":0}]
[null,null,"Forretningskritisk",{"$f":"SUM(COUNTIFS(Spm.J,$C60,Spm.23,{\"1. Ja\",\"*Ikke relevant*\"},Spm.24,{\"*Ja,*\";\"*Ikke relevant*\"}))","v":0},{"$f":"SUM(COUNTIFS(Spm.J,$C60,Spm.23,{\"1. Ja\",\"*Ikke relevant*\"},Spm.24,\"*Nej*\"))","v":0},{"$f":"SUM(COUNTIFS(Spm.J,$C60,Spm.23,\"2. Nej\",Spm.24,{\"*Ja,*\",\"*Ikke relevant*\"}))","v":0},{"$f":"COUNTIF(Spm.J,C60)-SUM('Data til anb. visninger'!D60:F60)","v":0}]
[null,null,"Samfundskritisk",{"$f":"SUM(COUNTIFS(Spm.J,$C61,Spm.23,{\"1. Ja\",\"*Ikke relevant*\"},Spm.24,{\"*Ja,*\";\"*Ikke relevant*\"}))","v":0},{"$f":"SUM(COUNTIFS(Spm.J,$C61,Spm.23,{\"1. Ja\",\"*Ikke relevant*\"},Spm.24,\"*Nej*\"))","v":0},{"$f":"SUM(COUNTIFS(Spm.J,$C61,Spm.23,\"2. Nej\",Spm.24,{\"*Ja,*\",\"*Ikke relevant*\"}))","v":0},{"$f":"COUNTIF(Spm.J,C61)-SUM('Data til anb. visninger'!D61:F61)","v":0}]
[]
[]
[]
[null,null,"Visninger til Nedslagspunkt 3 - Sourcing og udbud samt kontrakt- og leverandørstyring"]
[]
[null,null,"Visning 4.3.3.A: Myndighedens sourcingsammensætning for drift",null,null,null,null,null,"Visning 4.3.3.B: Myndighedens sourcingsammensætning for vedligehold og udvikling"]
[]
[null,null,null,"Insourcet","Statens IT","Delvist outsourcet","Overvejende outsourcet",null,null,"Insourcet","Delvist outsourcet","Overvejende outsourcet"]
[null,null,"Heraf samfundskritiske it-systemer",{"$f":"COUNTIFS(Spm.K1,D$69,Spm.J,\"Samfundskritisk\")","v":0},{"$f":"COUNTIFS(Spm.K1,E$69,Spm.J,\"Samfundskritisk\")","v":0},{"$f":"COUNTIFS(Spm.K1,F$69,Spm.J,\"Samfundskritisk\")","v":0},{"$f":"COUNTIFS(Spm.K1,G$69,Spm.J,\"Samfundskritisk\")","v":0},null,"Heraf samfundskritiske it-systemer",{"$f":"COUNTIFS(Spm.K2,J$69,Spm.J,\"Samfundskritisk\")","v":0},{"$f":"COUNTIFS(Spm.K2,K$69,Spm.J,\"Samfundskritisk\")","v":0},{"$f":"COUNTIFS(Spm.K2,L$69,Spm.J,\"Samfundskritisk\")","v":0}]
[null,null,"Alle it-systemer",{"$f":"COUNTIFS(Spm.K1,D$69)","v":0},{"$f":"COUNTIFS(Spm.K1,E$69)","v":0},{"$f":"COUNTIFS(Spm.K1,F$69)","v":0},{"$f":"COUNTIFS(Spm.K1,G$69)","v":0},null,"Alle it-systemer",{"$f":"COUNTIFS(Spm.K2,J$69)","v":0},{"$f":"COUNTIFS(Spm.K2,K$69)","v":0},{"$f":"COUNTIFS(Spm.K2,L$69)","v":0}]
[]
[]
[null,null,"Visning 4.3.5.A: Myndighedens udbudsplan"]
[null,null,"Det bemærkes, at kontrakter med udløbsdato inklusive forlængelse efter sidst anførte årstal i tabellen ikke er medtaget i nedenstående tabel, og dermed heller ikke fremgår i den anbefalede visning 4.3.5.A."]
[null,null,null,null,{"$f":"DATE(YEAR(TODAY())-1,1,1)","v":"2018-01-01"},{"$f":"DATE(YEAR(E76)+1,1,1)","v":"2019-01-01"},{"$f":"DATE(YEAR(F76)+1,1,1)","v":"2020-01-01"},"2021-01-01","2022-01-01","2023-01-01","2024-01-01","2025-01-01"]
[null,null,null,"Tidligere udløbet",{"$f":"YEAR(E76)","v":2018},{"$f":"YEAR(F76)","v":2019},2020,2021,2022,2023,2024,2025,"Senere udløb","Intet kontrakt-udløb","Ukendt udløbs-dato"]
[null,null,"Genudbud planlagt - transition forventes gennemført inden kontraktens udløb",{"$f":"COUNTIFS(Spm.6.1.1,\"1. Dato (indsæt dato i næste felt)\",Spm.X22.1.1,\"<\"&E76,Spm.X22.1.3,\"Ja\")\n+COUNTIFS(Spm.6.2.1,\"1. Dato (indsæt dato i næste felt)\",Spm.X22.2.1,\"<\"&E76,Spm.X22.2.3,\"Ja\")\n+COUNTIFS(Spm.6.3.1,\"1. Dato (indsæt dato i næste felt)\",Spm.X22.3.1,\"<\"&E76,Spm.X22.3.3,\"Ja\")\n+COUNTIFS(Spm.6.4.1,\"1. Dato (indsæt dato i næste felt)\",Spm.X22.4.1,\"<\"&E76,Spm.X22.4.3,\"Ja\")\n+COUNTIFS(Spm.6.5.1,\"1. Dato (indsæt dato i næste felt)\",Spm.X22.5.1,\"<\"&E76,Spm.X22.5.3,\"Ja\")","v":0},{"$f":"COUNTIFS(Spm.6.1.1,\"1. Dato (indsæt dato i næste felt)\",Spm.X22.1.1,\">=\"&E76,Spm.X22.1.1,\"<\"&DATE(YEAR(E76)+1,1,1),Spm.X22.1.3,\"Ja\")\n+COUNTIFS(Spm.6.2.1,\"1. Dato (indsæt dato i næste felt)\",Spm.X22.2.1,\">=\"&E76,Spm.X22.2.1,\"<\"&DATE(YEAR(E76)+1,1,1),Spm.X22.2.3,\"Ja\")\n+COUNTIFS(Spm.6.3.1,\"1. Dato (indsæt dato i næste felt)\",Spm.X22.3.1,\">=\"&E76,Spm.X22.3.1,\"<\"&DATE(YEAR(E76)+1,1,1),Spm.X22.3.3,\"Ja\")\n+COUNTIFS(Spm.6.4.1,\"1. Dato (indsæt dato i næste felt)\",Spm.X22.4.1,\">=\"&E76,Spm.X22.4.1,\"<\"&DATE(YEAR(E76)+1,1,1),Spm.X22.4.3,\"Ja\")\n+COUNTIFS(Spm.6.5.1,\"1. Dato (indsæt dato i næste felt)\",Spm.X22.5.1,\">=\"&E76,Spm.X22.5.1,\"<\"&DATE(YEAR(E76)+1,1,1),Spm.X22.5.3,\"Ja\")","v":0},0,0,0,0,0,0,0,{"$f":"COUNTIFS(Spm.6.1.1,\"1. Dato (indsæt dato i næste felt)\",Spm.X22.1.1,\">=\"&DATE(YEAR(L76)+1,1,1),Spm.X22.1.3,\"Ja\")\n+COUNTIFS(Spm.6.2.1,\"1. Dato (indsæt dato i næste felt)\",Spm.X22.2.1,\">=\"&DATE(YEAR(L76)+1,1,1),Spm.X22.2.3,\"Ja\")\n+COUNTIFS(Spm.6.3.1,\"1. Dato (indsæt dato i næste felt)\",Spm.X22.3.1,\">=\"&DATE(YEAR(L76)+1,1,1),Spm.X22.3.3,\"Ja\")\n+COUNTIFS(Spm.6.4.1,\"1. Dato (indsæt dato i næste felt)\",Spm.X22.4.1,\">=\"&DATE(YEAR(L76)+1,1,1),Spm.X22.4.3,\"Ja\")\n+COUNTIFS(Spm.6.5.1,\"1. Dato (indsæt dato i næste felt)\",Spm.X22.5.1,\">=\"&DATE(YEAR(L76)+1,1,1),Spm.X22.5.3,\"Ja\")","v":0}]
[null,null,"Genudbud planlagt - transition forventes ikke gennemført inden kontraktens udløb",{"$f":"COUNTIFS(Spm.6.1.1,\"1. Dato (indsæt dato i næste felt)\",Spm.X22.1.1,\"<\"&E76,Spm.X22.1.3,\"Nej\")\n+COUNTIFS(Spm.6.2.1,\"1. Dato (indsæt dato i næste felt)\",Spm.X22.2.1,\"<\"&E76,Spm.X22.2.3,\"Nej\")\n+COUNTIFS(Spm.6.3.1,\"1. Dato (indsæt dato i næste felt)\",Spm.X22.3.1,\"<\"&E76,Spm.X22.3.3,\"Nej\")\n+COUNTIFS(Spm.6.4.1,\"1. Dato (indsæt dato i næste felt)\",Spm.X22.4.1,\"<\"&E76,Spm.X22.4.3,\"Nej\")\n+COUNTIFS(Spm.6.5.1,\"1. Dato (indsæt dato i næste felt)\",Spm.X22.5.1,\"<\"&E76,Spm.X22.5.3,\"Nej\")","v":0},{"$f":"COUNTIFS(Spm.6.1.1,\"1. Dato (indsæt dato i næste felt)\",Spm.X22.1.1,\">=\"&E76,Spm.X22.1.1,\"<\"&DATE(YEAR(E76)+1,1,1),Spm.X22.1.3,\"Nej\")\n+COUNTIFS(Spm.6.2.1,\"1. Dato (indsæt dato i næste felt)\",Spm.X22.2.1,\">=\"&E76,Spm.X22.2.1,\"<\"&DATE(YEAR(E76)+1,1,1),Spm.X22.2.3,\"Nej\")\n+COUNTIFS(Spm.6.3.1,\"1. Dato (indsæt dato i næste felt)\",Spm.X22.3.1,\">=\"&E76,Spm.X22.3.1,\"<\"&DATE(YEAR(E76)+1,1,1),Spm.X22.3.3,\"Nej\")\n+COUNTIFS(Spm.6.4.1,\"1. Dato (indsæt dato i næste felt)\",Spm.X22.4.1,\">=\"&E76,Spm.X22.4.1,\"<\"&DATE(YEAR(E76)+1,1,1),Spm.X22.4.3,\"Nej\")\n+COUNTIFS(Spm.6.5.1,\"1. Dato (indsæt dato i næste felt)\",Spm.X22.5.1,\">=\"&E76,Spm.X22.5.1,\"<\"&DATE(YEAR(E76)+1,1,1),Spm.X22.5.3,\"Nej\")","v":0},0,0,0,0,0,0,0,{"$f":"COUNTIFS(Spm.6.1.1,\"1. Dato (indsæt dato i næste felt)\",Spm.X22.1.1,\">=\"&DATE(YEAR(L76)+1,1,1),Spm.X22.1.3,\"Nej\")\n+COUNTIFS(Spm.6.2.1,\"1. Dato (indsæt dato i næste felt)\",Spm.X22.2.1,\">=\"&DATE(YEAR(L76)+1,1,1),Spm.X22.2.3,\"Nej\")\n+COUNTIFS(Spm.6.3.1,\"1. Dato (indsæt dato i næste felt)\",Spm.X22.3.1,\">=\"&DATE(YEAR(L76)+1,1,1),Spm.X22.3.3,\"Nej\")\n+COUNTIFS(Spm.6.4.1,\"1. Dato (indsæt dato i næste felt)\",Spm.X22.4.1,\">=\"&DATE(YEAR(L76)+1,1,1),Spm.X22.4.3,\"Nej\")\n+COUNTIFS(Spm.6.5.1,\"1. Dato (indsæt dato i næste felt)\",Spm.X22.5.1,\">=\"&DATE(YEAR(L76)+1,1,1),Spm.X22.5.3,\"Nej\")","v":0}]
[null,null,"Genudbud ikke planlagt",{"$f":"SUM(COUNTIFS(Spm.6.1.1,\"1. Dato (indsæt dato i næste felt)\",Spm.X22.1.1,\"<\"&E76,Spm.8.1.1,{\"2. Ikke planlagt\";\"3. Ved ikke\"}))\n+SUM(COUNTIFS(Spm.6.2.1,\"1. Dato (indsæt dato i næste felt)\",Spm.X22.2.1,\"<\"&E76,Spm.8.2.1,{\"2. Ikke planlagt\";\"3. Ved ikke\"}))\n+SUM(COUNTIFS(Spm.6.3.1,\"1. Dato (indsæt dato i næste felt)\",Spm.X22.3.1,\"<\"&E76,Spm.8.3.1,{\"2. Ikke planlagt\";\"3. Ved ikke\"}))\n+SUM(COUNTIFS(Spm.6.4.1,\"1. Dato (indsæt dato i næste felt)\",Spm.X22.4.1,\"<\"&E76,Spm.8.4.1,{\"2. Ikke planlagt\";\"3. Ved ikke\"}))\n+SUM(COUNTIFS(Spm.6.5.1,\"1. Dato (indsæt dato i næste felt)\",Spm.X22.5.1,\"<\"&E76,Spm.8.5.1,{\"2. Ikke planlagt\";\"3. Ved ikke\"}))","v":0},{"$f":"SUM(COUNTIFS(Spm.6.1.1,\"1. Dato (indsæt dato i næste felt)\",Spm.X22.1.1,\">=\"&E76,Spm.X22.1.1,\"<\"&DATE(YEAR(E76)+1,1,1),Spm.8.1.1,{\"2. Ikke planlagt\";\"3. Ved ikke\"}))\n+SUM(COUNTIFS(Spm.6.2.1,\"1. Dato (indsæt dato i næste felt)\",Spm.X22.2.1,\">=\"&E76,Spm.X22.2.1,\"<\"&DATE(YEAR(E76)+1,1,1),Spm.8.2.1,{\"2. Ikke planlagt\";\"3. Ved ikke\"}))\n+SUM(COUNTIFS(Spm.6.3.1,\"1. Dato (indsæt dato i næste felt)\",Spm.X22.3.1,\">=\"&E76,Spm.X22.3.1,\"<\"&DATE(YEAR(E76)+1,1,1),Spm.8.3.1,{\"2. Ikke planlagt\";\"3. Ved ikke\"}))\n+SUM(COUNTIFS(Spm.6.4.1,\"1. Dato (indsæt dato i næste felt)\",Spm.X22.4.1,\">=\"&E76,Spm.X22.4.1,\"<\"&DATE(YEAR(E76)+1,1,1),Spm.8.4.1,{\"2. Ikke planlagt\";\"3. Ved ikke\"}))\n+SUM(COUNTIFS(Spm.6.5.1,\"1. Dato (indsæt dato i næste felt)\",Spm.X22.5.1,\">=\"&E76,Spm.X22.5.1,\"<\"&DATE(YEAR(E76)+1,1,1),Spm.8.5.1,{\"2. Ikke planlagt\";\"3. Ved ikke\"}))","v":0},{"$f":"SUM(COUNTIFS(Spm.6.1.1,\"1. Dato (indsæt dato i næste felt)\",Spm.X22.1.1,\">=\"&F76,Spm.X22.1.1,\"<\"&DATE(YEAR(F76)+1,1,1),Spm.8.1.1,{\"2. Ikke planlagt\";\"3. Ved ikke\"}))\n+SUM(COUNTIFS(Spm.6.2.1,\"1. Dato (indsæt dato i næste felt)\",Spm.X22.2.1,\">=\"&F76,Spm.X22.2.1,\"<\"&DATE(YEAR(F76)+1,1,1),Spm.8.2.1,{\"2. Ikke planlagt\";\"3. Ved ikke\"}))\n+SUM(COUNTIFS(Spm.6.3.1,\"1. Dato (indsæt dato i næste felt)\",Spm.X22.3.1,\">=\"&F76,Spm.X22.3.1,\"<\"&DATE(YEAR(F76)+1,1,1),Spm.8.3.1,{\"2. Ikke planlagt\";\"3. Ved ikke\"}))\n+SUM(COUNTIFS(Spm.6.4.1,\"1. Dato (indsæt dato i næste felt)\",Spm.X22.4.1,\">=\"&F76,Spm.X22.4.1,\"<\"&DATE(YEAR(F76)+1,1,1),Spm.8.4.1,{\"2. Ikke planlagt\";\"3. Ved ikke\"}))\n+SUM(COUNTIFS(Spm.6.5.1,\"1. Dato (indsæt dato i næste felt)\",Spm.X22.5.1,\">=\"&F76,Spm.X22.5.1,\"<\"&DATE(YEAR(F76)+1,1,1),Spm.8.5.1,{\"2. Ikke planlagt\";\"3. Ved ikke\"}))","v":0},{"$f":"SUM(COUNTIFS(Spm.6.1.1,\"1. Dato (indsæt dato i næste felt)\",Spm.X22.1.1,\">=\"&G76,Spm.X22.1.1,\"<\"&DATE(YEAR(G76)+1,1,1),Spm.8.1.1,{\"2. Ikke planlagt\";\"3. Ved ikke\"}))\n+SUM(COUNTIFS(Spm.6.2.1,\"1. Dato (indsæt dato i næste felt)\",Spm.X22.2.1,\">=\"&G76,Spm.X22.2.1,\"<\"&DATE(YEAR(G76)+1,1,1),Spm.8.2.1,{\"2. Ikke planlagt\";\"3. Ved ikke\"}))\n+SUM(COUNTIFS(Spm.6.3.1,\"1. Dato (indsæt dato i næste felt)\",Spm.X22.3.1,\">=\"&G76,Spm.X22.3.1,\"<\"&DATE(YEAR(G76)+1,1,1),Spm.8.3.1,{\"2. Ikke planlagt\";\"3. Ved ikke\"}))\n+SUM(COUNTIFS(Spm.6.4.1,\"1. Dato (indsæt dato i næste felt)\",Spm.X22.4.1,\">=\"&G76,Spm.X22.4.1,\"<\"&DATE(YEAR(G76)+1,1,1),Spm.8.4.1,{\"2. Ikke planlagt\";\"3. Ved ikke\"}))\n+SUM(COUNTIFS(Spm.6.5.1,\"1. Dato (indsæt dato i næste felt)\",Spm.X22.5.1,\">=\"&G76,Spm.X22.5.1,\"<\"&DATE(YEAR(G76)+1,1,1),Spm.8.5.1,{\"2. Ikke planlagt\";\"3. Ved ikke\"}))","v":0},{"$f":"SUM(COUNTIFS(Spm.6.1.1,\"1. Dato (indsæt dato i næste felt)\",Spm.X22.1.1,\">=\"&H76,Spm.X22.1.1,\"<\"&DATE(YEAR(H76)+1,1,1),Spm.8.1.1,{\"2. Ikke planlagt\";\"3. Ved ikke\"}))\n+SUM(COUNTIFS(Spm.6.2.1,\"1. Dato (indsæt dato i næste felt)\",Spm.X22.2.1,\">=\"&H76,Spm.X22.2.1,\"<\"&DATE(YEAR(H76)+1,1,1),Spm.8.2.1,{\"2. Ikke planlagt\";\"3. Ved ikke\"}))\n+SUM(COUNTIFS(Spm.6.3.1,\"1. Dato (indsæt dato i næste felt)\",Spm.X22.3.1,\">=\"&H76,Spm.X22.3.1,\"<\"&DATE(YEAR(H76)+1,1,1),Spm.8.3.1,{\"2. Ikke planlagt\";\"3. Ved ikke\"}))\n+SUM(COUNTIFS(Spm.6.4.1,\"1. Dato (indsæt dato i næste felt)\",Spm.X22.4.1,\">=\"&H76,Spm.X22.4.1,\"<\"&DATE(YEAR(H76)+1,1,1),Spm.8.4.1,{\"2. Ikke planlagt\";\"3. Ved ikke\"}))\n+SUM(COUNTIFS(Spm.6.5.1,\"1. Dato (indsæt dato i næste felt)\",Spm.X22.5.1,\">=\"&H76,Spm.X22.5.1,\"<\"&DATE(YEAR(H76)+1,1,1),Spm.8.5.1,{\"2. Ikke planlagt\";\"3. Ved ikke\"}))","v":0},{"$f":"SUM(COUNTIFS(Spm.6.1.1,\"1. Dato (indsæt dato i næste felt)\",Spm.X22.1.1,\">=\"&I76,Spm.X22.1.1,\"<\"&DATE(YEAR(I76)+1,1,1),Spm.8.1.1,{\"2. Ikke planlagt\";\"3. Ved ikke\"}))\n+SUM(COUNTIFS(Spm.6.2.1,\"1. Dato (indsæt dato i næste felt)\",Spm.X22.2.1,\">=\"&I76,Spm.X22.2.1,\"<\"&DATE(YEAR(I76)+1,1,1),Spm.8.2.1,{\"2. Ikke planlagt\";\"3. Ved ikke\"}))\n+SUM(COUNTIFS(Spm.6.3.1,\"1. Dato (indsæt dato i næste felt)\",Spm.X22.3.1,\">=\"&I76,Spm.X22.3.1,\"<\"&DATE(YEAR(I76)+1,1,1),Spm.8.3.1,{\"2. Ikke planlagt\";\"3. Ved ikke\"}))\n+SUM(COUNTIFS(Spm.6.4.1,\"1. Dato (indsæt dato i næste felt)\",Spm.X22.4.1,\">=\"&I76,Spm.X22.4.1,\"<\"&DATE(YEAR(I76)+1,1,1),Spm.8.4.1,{\"2. Ikke planlagt\";\"3. Ved ikke\"}))\n+SUM(COUNTIFS(Spm.6.5.1,\"1. Dato (indsæt dato i næste felt)\",Spm.X22.5.1,\">=\"&I76,Spm.X22.5.1,\"<\"&DATE(YEAR(I76)+1,1,1),Spm.8.5.1,{\"2. Ikke planlagt\";\"3. Ved ikke\"}))","v":0},{"$f":"SUM(COUNTIFS(Spm.6.1.1,\"1. Dato (indsæt dato i næste felt)\",Spm.X22.1.1,\">=\"&J76,Spm.X22.1.1,\"<\"&DATE(YEAR(J76)+1,1,1),Spm.8.1.1,{\"2. Ikke planlagt\";\"3. Ved ikke\"}))\n+SUM(COUNTIFS(Spm.6.2.1,\"1. Dato (indsæt dato i næste felt)\",Spm.X22.2.1,\">=\"&J76,Spm.X22.2.1,\"<\"&DATE(YEAR(J76)+1,1,1),Spm.8.2.1,{\"2. Ikke planlagt\";\"3. Ved ikke\"}))\n+SUM(COUNTIFS(Spm.6.3.1,\"1. Dato (indsæt dato i næste felt)\",Spm.X22.3.1,\">=\"&J76,Spm.X22.3.1,\"<\"&DATE(YEAR(J76)+1,1,1),Spm.8.3.1,{\"2. Ikke planlagt\";\"3. Ved ikke\"}))\n+SUM(COUNTIFS(Spm.6.4.1,\"1. Dato (indsæt dato i næste felt)\",Spm.X22.4.1,\">=\"&J76,Spm.X22.4.1,\"<\"&DATE(YEAR(J76)+1,1,1),Spm.8.4.1,{\"2. Ikke planlagt\";\"3. Ved ikke\"}))\n+SUM(COUNTIFS(Spm.6.5.1,\"1. Dato (indsæt dato i næste felt)\",Spm.X22.5.1,\">=\"&J76,Spm.X22.5.1,\"<\"&DATE(YEAR(J76)+1,1,1),Spm.8.5.1,{\"2. Ikke planlagt\";\"3. Ved ikke\"}))","v":0},{"$f":"SUM(COUNTIFS(Spm.6.1.1,\"1. Dato (indsæt dato i næste felt)\",Spm.X22.1.1,\">=\"&K76,Spm.X22.1.1,\"<\"&DATE(YEAR(K76)+1,1,1),Spm.8.1.1,{\"2. Ikke planlagt\";\"3. Ved ikke\"}))\n+SUM(COUNTIFS(Spm.6.2.1,\"1. Dato (indsæt dato i næste felt)\",Spm.X22.2.1,\">=\"&K76,Spm.X22.2.1,\"<\"&DATE(YEAR(K76)+1,1,1),Spm.8.2.1,{\"2. Ikke planlagt\";\"3. Ved ikke\"}))\n+SUM(COUNTIFS(Spm.6.3.1,\"1. Dato (indsæt dato i næste felt)\",Spm.X22.3.1,\">=\"&K76,Spm.X22.3.1,\"<\"&DATE(YEAR(K76)+1,1,1),Spm.8.3.1,{\"2. Ikke planlagt\";\"3. Ved ikke\"}))\n+SUM(COUNTIFS(Spm.6.4.1,\"1. Dato (indsæt dato i næste felt)\",Spm.X22.4.1,\">=\"&K76,Spm.X22.4.1,\"<\"&DATE(YEAR(K76)+1,1,1),Spm.8.4.1,{\"2. Ikke planlagt\";\"3. Ved ikke\"}))\n+SUM(COUNTIFS(Spm.6.5.1,\"1. Dato (indsæt dato i næste felt)\",Spm.X22.5.1,\">=\"&K76,Spm.X22.5.1,\"<\"&DATE(YEAR(K76)+1,1,1),Spm.8.5.1,{\"2. Ikke planlagt\";\"3. Ved ikke\"}))","v":0},{"$f":"SUM(COUNTIFS(Spm.6.1.1,\"1. Dato (indsæt dato i næste felt)\",Spm.X22.1.1,\">=\"&L76,Spm.X22.1.1,\"<\"&DATE(YEAR(L76)+1,1,1),Spm.8.1.1,{\"2. Ikke planlagt\";\"3. Ved ikke\"}))\n+SUM(COUNTIFS(Spm.6.2.1,\"1. Dato (indsæt dato i næste felt)\",Spm.X22.2.1,\">=\"&L76,Spm.X22.2.1,\"<\"&DATE(YEAR(L76)+1,1,1),Spm.8.2.1,{\"2. Ikke planlagt\";\"3. Ved ikke\"}))\n+SUM(COUNTIFS(Spm.6.3.1,\"1. Dato (indsæt dato i næste felt)\",Spm.X22.3.1,\">=\"&L76,Spm.X22.3.1,\"<\"&DATE(YEAR(L76)+1,1,1),Spm.8.3.1,{\"2. Ikke planlagt\";\"3. Ved ikke\"}))\n+SUM(COUNTIFS(Spm.6.4.1,\"1. Dato (indsæt dato i næste felt)\",Spm.X22.4.1,\">=\"&L76,Spm.X22.4.1,\"<\"&DATE(YEAR(L76)+1,1,1),Spm.8.4.1,{\"2. Ikke planlagt\";\"3. Ved ikke\"}))\n+SUM(COUNTIFS(Spm.6.5.1,\"1. Dato (indsæt dato i næste felt)\",Spm.X22.5.1,\">=\"&L76,Spm.X22.5.1,\"<\"&DATE(YEAR(L76)+1,1,1),Spm.8.5.1,{\"2. Ikke planlagt\";\"3. Ved ikke\"}))","v":0},{"$f":"SUM(COUNTIFS(Spm.6.1.1,\"1. Dato (indsæt dato i næste felt)\",Spm.X22.1.1,\">=\"&DATE(YEAR(L76)+1,1,1),Spm.8.1.1,{\"2. Ikke planlagt\";\"3. Ved ikke\"}))\n+SUM(COUNTIFS(Spm.6.2.1,\"1. Dato (indsæt dato i næste felt)\",Spm.X22.2.1,\">=\"&DATE(YEAR(L76)+1,1,1),Spm.8.2.1,{\"2. Ikke planlagt\";\"3. Ved ikke\"}))\n+SUM(COUNTIFS(Spm.6.3.1,\"1. Dato (indsæt dato i næste felt)\",Spm.X22.3.1,\">=\"&DATE(YEAR(L76)+1,1,1),Spm.8.3.1,{\"2. Ikke planlagt\";\"3. Ved ikke\"}))\n+SUM(COUNTIFS(Spm.6.4.1,\"1. Dato (indsæt dato i næste felt)\",Spm.X22.4.1,\">=\"&DATE(YEAR(L76)+1,1,1),Spm.8.4.1,{\"2. Ikke planlagt\";\"3. Ved ikke\"}))\n+SUM(COUNTIFS(Spm.6.5.1,\"1. Dato (indsæt dato i næste felt)\",Spm.X22.5.1,\">=\"&DATE(YEAR(L76)+1,1,1),Spm.8.5.1,{\"2. Ikke planlagt\";\"3. Ved ikke\"}))","v":0},{"$f":"SUM(COUNTIFS(Spm.6.1.1,\"2. Ingen udløbsdato\",Spm.8.1.1,{\"2. Ikke planlagt\";\"3. Ved ikke\"}))\n+SUM(COUNTIFS(Spm.6.2.1,\"2. Ingen udløbsdato\",Spm.8.2.1,{\"2. Ikke planlagt\";\"3. Ved ikke\"}))\n+SUM(COUNTIFS(Spm.6.3.1,\"2. Ingen udløbsdato\",Spm.8.3.1,{\"2. Ikke planlagt\";\"3. Ved ikke\"}))\n+SUM(COUNTIFS(Spm.6.4.1,\"2. Ingen udløbsdato\",Spm.8.4.1,{\"2. Ikke planlagt\";\"3. Ved ikke\"}))\n+SUM(COUNTIFS(Spm.6.5.1,\"2. Ingen udløbsdato\",Spm.8.5.1,{\"2. Ikke planlagt\";\"3. Ved ikke\"}))","v":0},{"$f":"SUM(COUNTIFS(Spm.6.1.1,\"3. Ved ikke\",Spm.8.1.1,{\"2. Ikke planlagt\";\"3. Ved ikke\"}))\n+SUM(COUNTIFS(Spm.6.2.1,\"3. Ved ikke\",Spm.8.2.1,{\"2. Ikke planlagt\";\"3. Ved ikke\"}))\n+SUM(COUNTIFS(Spm.6.3.1,\"3. Ved ikke\",Spm.8.3.1,{\"2. Ikke planlagt\";\"3. Ved ikke\"}))\n+SUM(COUNTIFS(Spm.6.4.1,\"3. Ved ikke\",Spm.8.4.1,{\"2. Ikke planlagt\";\"3. Ved ikke\"}))\n+SUM(COUNTIFS(Spm.6.5.1,\"3. Ved ikke\",Spm.8.5.1,{\"2. Ikke planlagt\";\"3. Ved ikke\"}))","v":0}]
[null,null,"Genudbud planlagt - ingen dato for udløb af nuværende kontrakt",null,null,null,null,null,null,null,null,null,null,{"$f":"SUM(COUNTIFS(Spm.6.1.1,\"2. Ingen udløbsdato\",Spm.8.1.1,\"1. Dato (indsæt dato i næste felt)\"))\n+SUM(COUNTIFS(Spm.6.2.1,\"2. Ingen udløbsdato\",Spm.8.2.1,\"1. Dato (indsæt dato i næste felt)\"))\n+SUM(COUNTIFS(Spm.6.3.1,\"2. Ingen udløbsdato\",Spm.8.3.1,\"1. Dato (indsæt dato i næste felt)\"))\n+SUM(COUNTIFS(Spm.6.4.1,\"2. Ingen udløbsdato\",Spm.8.4.1,\"1. Dato (indsæt dato i næste felt)\"))\n+SUM(COUNTIFS(Spm.6.5.1,\"2. Ingen udløbsdato\",Spm.8.5.1,\"1. Dato (indsæt dato i næste felt)\"))","v":0},{"$f":"COUNTIFS(Spm.6.1.1,\"3. Ved ikke\",Spm.8.1.1,\"1. Dato (indsæt dato i næste felt)\")\n+COUNTIFS(Spm.6.2.1,\"3. Ved ikke\",Spm.8.2.1,\"1. Dato (indsæt dato i næste felt)\")\n+COUNTIFS(Spm.6.3.1,\"3. Ved ikke\",Spm.8.3.1,\"1. Dato (indsæt dato i næste felt)\")\n+COUNTIFS(Spm.6.4.1,\"3. Ved ikke\",Spm.8.4.1,\"1. Dato (indsæt dato i næste felt)\")\n+COUNTIFS(Spm.6.5.1,\"3. Ved ikke\",Spm.8.5.1,\"1. Dato (indsæt dato i næste felt)\")","v":0}]
[null,null,"Total",{"$f":"SUM(D78:D81)","v":0},{"$f":"SUM(E78:E81)","v":0},{"$f":"SUM(F78:F81)","v":0},0,0,0,0,0,0,0,{"$f":"SUM(N78:N81)","v":0},{"$f":"SUM(O78:O81)","v":0}]
[]
[]
[]
[null,null,"Visninger til Nedslagspunkt 4 - Forretningsunderstøttelse for samfundskritiske it-systemer"]
[]
[null,null,"Visning 4.4.2.A: Forsyningssikkerhed for myndighedens samfundskritiske it-systemer"]
[]
[null,null,"Gruppering","Samfundskritiske it-systemer med utilstrækkeligheder i it-systemtilstanden i denne dimension","Samfundskritiske it-systemer med ingen utilstrækkeligheder i it-systemtilstanden i denne dimension, \nmen utilstrækkeligheder i andre dimensioner","Samfundskritiske it-systemer med ingen utilstrækkeligheder i de fire dimensioner","Relevante spørgsmål"]
[null,null,"Teknisk tilstand",{"$f":"COUNTIFS(Spm.J,\"Samfundskritisk\",Spm.X17,0)","v":0},{"$f":"SUMIF(Spm.J,\"Samfundskritisk\",Spm.X17)-F91","v":0},{"$f":"SUMIF(Spm.J,\"Samfundskritisk\",Spm.X21)","v":0},"Spg.12, Spg.13"]
[null,null,"Dokumentation og viden",{"$f":"COUNTIFS(Spm.J,\"Samfundskritisk\",Spm.X19,0)","v":0},{"$f":"SUMIF(Spm.J,\"Samfundskritisk\",Spm.X19)-F92","v":0},{"$f":"SUMIF(Spm.J,\"Samfundskritisk\",Spm.X21)","v":0},"Spg.17, Spg.22"]
[null,null,"Kompetencer",{"$f":"COUNTIFS(Spm.J,\"Samfundskritisk\",Spm.X18,0)","v":0},{"$f":"SUMIF(Spm.J,\"Samfundskritisk\",Spm.X18)-F93","v":0},{"$f":"SUMIF(Spm.J,\"Samfundskritisk\",Spm.X21)","v":0},"Spg.20, Spg.21"]
[null,null,"Sikkerhed",{"$f":"COUNTIFS(Spm.J,\"Samfundskritisk\",Spm.X20,0)","v":0},{"$f":"SUMIF(Spm.J,\"Samfundskritisk\",Spm.X20)-F94","v":0},{"$f":"SUMIF(Spm.J,\"Samfundskritisk\",Spm.X21)","v":0},"Spg.23, Spg.24, Spg.25, Spg.26"]
[null,null,"Alle grupperinger",{"$f":"COUNTIFS(Spm.J,\"Samfundskritisk\",Spm.X21,0)","v":0},null,{"$f":"SUMIF(Spm.J,\"Samfundskritisk\",Spm.X21)","v":0},"Alle"]
[]
[]
[null,null,"Visning 4.4.3.A: Forretningsunderstøttelse, teknisk tilstand og årlige omkostninger for samfundskritiske it-systemer"]
[null,null,"Antal it-systemer:",{"$f":"COUNT(C101:C130)","v":0},"Kolonnerne H til K i nedenstående tabel bruges udelukkende som hjælpekolonner til grafen i visning 4.4.3.A."]
[null,null,"It-system nr.","Totale samlede årlige it-omkostninger","It-systemnavn","Tilfredshed - Forret-ningsunderstøttelse","Tilfredshed - Teknisk tilstand","Sammlægning af scores","Samme tilfreds-hedsresultat?","Just. tilfredshed med forretningsund.","Justeret tilfredshed med teknisk tilstand"]
[null,null,{"$f":"IF(OR(MAX($C$100:C100)=MAX(Spm.X10),C100=\"\"),NA(),MAX($C$100:C100)+1)","v":{"$error":"#N/A"}},{"$f":"IF(C101=\"\",NA(),\nIF(IFERROR(INDEX(Spm.27,MATCH(C101,Spm.X10,0)),NA())=0,0.00001,IFERROR(INDEX(Spm.27,MATCH(C101,Spm.X10,0)),NA())))","v":{"$error":"#N/A"}},{"$f":"IF(C101<>\"\",IFERROR(INDEX(Spm.E,MATCH(C101,Spm.X10,0)),NA()),NA())","v":{"$error":"#N/A"}},{"$f":"IF(C101=\"\",NA(),IFERROR(INDEX(Spm.X23,MATCH($C101,Spm.X10,0)),NA()))","v":{"$error":"#N/A"}},{"$f":"IF(C101=\"\",NA(),IFERROR(INDEX(Spm.X26,MATCH($C101,Spm.X10,0)),NA()))","v":{"$error":"#N/A"}},{"$f":"IF(E101<>\"\",CONCATENATE(F101,G101),NA())","v":{"$error":"#N/A"}},{"$f":"IF(E101=\"\",NA(),COUNTIF($H$100:H100,H101))","v":{"$error":"#N/A"}},{"$f":"IF($E101=\"\",NA(),F101-$I101*0.2)","v":{"$error":"#N/A"}},{"$f":"IF($E101=\"\",NA(),G101-$I101*0.2)","v":{"$error":"#N/A"}}]
[null,null,{"$f":"IF(OR(MAX($C$100:C101)=MAX(Spm.X10),C101=\"\"),NA(),MAX($C$100:C101)+1)","v":{"$error":"#N/A"}},{"$error":"#N/A"},{"$f":"IF($C102<>\"\",IFERROR(INDEX(Spm.E,MATCH($C102,Spm.X10,0)),NA()),NA())","v":{"$error":"#N/A"}},{"$error":"#N/A"},{"$error":"#N/A"},{"$f":"IF(E102<>\"\",CONCATENATE(F102,G102),NA())","v":{"$error":"#N/A"}},{"$f":"IF(E102=\"\",NA(),COUNTIF($H$100:H101,H102))","v":{"$error":"#N/A"}},{"$error":"#N/A"},{"$error":"#N/A"}]
[null,null,{"$f":"IF(OR(MAX($C$100:C102)=MAX(Spm.X10),C102=\"\"),NA(),MAX($C$100:C102)+1)","v":{"$error":"#N/A"}},{"$error":"#N/A"},{"$error":"#N/A"},{"$error":"#N/A"},{"$error":"#N/A"},{"$error":"#N/A"},{"$f":"IF(E103=\"\",NA(),COUNTIF($H$100:H102,H103))","v":{"$error":"#N/A"}},{"$error":"#N/A"},{"$error":"#N/A"}]
[null,null,{"$f":"IF(OR(MAX($C$100:C103)=MAX(Spm.X10),C103=\"\"),NA(),MAX($C$100:C103)+1)","v":{"$error":"#N/A"}},{"$error":"#N/A"},{"$error":"#N/A"},{"$error":"#N/A"},{"$error":"#N/A"},{"$error":"#N/A"},{"$f":"IF(E104=\"\",NA(),COUNTIF($H$100:H103,H104))","v":{"$error":"#N/A"}},{"$error":"#N/A"},{"$error":"#N/A"}]
[null,null,{"$f":"IF(OR(MAX($C$100:C104)=MAX(Spm.X10),C104=\"\"),NA(),MAX($C$100:C104)+1)","v":{"$error":"#N/A"}},{"$error":"#N/A"},{"$error":"#N/A"},{"$error":"#N/A"},{"$error":"#N/A"},{"$error":"#N/A"},{"$f":"IF(E105=\"\",NA(),COUNTIF($H$100:H104,H105))","v":{"$error":"#N/A"}},{"$error":"#N/A"},{"$error":"#N/A"}]
[null,null,{"$f":"IF(OR(MAX($C$100:C105)=MAX(Spm.X10),C105=\"\"),NA(),MAX($C$100:C105)+1)","v":{"$error":"#N/A"}},{"$error":"#N/A"},{"$error":"#N/A"},{"$error":"#N/A"},{"$error":"#N/A"},{"$error":"#N/A"},{"$f":"IF(E106=\"\",NA(),COUNTIF($H$100:H105,H106))","v":{"$error":"#N/A"}},{"$error":"#N/A"},{"$error":"#N/A"}]
[null,null,{"$f":"IF(OR(MAX($C$100:C106)=MAX(Spm.X10),C106=\"\"),NA(),MAX($C$100:C106)+1)","v":{"$error":"#N/A"}},{"$error":"#N/A"},{"$error":"#N/A"},{"$error":"#N/A"},{"$error":"#N/A"},{"$error":"#N/A"},{"$f":"IF(E107=\"\",NA(),COUNTIF($H$100:H106,H107))","v":{"$error":"#N/A"}},{"$error":"#N/A"},{"$error":"#N/A"}]
[null,null,{"$f":"IF(OR(MAX($C$100:C107)=MAX(Spm.X10),C107=\"\"),NA(),MAX($C$100:C107)+1)","v":{"$error":"#N/A"}},{"$error":"#N/A"},{"$error":"#N/A"},{"$error":"#N/A"},{"$error":"#N/A"},{"$error":"#N/A"},{"$f":"IF(E108=\"\",NA(),COUNTIF($H$100:H107,H108))","v":{"$error":"#N/A"}},{"$error":"#N/A"},{"$error":"#N/A"}]
[null,null,{"$f":"IF(OR(MAX($C$100:C108)=MAX(Spm.X10),C108=\"\"),NA(),MAX($C$100:C108)+1)","v":{"$error":"#N/A"}},{"$error":"#N/A"},{"$error":"#N/A"},{"$error":"#N/A"},{"$error":"#N/A"},{"$error":"#N/A"},{"$f":"IF(E109=\"\",NA(),COUNTIF($H$100:H108,H109))","v":{"$error":"#N/A"}},{"$error":"#N/A"},{"$error":"#N/A"}]
[null,null,{"$f":"IF(OR(MAX($C$100:C109)=MAX(Spm.X10),C109=\"\"),NA(),MAX($C$100:C109)+1)","v":{"$error":"#N/A"}},{"$error":"#N/A"},{"$error":"#N/A"},{"$error":"#N/A"},{"$error":"#N/A"},{"$error":"#N/A"},{"$f":"IF(E110=\"\",NA(),COUNTIF($H$100:H109,H110))","v":{"$error":"#N/A"}},{"$error":"#N/A"},{"$error":"#N/A"}]
[null,null,{"$f":"IF(OR(MAX($C$100:C110)=MAX(Spm.X10),C110=\"\"),NA(),MAX($C$100:C110)+1)","v":{"$error":"#N/A"}},{"$error":"#N/A"},{"$error":"#N/A"},{"$error":"#N/A"},{"$error":"#N/A"},{"$error":"#N/A"},{"$f":"IF(E111=\"\",NA(),COUNTIF($H$100:H110,H111))","v":{"$error":"#N/A"}},{"$error":"#N/A"},{"$error":"#N/A"}]
[null,null,{"$f":"IF(OR(MAX($C$100:C111)=MAX(Spm.X10),C111=\"\"),NA(),MAX($C$100:C111)+1)","v":{"$error":"#N/A"}},{"$error":"#N/A"},{"$error":"#N/A"},{"$error":"#N/A"},{"$error":"#N/A"},{"$error":"#N/A"},{"$f":"IF(E112=\"\",NA(),COUNTIF($H$100:H111,H112))","v":{"$error":"#N/A"}},{"$error":"#N/A"},{"$error":"#N/A"}]
[null,null,{"$f":"IF(OR(MAX($C$100:C112)=MAX(Spm.X10),C112=\"\"),NA(),MAX($C$100:C112)+1)","v":{"$error":"#N/A"}},{"$error":"#N/A"},{"$error":"#N/A"},{"$error":"#N/A"},{"$error":"#N/A"},{"$error":"#N/A"},{"$f":"IF(E113=\"\",NA(),COUNTIF($H$100:H112,H113))","v":{"$error":"#N/A"}},{"$error":"#N/A"},{"$error":"#N/A"}]
[null,null,{"$f":"IF(OR(MAX($C$100:C113)=MAX(Spm.X10),C113=\"\"),NA(),MAX($C$100:C113)+1)","v":{"$error":"#N/A"}},{"$error":"#N/A"},{"$error":"#N/A"},{"$error":"#N/A"},{"$error":"#N/A"},{"$error":"#N/A"},{"$f":"IF(E114=\"\",NA(),COUNTIF($H$100:H113,H114))","v":{"$error":"#N/A"}},{"$error":"#N/A"},{"$error":"#N/A"}]
[null,null,{"$f":"IF(OR(MAX($C$100:C114)=MAX(Spm.X10),C114=\"\"),NA(),MAX($C$100:C114)+1)","v":{"$error":"#N/A"}},{"$error":"#N/A"},{"$error":"#N/A"},{"$error":"#N/A"},{"$error":"#N/A"},{"$error":"#N/A"},{"$f":"IF(E115=\"\",NA(),COUNTIF($H$100:H114,H115))","v":{"$error":"#N/A"}},{"$error":"#N/A"},{"$error":"#N/A"}]
[null,null,{"$f":"IF(OR(MAX($C$100:C115)=MAX(Spm.X10),C115=\"\"),NA(),MAX($C$100:C115)+1)","v":{"$error":"#N/A"}},{"$error":"#N/A"},{"$error":"#N/A"},{"$error":"#N/A"},{"$error":"#N/A"},{"$error":"#N/A"},{"$f":"IF(E116=\"\",NA(),COUNTIF($H$100:H115,H116))","v":{"$error":"#N/A"}},{"$error":"#N/A"},{"$error":"#N/A"}]
[null,null,{"$f":"IF(OR(MAX($C$100:C116)=MAX(Spm.X10),C116=\"\"),NA(),MAX($C$100:C116)+1)","v":{"$error":"#N/A"}},{"$error":"#N/A"},{"$error":"#N/A"},{"$error":"#N/A"},{"$error":"#N/A"},{"$error":"#N/A"},{"$f":"IF(E117=\"\",NA(),COUNTIF($H$100:H116,H117))","v":{"$error":"#N/A"}},{"$error":"#N/A"},{"$error":"#N/A"}]
[null,null,{"$f":"IF(OR(MAX($C$100:C117)=MAX(Spm.X10),C117=\"\"),NA(),MAX($C$100:C117)+1)","v":{"$error":"#N/A"}},{"$error":"#N/A"},{"$error":"#N/A"},{"$error":"#N/A"},{"$error":"#N/A"},{"$error":"#N/A"},{"$f":"IF(E118=\"\",NA(),COUNTIF($H$100:H117,H118))","v":{"$error":"#N/A"}},{"$error":"#N/A"},{"$error":"#N/A"}]
[null,null,{"$f":"IF(OR(MAX($C$100:C118)=MAX(Spm.X10),C118=\"\"),NA(),MAX($C$100:C118)+1)","v":{"$error":"#N/A"}},{"$error":"#N/A"},{"$error":"#N/A"},{"$error":"#N/A"},{"$error":"#N/A"},{"$error":"#N/A"},{"$f":"IF(E119=\"\",NA(),COUNTIF($H$100:H118,H119))","v":{"$error":"#N/A"}},{"$error":"#N/A"},{"$error":"#N/A"}]
[null,null,{"$f":"IF(OR(MAX($C$100:C119)=MAX(Spm.X10),C119=\"\"),NA(),MAX($C$100:C119)+1)","v":{"$error":"#N/A"}},{"$error":"#N/A"},{"$error":"#N/A"},{"$error":"#N/A"},{"$error":"#N/A"},{"$error":"#N/A"},{"$f":"IF(E120=\"\",NA(),COUNTIF($H$100:H119,H120))","v":{"$error":"#N/A"}},{"$error":"#N/A"},{"$error":"#N/A"}]
[null,null,{"$f":"IF(OR(MAX($C$100:C120)=MAX(Spm.X10),C120=\"\"),NA(),MAX($C$100:C120)+1)","v":{"$error":"#N/A"}},{"$error":"#N/A"},{"$error":"#N/A"},{"$error":"#N/A"},{"$error":"#N/A"},{"$error":"#N/A"},{"$f":"IF(E121=\"\",NA(),COUNTIF($H$100:H120,H121))","v":{"$error":"#N/A"}},{"$error":"#N/A"},{"$error":"#N/A"}]
[null,null,{"$f":"IF(OR(MAX($C$100:C121)=MAX(Spm.X10),C121=\"\"),NA(),MAX($C$100:C121)+1)","v":{"$error":"#N/A"}},{"$error":"#N/A"},{"$error":"#N/A"},{"$error":"#N/A"},{"$error":"#N/A"},{"$error":"#N/A"},{"$f":"IF(E122=\"\",NA(),COUNTIF($H$100:H121,H122))","v":{"$error":"#N/A"}},{"$error":"#N/A"},{"$error":"#N/A"}]
[null,null,{"$f":"IF(OR(MAX($C$100:C122)=MAX(Spm.X10),C122=\"\"),NA(),MAX($C$100:C122)+1)","v":{"$error":"#N/A"}},{"$error":"#N/A"},{"$error":"#N/A"},{"$error":"#N/A"},{"$error":"#N/A"},{"$error":"#N/A"},{"$f":"IF(E123=\"\",NA(),COUNTIF($H$100:H122,H123))","v":{"$error":"#N/A"}},{"$error":"#N/A"},{"$error":"#N/A"}]
[null,null,{"$f":"IF(OR(MAX($C$100:C123)=MAX(Spm.X10),C123=\"\"),NA(),MAX($C$100:C123)+1)","v":{"$error":"#N/A"}},{"$error":"#N/A"},{"$error":"#N/A"},{"$error":"#N/A"},{"$error":"#N/A"},{"$error":"#N/A"},{"$f":"IF(E124=\"\",NA(),COUNTIF($H$100:H123,H124))","v":{"$error":"#N/A"}},{"$error":"#N/A"},{"$error":"#N/A"}]
[null,null,{"$f":"IF(OR(MAX($C$100:C124)=MAX(Spm.X10),C124=\"\"),NA(),MAX($C$100:C124)+1)","v":{"$error":"#N/A"}},{"$error":"#N/A"},{"$error":"#N/A"},{"$error":"#N/A"},{"$error":"#N/A"},{"$error":"#N/A"},{"$f":"IF(E125=\"\",NA(),COUNTIF($H$100:H124,H125))","v":{"$error":"#N/A"}},{"$error":"#N/A"},{"$error":"#N/A"}]
[null,null,{"$f":"IF(OR(MAX($C$100:C125)=MAX(Spm.X10),C125=\"\"),NA(),MAX($C$100:C125)+1)","v":{"$error":"#N/A"}},{"$error":"#N/A"},{"$error":"#N/A"},{"$error":"#N/A"},{"$error":"#N/A"},{"$error":"#N/A"},{"$f":"IF(E126=\"\",NA(),COUNTIF($H$100:H125,H126))","v":{"$error":"#N/A"}},{"$error":"#N/A"},{"$error":"#N/A"}]
[null,null,{"$f":"IF(OR(MAX($C$100:C126)=MAX(Spm.X10),C126=\"\"),NA(),MAX($C$100:C126)+1)","v":{"$error":"#N/A"}},{"$error":"#N/A"},{"$error":"#N/A"},{"$error":"#N/A"},{"$error":"#N/A"},{"$error":"#N/A"},{"$f":"IF(E127=\"\",NA(),COUNTIF($H$100:H126,H127))","v":{"$error":"#N/A"}},{"$error":"#N/A"},{"$error":"#N/A"}]
[null,null,{"$f":"IF(OR(MAX($C$100:C127)=MAX(Spm.X10),C127=\"\"),NA(),MAX($C$100:C127)+1)","v":{"$error":"#N/A"}},{"$error":"#N/A"},{"$error":"#N/A"},{"$error":"#N/A"},{"$error":"#N/A"},{"$error":"#N/A"},{"$f":"IF(E128=\"\",NA(),COUNTIF($H$100:H127,H128))","v":{"$error":"#N/A"}},{"$error":"#N/A"},{"$error":"#N/A"}]
[null,null,{"$f":"IF(OR(MAX($C$100:C128)=MAX(Spm.X10),C128=\"\"),NA(),MAX($C$100:C128)+1)","v":{"$error":"#N/A"}},{"$error":"#N/A"},{"$error":"#N/A"},{"$error":"#N/A"},{"$error":"#N/A"},{"$error":"#N/A"},{"$f":"IF(E129=\"\",NA(),COUNTIF($H$100:H128,H129))","v":{"$error":"#N/A"}},{"$error":"#N/A"},{"$error":"#N/A"}]
[null,null,{"$f":"IF(OR(MAX($C$100:C129)=MAX(Spm.X10),C129=\"\"),NA(),MAX($C$100:C129)+1)","v":{"$error":"#N/A"}},{"$error":"#N/A"},{"$error":"#N/A"},{"$error":"#N/A"},{"$error":"#N/A"},{"$error":"#N/A"},{"$f":"IF(E130=\"\",NA(),COUNTIF($H$100:H129,H130))","v":{"$error":"#N/A"}},{"$error":"#N/A"},{"$error":"#N/A"}]

{"sheet":"Data til yd. visninger","index":8,"n_rows":123,"n_cols":11,"rows_kept":123,"cut":false,"hidden":false,"merged":[[21,7,27,10],[8,7,14,10],[31,4,31,10]]}
[null,"Beregninger til it-handlingsplanens yderligere visninger"]
[]
[null,null,"Yderligere visninger"]
[]
[null,null,"Visning I: Planlagte it-systemrettede investeringer sammenholdt med tilfredshed med forretningsunderstøttelsen"]
[]
[null,null,"Område ID","Primært forretningsområde","Forventede investeringer","Vægtet tilfredshed med forretningsund.",null,"Antal forretningsområder:",{"$f":"COUNT(E8:E15)","v":0}]
[null,null,"A",{"$f":"IFERROR(INDEX(Spm.I,MATCH(COLUMN(INDIRECT($C8&1)),Spm.X4,0)),\"\")","v":""},{"$f":"IF(IFERROR(INDEX(Spm.X2,MATCH(COLUMN(INDIRECT($C8&1)),Spm.X4,0)),\"\")=0,0.0001,IFERROR(INDEX(Spm.X2,MATCH(COLUMN(INDIRECT($C8&1)),Spm.X4,0)),\"\"))","v":""},{"$f":"IF(SUMIFS(Spm.X8,Spm.X4,COLUMN(INDIRECT($C8&1)))=0,\"\",SUMIFS(Spm.X8,Spm.X4,COLUMN(INDIRECT($C8&1))))","v":""},{"$f":"IF(D8=\"\",\"\",0.25)","v":""}]
[null,null,"B","","","",{"$f":"IF(D9=\"\",\"\",0.25)","v":""},"Tilfredsheden med de enkelte it-systemer er vægtet internt i forretningsområdet på baggrund af de samlede nuværende årlige it-omkostninger til it-systemerne. Har et it-system 0 kr. i årlige it-omkostninger, tæller dette it-system ikke med i vægtningen. Den vægtede tilfredshed beregnes på baggrund af data i beregningskolonnerne CH, CI, CK, CM og CO. Beregningskolonnerne er baseret på spørgsmål I, spørgsmål 1, spørgsmål 27 og spørgsmål 29."]
[null,null,"C","","","",""]
[null,null,"D","","","",""]
[null,null,"E","","","",""]
[null,null,"F","","","",""]
[null,null,"G","","","",""]
[null,null,"H","","","",""]
[]
[]
[null,null,"Visning II: Planlagte it-systemrettede investeringer sammenholdt med tilfredshed med it-systemernes tekniske tilstand"]
[]
[null,null,"Område ID","Primært forretningsområde","Forventede investeringer","Vægtet tilfredshed med teknisk tilstand",null,"Antal forretningsområder:",{"$f":"COUNT(E21:E28)","v":0}]
[null,null,"A",{"$f":"IFERROR(INDEX(Spm.I,MATCH(COLUMN(INDIRECT($C21&1)),Spm.X4,0)),\"\")","v":""},{"$f":"IF(IFERROR(INDEX(Spm.X2,MATCH(COLUMN(INDIRECT($C21&1)),Spm.X4,0)),\"\")=0,0.0001,IFERROR(INDEX(Spm.X2,MATCH(COLUMN(INDIRECT($C21&1)),Spm.X4,0)),\"\"))","v":""},{"$f":"IF(SUMIFS(Spm.X9,Spm.X4,COLUMN(INDIRECT($C21&1)))=0,\"\",SUMIFS(Spm.X9,Spm.X4,COLUMN(INDIRECT($C21&1))))","v":""},{"$f":"IF(D21=\"\",\"\",0.25)","v":""}]
[null,null,"B","","","",{"$f":"IF(D22=\"\",\"\",0.25)","v":""},"Tilfredsheden med de enkelte it-systemer er vægtet internt i forretningsområdet på baggrund af de samlede nuværende årlige it-omkostninger til it-systemerne. Har et it-system 0 kr. i årlige it-omkostninger, tæller dette it-system ikke med i vægtningen. Den vægtede tilfredshed beregnes på baggrund af data i beregningskolonnerne CH, CI, CK, CN og CP. Beregningskolonnerne er baseret på spørgsmål I, spørgsmål 11, spørgsmål 27 og spørgsmål 29."]
[null,null,"C","","","",""]
[null,null,"D","","","",""]
[null,null,"E","","","",""]
[null,null,"F","","","",""]
[null,null,"G","","","",""]
[null,null,"H","","","",""]
[]
[]
[null,null,"Visning III: Forretningsunderstøttelse, teknisk tilstand og forventede investeringer for samfundskritiske it-systemer"]
[null,null,"Antal it-systemer:",{"$f":"COUNT(C34:C63)","v":0},"Kolonnerne H til K i nedenstående tabel bruges udelukkende som hjælpekolonner til grafen i visning III."]
[null,null,"It-system nr.","Totale forventede investeringer","It-systemnavn","Tilfredshed - Forret-ningsunderstøttelse","Tilfredshed - Teknisk tilstand","Sammlægning af scores","Samme tilfreds-hedsresultat?","Just. tilfredshed med forretningsund.","Justeret tilfredshed med teknisk tilstand"]
[null,null,{"$f":"IF(OR(MAX($C$33:C33)=MAX(Spm.X11),C33=\"\"),NA(),MAX($C$33:C33)+1)","v":{"$error":"#N/A"}},{"$f":"IF($C34=\"\",NA(),\nIF(IFERROR(INDEX(Spm.29,MATCH($C34,Spm.X11,0)),NA())=0,0.000000001,IFERROR(INDEX(Spm.29,MATCH($C34,Spm.X11,0)),NA())))","v":{"$error":"#N/A"}},{"$f":"IF($C34<>\"\",IFERROR(INDEX(Spm.E,MATCH($C34,Spm.X11,0)),NA()),NA())","v":{"$error":"#N/A"}},{"$f":"IF(C34=\"\",NA(),IFERROR(INDEX(Spm.X23,MATCH($C34,Spm.X11,0)),NA()))","v":{"$error":"#N/A"}},{"$f":"IF(C34=\"\",NA(),IFERROR(INDEX(Spm.X26,MATCH($C34,Spm.X11,0)),NA()))","v":{"$error":"#N/A"}},{"$f":"IF(E34<>\"\",CONCATENATE(F34,G34),NA())","v":{"$error":"#N/A"}},{"$f":"IF(E34=\"\",NA(),COUNTIF($H33:H$33,H34))","v":{"$error":"#N/A"}},{"$f":"IF($E34=\"\",NA(),F34-$I34*0.2)","v":{"$error":"#N/A"}},{"$f":"IF($E34=\"\",NA(),G34-$I34*0.2)","v":{"$error":"#N/A"}}]
[null,null,{"$f":"IF(OR(MAX($C$33:C34)=MAX(Spm.X11),C34=\"\"),NA(),MAX($C$33:C34)+1)","v":{"$error":"#N/A"}},{"$error":"#N/A"},{"$error":"#N/A"},{"$error":"#N/A"},{"$error":"#N/A"},{"$error":"#N/A"},{"$f":"IF(E35=\"\",NA(),COUNTIF($H$33:H34,H35))","v":{"$error":"#N/A"}},{"$error":"#N/A"},{"$error":"#N/A"}]
[null,null,{"$f":"IF(OR(MAX($C$33:C35)=MAX(Spm.X11),C35=\"\"),NA(),MAX($C$33:C35)+1)","v":{"$error":"#N/A"}},{"$error":"#N/A"},{"$error":"#N/A"},{"$error":"#N/A"},{"$error":"#N/A"},{"$error":"#N/A"},{"$f":"IF(E36=\"\",NA(),COUNTIF($H$33:H35,H36))","v":{"$error":"#N/A"}},{"$error":"#N/A"},{"$error":"#N/A"}]
[null,null,{"$f":"IF(OR(MAX($C$33:C36)=MAX(Spm.X11),C36=\"\"),NA(),MAX($C$33:C36)+1)","v":{"$error":"#N/A"}},{"$error":"#N/A"},{"$error":"#N/A"},{"$error":"#N/A"},{"$error":"#N/A"},{"$error":"#N/A"},{"$f":"IF(E37=\"\",NA(),COUNTIF($H$33:H36,H37))","v":{"$error":"#N/A"}},{"$error":"#N/A"},{"$error":"#N/A"}]
[null,null,{"$f":"IF(OR(MAX($C$33:C37)=MAX(Spm.X11),C37=\"\"),NA(),MAX($C$33:C37)+1)","v":{"$error":"#N/A"}},{"$error":"#N/A"},{"$error":"#N/A"},{"$error":"#N/A"},{"$error":"#N/A"},{"$error":"#N/A"},{"$f":"IF(E38=\"\",NA(),COUNTIF($H$33:H37,H38))","v":{"$error":"#N/A"}},{"$error":"#N/A"},{"$error":"#N/A"}]
[null,null,{"$f":"IF(OR(MAX($C$33:C38)=MAX(Spm.X11),C38=\"\"),NA(),MAX($C$33:C38)+1)","v":{"$error":"#N/A"}},{"$error":"#N/A"},{"$error":"#N/A"},{"$error":"#N/A"},{"$error":"#N/A"},{"$error":"#N/A"},{"$f":"IF(E39=\"\",NA(),COUNTIF($H$33:H38,H39))","v":{"$error":"#N/A"}},{"$error":"#N/A"},{"$error":"#N/A"}]
[null,null,{"$f":"IF(OR(MAX($C$33:C39)=MAX(Spm.X11),C39=\"\"),NA(),MAX($C$33:C39)+1)","v":{"$error":"#N/A"}},{"$error":"#N/A"},{"$error":"#N/A"},{"$error":"#N/A"},{"$error":"#N/A"},{"$error":"#N/A"},{"$f":"IF(E40=\"\",NA(),COUNTIF($H$33:H39,H40))","v":{"$error":"#N/A"}},{"$error":"#N/A"},{"$error":"#N/A"}]
[null,null,{"$f":"IF(OR(MAX($C$33:C40)=MAX(Spm.X11),C40=\"\"),NA(),MAX($C$33:C40)+1)","v":{"$error":"#N/A"}},{"$error":"#N/A"},{"$error":"#N/A"},{"$error":"#N/A"},{"$error":"#N/A"},{"$error":"#N/A"},{"$f":"IF(E41=\"\",NA(),COUNTIF($H$33:H40,H41))","v":{"$error":"#N/A"}},{"$error":"#N/A"},{"$error":"#N/A"}]
[null,null,{"$f":"IF(OR(MAX($C$33:C41)=MAX(Spm.X11),C41=\"\"),NA(),MAX($C$33:C41)+1)","v":{"$error":"#N/A"}},{"$error":"#N/A"},{"$error":"#N/A"},{"$error":"#N/A"},{"$error":"#N/A"},{"$error":"#N/A"},{"$f":"IF(E42=\"\",NA(),COUNTIF($H$33:H41,H42))","v":{"$error":"#N/A"}},{"$error":"#N/A"},{"$error":"#N/A"}]
[null,null,{"$f":"IF(OR(MAX($C$33:C42)=MAX(Spm.X11),C42=\"\"),NA(),MAX($C$33:C42)+1)","v":{"$error":"#N/A"}},{"$error":"#N/A"},{"$error":"#N/A"},{"$error":"#N/A"},{"$error":"#N/A"},{"$error":"#N/A"},{"$f":"IF(E43=\"\",NA(),COUNTIF($H$33:H42,H43))","v":{"$error":"#N/A"}},{"$error":"#N/A"},{"$error":"#N/A"}]
[null,null,{"$f":"IF(OR(MAX($C$33:C43)=MAX(Spm.X11),C43=\"\"),NA(),MAX($C$33:C43)+1)","v":{"$error":"#N/A"}},{"$error":"#N/A"},{"$error":"#N/A"},{"$error":"#N/A"},{"$error":"#N/A"},{"$error":"#N/A"},{"$f":"IF(E44=\"\",NA(),COUNTIF($H$33:H43,H44))","v":{"$error":"#N/A"}},{"$error":"#N/A"},{"$error":"#N/A"}]
[null,null,{"$f":"IF(OR(MAX($C$33:C44)=MAX(Spm.X11),C44=\"\"),NA(),MAX($C$33:C44)+1)","v":{"$error":"#N/A"}},{"$error":"#N/A"},{"$error":"#N/A"},{"$error":"#N/A"},{"$error":"#N/A"},{"$error":"#N/A"},{"$f":"IF(E45=\"\",NA(),COUNTIF($H$33:H44,H45))","v":{"$error":"#N/A"}},{"$error":"#N/A"},{"$error":"#N/A"}]
[null,null,{"$f":"IF(OR(MAX($C$33:C45)=MAX(Spm.X11),C45=\"\"),NA(),MAX($C$33:C45)+1)","v":{"$error":"#N/A"}},{"$error":"#N/A"},{"$error":"#N/A"},{"$error":"#N/A"},{"$error":"#N/A"},{"$error":"#N/A"},{"$f":"IF(E46=\"\",NA(),COUNTIF($H$33:H45,H46))","v":{"$error":"#N/A"}},{"$error":"#N/A"},{"$error":"#N/A"}]
[null,null,{"$f":"IF(OR(MAX($C$33:C46)=MAX(Spm.X11),C46=\"\"),NA(),MAX($C$33:C46)+1)","v":{"$error":"#N/A"}},{"$error":"#N/A"},{"$error":"#N/A"},{"$error":"#N/A"},{"$error":"#N/A"},{"$error":"#N/A"},{"$f":"IF(E47=\"\",NA(),COUNTIF($H$33:H46,H47))","v":{"$error":"#N/A"}},{"$error":"#N/A"},{"$error":"#N/A"}]
[null,null,{"$f":"IF(OR(MAX($C$33:C47)=MAX(Spm.X11),C47=\"\"),NA(),MAX($C$33:C47)+1)","v":{"$error":"#N/A"}},{"$error":"#N/A"},{"$error":"#N/A"},{"$error":"#N/A"},{"$error":"#N/A"},{"$error":"#N/A"},{"$f":"IF(E48=\"\",NA(),COUNTIF($H$33:H47,H48))","v":{"$error":"#N/A"}},{"$error":"#N/A"},{"$error":"#N/A"}]
[null,null,{"$f":"IF(OR(MAX($C$33:C48)=MAX(Spm.X11),C48=\"\"),NA(),MAX($C$33:C48)+1)","v":{"$error":"#N/A"}},{"$error":"#N/A"},{"$error":"#N/A"},{"$error":"#N/A"},{"$error":"#N/A"},{"$error":"#N/A"},{"$f":"IF(E49=\"\",NA(),COUNTIF($H$33:H48,H49))","v":{"$error":"#N/A"}},{"$error":"#N/A"},{"$error":"#N/A"}]
[null,null,{"$f":"IF(OR(MAX($C$33:C49)=MAX(Spm.X11),C49=\"\"),NA(),MAX($C$33:C49)+1)","v":{"$error":"#N/A"}},{"$error":"#N/A"},{"$error":"#N/A"},{"$error":"#N/A"},{"$error":"#N/A"},{"$error":"#N/A"},{"$f":"IF(E50=\"\",NA(),COUNTIF($H$33:H49,H50))","v":{"$error":"#N/A"}},{"$error":"#N/A"},{"$error":"#N/A"}]
[null,null,{"$f":"IF(OR(MAX($C$33:C50)=MAX(Spm.X11),C50=\"\"),NA(),MAX($C$33:C50)+1)","v":{"$error":"#N/A"}},{"$error":"#N/A"},{"$error":"#N/A"},{"$error":"#N/A"},{"$error":"#N/A"},{"$error":"#N/A"},{"$f":"IF(E51=\"\",NA(),COUNTIF($H$33:H50,H51))","v":{"$error":"#N/A"}},{"$error":"#N/A"},{"$error":"#N/A"}]
[null,null,{"$f":"IF(OR(MAX($C$33:C51)=MAX(Spm.X11),C51=\"\"),NA(),MAX($C$33:C51)+1)","v":{"$error":"#N/A"}},{"$error":"#N/A"},{"$error":"#N/A"},{"$error":"#N/A"},{"$error":"#N/A"},{"$error":"#N/A"},{"$f":"IF(E52=\"\",NA(),COUNTIF($H$33:H51,H52))","v":{"$error":"#N/A"}},{"$error":"#N/A"},{"$error":"#N/A"}]
[null,null,{"$f":"IF(OR(MAX($C$33:C52)=MAX(Spm.X11),C52=\"\"),NA(),MAX($C$33:C52)+1)","v":{"$error":"#N/A"}},{"$error":"#N/A"},{"$error":"#N/A"},{"$error":"#N/A"},{"$error":"#N/A"},{"$error":"#N/A"},{"$f":"IF(E53=\"\",NA(),COUNTIF($H$33:H52,H53))","v":{"$error":"#N/A"}},{"$error":"#N/A"},{"$error":"#N/A"}]
[null,null,{"$f":"IF(OR(MAX($C$33:C53)=MAX(Spm.X11),C53=\"\"),NA(),MAX($C$33:C53)+1)","v":{"$error":"#N/A"}},{"$error":"#N/A"},{"$error":"#N/A"},{"$error":"#N/A"},{"$error":"#N/A"},{"$error":"#N/A"},{"$f":"IF(E54=\"\",NA(),COUNTIF($H$33:H53,H54))","v":{"$error":"#N/A"}},{"$error":"#N/A"},{"$error":"#N/A"}]
[null,null,{"$f":"IF(OR(MAX($C$33:C54)=MAX(Spm.X11),C54=\"\"),NA(),MAX($C$33:C54)+1)","v":{"$error":"#N/A"}},{"$error":"#N/A"},{"$error":"#N/A"},{"$error":"#N/A"},{"$error":"#N/A"},{"$error":"#N/A"},{"$f":"IF(E55=\"\",NA(),COUNTIF($H$33:H54,H55))","v":{"$error":"#N/A"}},{"$error":"#N/A"},{"$error":"#N/A"}]
[null,null,{"$f":"IF(OR(MAX($C$33:C55)=MAX(Spm.X11),C55=\"\"),NA(),MAX($C$33:C55)+1)","v":{"$error":"#N/A"}},{"$error":"#N/A"},{"$error":"#N/A"},{"$error":"#N/A"},{"$error":"#N/A"},{"$error":"#N/A"},{"$f":"IF(E56=\"\",NA(),COUNTIF($H$33:H55,H56))","v":{"$error":"#N/A"}},{"$error":"#N/A"},{"$error":"#N/A"}]
[null,null,{"$f":"IF(OR(MAX($C$33:C56)=MAX(Spm.X11),C56=\"\"),NA(),MAX($C$33:C56)+1)","v":{"$error":"#N/A"}},{"$error":"#N/A"},{"$error":"#N/A"},{"$error":"#N/A"},{"$error":"#N/A"},{"$error":"#N/A"},{"$f":"IF(E57=\"\",NA(),COUNTIF($H$33:H56,H57))","v":{"$error":"#N/A"}},{"$error":"#N/A"},{"$error":"#N/A"}]
[null,null,{"$f":"IF(OR(MAX($C$33:C57)=MAX(Spm.X11),C57=\"\"),NA(),MAX($C$33:C57)+1)","v":{"$error":"#N/A"}},{"$error":"#N/A"},{"$error":"#N/A"},{"$error":"#N/A"},{"$error":"#N/A"},{"$error":"#N/A"},{"$f":"IF(E58=\"\",NA(),COUNTIF($H$33:H57,H58))","v":{"$error":"#N/A"}},{"$error":"#N/A"},{"$error":"#N/A"}]
[null,null,{"$f":"IF(OR(MAX($C$33:C58)=MAX(Spm.X11),C58=\"\"),NA(),MAX($C$33:C58)+1)","v":{"$error":"#N/A"}},{"$error":"#N/A"},{"$error":"#N/A"},{"$error":"#N/A"},{"$error":"#N/A"},{"$error":"#N/A"},{"$f":"IF(E59=\"\",NA(),COUNTIF($H$33:H58,H59))","v":{"$error":"#N/A"}},{"$error":"#N/A"},{"$error":"#N/A"}]
[null,null,{"$f":"IF(OR(MAX($C$33:C59)=MAX(Spm.X11),C59=\"\"),NA(),MAX($C$33:C59)+1)","v":{"$error":"#N/A"}},{"$error":"#N/A"},{"$error":"#N/A"},{"$error":"#N/A"},{"$error":"#N/A"},{"$error":"#N/A"},{"$f":"IF(E60=\"\",NA(),COUNTIF($H$33:H59,H60))","v":{"$error":"#N/A"}},{"$error":"#N/A"},{"$error":"#N/A"}]
[null,null,{"$f":"IF(OR(MAX($C$33:C60)=MAX(Spm.X11),C60=\"\"),NA(),MAX($C$33:C60)+1)","v":{"$error":"#N/A"}},{"$error":"#N/A"},{"$error":"#N/A"},{"$error":"#N/A"},{"$error":"#N/A"},{"$error":"#N/A"},{"$f":"IF(E61=\"\",NA(),COUNTIF($H$33:H60,H61))","v":{"$error":"#N/A"}},{"$error":"#N/A"},{"$error":"#N/A"}]
[null,null,{"$f":"IF(OR(MAX($C$33:C61)=MAX(Spm.X11),C61=\"\"),NA(),MAX($C$33:C61)+1)","v":{"$error":"#N/A"}},{"$error":"#N/A"},{"$error":"#N/A"},{"$error":"#N/A"},{"$error":"#N/A"},{"$error":"#N/A"},{"$f":"IF(E62=\"\",NA(),COUNTIF($H$33:H61,H62))","v":{"$error":"#N/A"}},{"$error":"#N/A"},{"$error":"#N/A"}]
[null,null,{"$f":"IF(OR(MAX($C$33:C62)=MAX(Spm.X11),C62=\"\"),NA(),MAX($C$33:C62)+1)","v":{"$error":"#N/A"}},{"$error":"#N/A"},{"$error":"#N/A"},{"$error":"#N/A"},{"$error":"#N/A"},{"$error":"#N/A"},{"$f":"IF(E63=\"\",NA(),COUNTIF($H$33:H62,H63))","v":{"$error":"#N/A"}},{"$error":"#N/A"},{"$error":"#N/A"}]
[]
[]
[null,null,"Visning IV: Interne omk. og omk. til drift/vedligehold/udvikling pr. forretningsområde",null,null,null,null,null,"Visning V: Samlede it-systemomk. pr. forretningsområde"]
[null,null,"Antal forretningsområder:",{"$f":"COUNT(E69:E76)","v":1},null,null,null,null,null,"Antal forretningsområder:",{"$f":"COUNT(K69:K76)","v":0}]
[null,null,"Rangering","Forretningsområde","Eksterne omkostninger til drift og vedligehold (i mio. kr.)","Interne personale-omkostninger til drift og vedligehold (i mio. kr.)","Eksterne og interne omkostninger til udvikling (i mio. kr.)",null,"Rangering","Forretningsområde","Samlede it-omkostninger til it-systemer i forretningsområdet (i mio. kr.)"]
[null,null,{"$f":"IF(C68=\"\",\"\",IF(MAX(0,MIN(30,IF(ISNUMBER(C68)=FALSE,MIN(Spm.X5)+1,C68)))=0,\"\",MAX(0,MIN(30,IF(ISNUMBER(C68)=FALSE,MAX(Spm.X5)+1,C68)-1))))","v":0},{"$f":"IF(C69=\"\",\"\",INDEX(Spm.I,MATCH($C69,Spm.X5,0)))","v":{"$error":"#N/A"}},{"$f":"IF(C69=\"\",\"\",SUM(SUMIF(Spm.I,$D69,Spm.28A),SUMIF(Spm.I,$D69,Spm.28B),-SUMIF(Spm.I,$D69,Spm.28C))/1000000)","v":0},{"$f":"IF(C69=\"\",\"\",SUMIF(Spm.I,$D69,Spm.28C)/1000000)","v":0},{"$f":"IF(D69=\"\",\"\",SUMIF(Spm.I,$D69,Spm.28D)/1000000)","v":{"$error":"#N/A"}},null,{"$f":"IF(I68=\"\",\"\",IF(MAX(0,MIN(30,IF(ISNUMBER(I68)=FALSE,MAX(Spm.X5)+1,I68)-1))=0,\"\",MAX(0,MIN(30,IF(ISNUMBER(I68)=FALSE,MAX(Spm.X5)+1,I68)-1))))","v":""},{"$f":"IF(I69=\"\",\"\",INDEX(Spm.I,MATCH($C69,Spm.X5,0)))","v":""},{"$f":"IF(I69=\"\",\"\",SUMIF(Spm.I,$J69,Spm.27)/1000000)","v":""}]
[null,null,{"$f":"IF(C69=\"\",\"\",IF(MAX(0,MIN(30,IF(ISNUMBER(C69)=FALSE,MAX(Spm.X5)+1,C69)-1))=0,\"\",MAX(0,MIN(30,IF(ISNUMBER(C69)=FALSE,MAX(Spm.X5)+1,C69)-1))))","v":""},"","","","",null,"","",""]
[null,null,"","","","","",null,"","",""]
[null,null,"","","","","",null,"","",""]
[null,null,"","","","","",null,"","",""]
[null,null,"","","","","",null,"","",""]
[null,null,"","","","","",null,"","",""]
[null,null,"","","","","",null,"","",""]
[]
[]
[null,null,"Visning VI: Myndighedens sammensætning af omkostninger til it-systemer"]
[]
[null,null,"Kategori",null,"Omkostning (i mio. kr.)"]
[null,null,"It-omkostninger som ikke er omfattet af it-handlingsplanen",null,{"$f":"IFERROR(MAX(AVERAGE(Spm.C)/1000000-SUM(E83:E85),0),0)","v":0}]
[null,null,"Omkostninger til drift",null,{"$f":"SUM(Spm.28A)/1000000","v":0}]
[null,null,"Omkostninger til vedligehold",null,{"$f":"SUM(Spm.28B)/1000000","v":0}]
[null,null,"Omkostninger til udvikling",null,{"$f":"SUM(Spm.28D)/1000000","v":0}]
[null,null,"Total",null,{"$f":"SUM(E82:E85)","v":0}]
[null,null,"It-omkostninger omfattet af it-handlingsplanen:",null,{"$f":"SUM(E83:E85)","v":0}]
[]
[null,null,"Visning VII: It-systemernes samlede årlige it-omkostninger fordelt efter kritikalitet"]
[]
[null,null,null,null,null,null,"Antal it-systemer:",{"$f":"COUNTIF(Spm.J,\"Samfundskritisk\")","v":0}]
[]
[null,null,"Kritikalitet","Samlede årlige it-omkostninger ( i mio. kr.)",null,"It-system rangering","Samfundskritiske it-systemer","Samlede omk. til it-systemet pr. år (i mio. kr.)"]
[null,{"$f":"C94&\"e it-systemer\"","v":"Samfundskritiske it-systemer"},"Samfundskritisk",{"$f":"SUMIFS(Spm.27,Spm.J,C94)/1000000","v":0},null,{"$f":"IF(F93=\"\",\"\",IF(MAX(0,MIN(30,IF(ISNUMBER(F93)=FALSE,MAX(Spm.X10)+1,F93)-1))=0,\"\",MAX(0,MIN(30,IF(ISNUMBER(F93)=FALSE,MAX(Spm.X10)+1,F93)-1))))","v":""},{"$f":"IF(F94<>\"\",IFERROR(INDEX(Spm.E,MATCH(F94,Spm.X10,0)),\"\"),\"\")","v":""},{"$f":"IF(F94<>\"\",IFERROR(INDEX(Spm.27,MATCH(F94,Spm.X10,0))/1000000,\"\"),\"\")","v":""}]
[null,{"$f":"C95&\"e it-systemer\"","v":"Forretningskritiske it-systemer"},"Forretningskritisk",{"$f":"SUMIFS(Spm.27,Spm.J,C95)/1000000","v":0},null,"","",""]
[null,{"$f":"C96&\"e it-systemer\"","v":"Ikke kritiske it-systemer"},"Ikke kritisk",{"$f":"SUMIFS(Spm.27,Spm.J,C96)/1000000","v":0},null,"","",""]
[null,null,"Total",{"$f":"SUM(D94:D96)","v":0},null,"","",""]
[null,null,null,null,null,"","",""]
[null,null,null,null,null,"","",""]
[null,null,null,null,null,"","",""]
[null,null,null,null,null,"","",""]
[null,null,null,null,null,"","",""]
[null,null,null,null,null,"","",""]
[null,null,null,null,null,"","",""]
[null,null,null,null,null,"","",""]
[null,null,null,null,null,"","",""]
[null,null,null,null,null,"","",""]
[null,null,null,null,null,"","",""]
[null,null,null,null,null,"","",""]
[null,null,null,null,null,"","",""]
[null,null,null,null,null,"","",""]
[null,null,null,null,null,"","",""]
[null,null,null,null,null,"","",""]
[null,null,null,null,null,"","",""]
[null,null,null,null,null,"","",""]
[null,null,null,null,null,"","",""]
[null,null,null,null,null,"","",""]
[null,null,null,null,null,"","",""]
[null,null,null,null,null,"","",""]
[null,null,null,null,null,"","",""]
[null,null,null,null,null,"","",""]
[null,null,null,null,null,"","",""]
[null,null,null,null,null,"","",""]

{"sheet":"Redigerbart ark","index":9,"n_rows":1,"n_cols":2,"rows_kept":1,"cut":false,"hidden":false,"merged":[]}
[null,"Redigerbart ark"]

{"sheet":"Variabler","index":10,"n_rows":120,"n_cols":142,"rows_kept":120,"cut":false,"hidden":true,"merged":[]}
[null,"Variabler"]
[]
[null,null,null,null,null,null,null,null,"TLFRDS","JNVIIR","DIU","DIP","JNVI","IVG","EJ","JN","JNIR","JJNIR","JJNVIIR","Kritikalitet","Sourcing1","Sourcing2","IVG_2","Valgfri","Dato","Sum","Tal"]
[null,null,"Spørgsmål ID","Spørgsmål nr.","Spørgsmål","Svarmuligheder",null,null,"Tilfredsstillende","Ja/nej/ved ikke/ikke relevant","Dato","Dato","Ja/nej/ved ikke","I hvilken grad","Ejerskab","Ja/nej","Ja/nej/ikke relevant","Ja/ja/nej/ikke relevant","Ja/ja/nej/ved ikke/ikke relevant","Kritikalitet","Sourcing (L1)","Sourcing (L2)","I hvilken grad","Valgfri","Dato","Sum","Tal"]
[null,null,1,"Spørgsmål A","Ministerområde","Valgfri",null,null,"1. Meget utilfredsstillende","1. Ja","1. Dato (indsæt dato i næste felt)","1. Dato (indsæt dato i næste felt)","1. Ja","1. I meget lav grad","1. Ingen rettigheder","1. Ja","1. Ja","1. Ja, it-systemet understøtter til fulde databeskyttelsesforordningen","1. Ja, og planen er testet","Samfundskritisk","Overvejende outsourcet","Overvejende outsourcet","1. I meget lav grad","[Valgfri tekst]","[Dato] (format DD-MM-ÅÅÅÅ)","Sum af spg. 28A+28B+28D","[Valgfrit tal]"]
[null,null,2,"Spørgsmål B","Hvad er myndighedens navn?","Valgfri",null,null,"2. Utilfredsstillende","2. Nej","2. Ingen udløbsdato","2. Ikke planlagt","2. Nej","2. I mindre grad","2. Udvidet brugsret","2. Nej","2. Nej","2. Ja, it-systemet understøtter delvist databeskyttelsesforordningen, fuld overholdelse nås gennem manuelle processer","2. Ja, der er en plan","Forretningskritisk","Delvist outsourcet","Delvist outsourcet","2. I mindre grad"," "," "," "," "]
[null,null,3,"Spørgsmål C","Hvad er de samlede årlige it-omkostninger i myndigheden eksklusiv overhead og fællesomkostninger?","Tal",null,null,"3. Tilfredsstillende","3. Ved ikke","3. Ved ikke","3. Ved ikke","3. Ved ikke","3. I nogen grad","3. Fulde rettigheder"," ","3. Ikke relevant","3. Nej, it-systemet understøtter ikke databeskyttelsesforordningen","3. Nej","Ikke kritisk","Statens IT","Insourcet","3. I nogen grad"," "," "," "," "]
[null,null,4,"Spørgsmål E","It-systemnavn","Valgfri",null,null,"4. Meget tilfredsstillende","4. Ikke relevant"," "," "," ","4. I høj grad","4. Ved ikke"," "," ","4. Ikke relevant","4. Ved ikke"," ","Insourcet"," ","4. I høj grad"," "," "," "," "]
[null,null,5,"Spørgsmål F","It-systemejer","Valgfri",null,null,"5. Særdeles tilfredsstillende"," "," "," "," ","5. I meget høj grad"," "," "," "," ","5. Ikke relevant"," "," "," ","5. I meget høj grad"," "," "," "," "]
[null,null,6,"Spørgsmål G","It-systemejernes organisatoriske placering","Valgfri",null,null," "," "," "," "," ","6. Ved ikke"," "," "," "," "," "," "," "," ","6. Ved ikke"," ","  ","  ","  ",null,null,null,null,null,null,null,null,null,null,null,null,null,null,null,null,null,null,null,null,null,null,null,null,null,null,null,null,null,null,null,null,null,null,null,null,null,null,null,null,null,null,null,null,null,null,null,null,null,null,null,null,null,null,null,null,null,null,"X1","X2","X3","X4","X5","X6","X7","X8","X9","X10","X11","X12","X13","X14","X15","X16","X17","X18","X19","X20","X21","X22.1.1","X22.1.2","X22.1.3","X22.2.1","X22.2.2","X22.2.3","X22.3.1","X22.3.2","X22.3.3","X22.4.1","X22.4.2","X22.4.3","X22.5.1","X22.5.2","X22.5.3","X23","X24","X25.1","X25.2","X25.3","X25.4","X25.5","X26","X27","X28","X29","X30","X31","X32","X33","X34","X35","X36","X37","X38","X39"]
[null,null,7,"Spørgsmål H","It-systemets nøglefunktion","Valgfri",null,null," "," "," "," "," "," "," "," "," "," "," "," "," "," ","7. Ikke relevant"," "," "," "," ",null,null,null,null,null,null,null,null,null,null,null,null,null,null,null,null,null,null,null,null,null,null,null,null,null,null,null,null,null,null,null,null,null,null,null,null,null,null,null,null,null,null,null,null,null,null,null,null,null,null,null,null,null,null,null,null,null,null,{"$f":"IF(COUNTIF($I$10:I10,I11)=0,MAX($CH$10:CH10)+1,\"\")","v":""},{"$f":"IF(CH11<>\"\",SUMIF(Spm.I,$I11,Spm.29),\"\")","v":""},{"$f":"IF(CI11<>\"\",SUMIF(Spm.I,$I11,Spm.27),\"\")","v":""},{"$f":"IF(CI11=\"\",\"\",COUNTIFS(Spm.X2,\">\"&CI11)+COUNTIFS($CI$10:CI11,CI11))","v":""},{"$f":"IF($CJ11=\"\",\"\",COUNTIFS(Spm.X3,\">\"&$CJ11)+COUNTIFS($CJ$10:$CJ11,$CJ11))","v":""},{"$f":"IFERROR(IF(CA11=\"\",\"\",CA11/SUMIF(Spm.I,I11,Spm.27)*DR11),\"\")","v":""},{"$f":"IFERROR(IF(CA11=\"\",\"\",CA11/SUMIF(Spm.I,I11,Spm.27)*DY11),\"\")","v":""},{"$f":"IFERROR(IF($CH11<>\"\",IF(CM11<>\"\",SUMIF(Spm.I,$I11,Spm.X6),IF(CM11=\"\",AVERAGEIF(Spm.I,$I11,Spm.X23),\"\")),\"\"),\"\")","v":""},{"$f":"IFERROR(IF($CH11<>\"\",IF(CN11<>\"\",SUMIF(Spm.I,$I11,Spm.X7),IF(CN11=\"\",AVERAGEIF(Spm.I,$I11,Spm.X26),\"\")),\"\"),\"\")","v":""},{"$f":"IF($J11=\"Samfundskritisk\",COUNTIFS(Spm.J,\"Samfundskritisk\",Spm.27,\">\"&CA11)+COUNTIFS($J$10:J11,\"Samfundskritisk\",$CA$10:CA11,CA11),\"\")","v":""},{"$f":"IF(J11=\"Samfundskritisk\",COUNTIFS(Spm.J,\"Samfundskritisk\",Spm.29,\">\"&CF11)+COUNTIFS($J$10:J11,\"Samfundskritisk\",$CF$10:CF11,CF11),\"\")","v":""},{"$f":"IF(AND(ISNUMBER(DY11),DY11<=2),\"Utilfredsstillende\",IF(AND(ISNUMBER(DY11),DY11>2,DY11<=5),\"Tilfredsstillende\",\"\"))","v":""},{"$f":"IF($CS11=\"Utilfredsstillende\",$CC11,NA())","v":{"$error":"#N/A"}},{"$f":"IF($CS11=\"Utilfredsstillende\",$CA11,NA())","v":{"$error":"#N/A"}},{"$f":"IF($CS11=\"Tilfredsstillende\",$CC11,NA())","v":{"$error":"#N/A"}},{"$f":"IF($CS11=\"Tilfredsstillende\",$CA11,NA())","v":{"$error":"#N/A"}},{"$f":"SUM(COUNTIFS($BL11,\"1. Ja\",$BM11,{\"1. Ja\",\"4. Ikke relevant\"}))","v":0},{"$f":"COUNTIFS($BT11,\"1. Ja\",$BU11,\"1. Ja\")","v":0},{"$f":"COUNTIFS($BQ11,\"1. Ja\",$BV11,\"1. Ja\")","v":0},{"$f":"IF(SUM(COUNTIFS(BW11,{\"1. Ja\",\"3. Ikke*\"},BX11,{\"*Ja, it-systemet*\";\"4. Ikke*\"}))+SUM(COUNTIFS(BY11,\"1. Ja\",BZ11,{\"*Ja,*\",\"5. Ikke*\"}))=2,1,0)","v":0},{"$f":"IF(SUM(CX11:DA11)=4,1,0)","v":0},{"$f":"IFERROR(IF(Y11=\"\",\"\",EDATE(Y11,Z11)),\"\")","v":""},{"$f":"IF(AB11=\"\",\"\",IFERROR(AB11,\"\"))","v":""},{"$f":"IF(OR(DC11=\"\",DD11=\"\"),\"\",IF(DD11-1<=DC11,\"Ja\",\"Nej\"))","v":""},{"$f":"IFERROR(IF(AG11=\"\",\"\",EDATE(AG11,AH11)),\"\")","v":""},{"$f":"IF(AJ11=\"\",\"\",IFERROR(AJ11,\"\"))","v":""},{"$f":"IF(OR(DF11=\"\",DG11=\"\"),\"\",IF(DG11-1<=DF11,\"Ja\",\"Nej\"))","v":""},{"$f":"IFERROR(IF(AO11=\"\",\"\",EDATE(AO11,AP11)),\"\")","v":""},{"$f":"IF(AR11=\"\",\"\",IFERROR(AR11,\"\"))","v":""},{"$f":"IF(OR(DI11=\"\",DJ11=\"\"),\"\",IF(DJ11-1<=DI11,\"Ja\",\"Nej\"))","v":""},{"$f":"IFERROR(IF(AW11=\"\",\"\",EDATE(AW11,AX11)),\"\")","v":""},{"$f":"IF(AZ11=\"\",\"\",IFERROR(AZ11,\"\"))","v":""},{"$f":"IF(OR(DL11=\"\",DM11=\"\"),\"\",IF(DM11-1<=DL11,\"Ja\",\"Nej\"))","v":""},{"$f":"IFERROR(IF(BE11=\"\",\"\",EDATE(BE11,BF11)),\"\")","v":""},{"$f":"IF(BH11=\"\",\"\",IFERROR(BH11,\"\"))","v":""},{"$f":"IF(OR(DO11=\"\",DP11=\"\"),\"\",IF(DP11-1<=DO11,\"Ja\",\"Nej\"))","v":""},{"$f":"IF($S11=\"1. Meget utilfredsstillende\",1,\nIF($S11=\"2. Utilfredsstillende\",2,\nIF($S11=\"3. Tilfredsstillende\",3,\nIF($S11=\"4. Meget tilfredsstillende\",4,\nIF($S11=\"5. Særdeles tilfredsstillende\",5,\"\")))))","v":""},{"$f":"IF($V11=\"1. Meget utilfredsstillende\",1,\nIF($V11=\"2. Utilfredsstillende\",2,\nIF($V11=\"3. Tilfredsstillende\",3,\nIF($V11=\"4. Meget tilfredsstillende\",4,\nIF($V11=\"5. Særdeles tilfredsstillende\",5,\"\")))))","v":""},{"$f":"IF($W11=\"1. Meget utilfredsstillende\",1,\nIF($W11=\"2. Utilfredsstillende\",2,\nIF($W11=\"3. Tilfredsstillende\",3,\nIF($W11=\"4. Meget tilfredsstillende\",4,\nIF($W11=\"5. Særdeles tilfredsstillende\",5,\"\")))))","v":""},{"$f":"IF($AE11=\"1. Meget utilfredsstillende\",1,\nIF($AE11=\"2. Utilfredsstillende\",2,\nIF($AE11=\"3. Tilfredsstillende\",3,\nIF($AE11=\"4. Meget tilfredsstillende\",4,\nIF($AE11=\"5. Særdeles tilfredsstillende\",5,\"\")))))","v":""},{"$f":"IF($AM11=\"1. Meget utilfredsstillende\",1,\nIF($AM11=\"2. Utilfredsstillende\",2,\nIF($AM11=\"3. Tilfredsstillende\",3,\nIF($AM11=\"4. Meget tilfredsstillende\",4,\nIF($AM11=\"5. Særdeles tilfredsstillende\",5,\"\")))))","v":""},{"$f":"IF($AU11=\"1. Meget utilfredsstillende\",1,\nIF($AU11=\"2. Utilfredsstillende\",2,\nIF($AU11=\"3. Tilfredsstillende\",3,\nIF($AU11=\"4. Meget tilfredsstillende\",4,\nIF($AU11=\"5. Særdeles tilfredsstillende\",5,\"\")))))","v":""},{"$f":"IF($BC11=\"1. Meget utilfredsstillende\",1,\nIF($BC11=\"2. Utilfredsstillende\",2,\nIF($BC11=\"3. Tilfredsstillende\",3,\nIF($BC11=\"4. Meget tilfredsstillende\",4,\nIF($BC11=\"5. Særdeles tilfredsstillende\",5,\"\")))))","v":""},{"$f":"IF($BK11=\"1. Meget utilfredsstillende\",1,\nIF($BK11=\"2. Utilfredsstillende\",2,\nIF($BK11=\"3. Tilfredsstillende\",3,\nIF($BK11=\"4. Meget tilfredsstillende\",4,\nIF($BK11=\"5. Særdeles tilfredsstillende\",5,\"\")))))","v":""},{"$f":"IF($CA11=\"\",\"\",COUNTIFS(Spm.27,\">\"&$CA11)+COUNTIFS($CA$10:$CA11,$CA11))","v":""},{"$f":"IFERROR(SMALL($DT11:$DX11,1),\"\")","v":""},{"$f":"IF(OR(\nAND(X11=\"1. Dato (indsæt dato i næste felt)\",Y11<>\"\",DC11<'Data til anb. visninger'!$F$76,OR(AA11={\"2. Ikke planlagt\";\"3. Ved ikke\"})),\nAND(AF11=\"1. Dato (indsæt dato i næste felt)\",AG11<>\"\",DF11<'Data til anb. visninger'!$F$76,OR(AI11={\"2. Ikke planlagt\";\"3. Ved ikke\"})),\nAND(AN11=\"1. Dato (indsæt dato i næste felt)\",AO11<>\"\",DI11<'Data til anb. visninger'!$F$76,OR(AQ11={\"2. Ikke planlagt\";\"3. Ved ikke\"})),\nAND(AV11=\"1. Dato (indsæt dato i næste felt)\",AW11<>\"\",DL11<'Data til anb. visninger'!$F$76,OR(AY11={\"2. Ikke planlagt\";\"3. Ved ikke\"})),\nAND(BD11=\"1. Dato (indsæt dato i næste felt)\",BE11<>\"\",DO11<'Data til anb. visninger'!$F$76,OR(BG11={\"2. Ikke planlagt\";\"3. Ved ikke\"}))\n),1,\"\")","v":""},{"$f":"IF(OR(\nAND(X11=\"3. Ved ikke\",OR(AA11={\"2. Ikke planlagt\";\"3. Ved ikke\"})),\nAND(AF11=\"3. Ved ikke\",OR(AI11={\"2. Ikke planlagt\";\"3. Ved ikke\"})),\nAND(AN11=\"3. Ved ikke\",OR(AQ11={\"2. Ikke planlagt\";\"3. Ved ikke\"})),\nAND(AV11=\"3. Ved ikke\",OR(AY11={\"2. Ikke planlagt\";\"3. Ved ikke\"})),\nAND(BD11=\"3. Ved ikke\",OR(BG11={\"2. Ikke planlagt\";\"3. Ved ikke\"}))\n),0.85,\"\")","v":""},{"$f":"IF(OR(\nAND(X11=\"3. Ved ikke\",AA11=\"1. Dato (indsæt dato i næste felt)\"),\nAND(AF11=\"3. Ved ikke\",AI11=\"1. Dato (indsæt dato i næste felt)\"),\nAND(AN11=\"3. Ved ikke\",AQ11=\"1. Dato (indsæt dato i næste felt)\"),\nAND(AV11=\"3. Ved ikke\",AY11=\"1. Dato (indsæt dato i næste felt)\"),\nAND(BD11=\"3. Ved ikke\",BG11=\"1. Dato (indsæt dato i næste felt)\")\n),0.7,\"\")","v":""},{"$f":"IF(OR(\nDE11=\"Nej\",\nDH11=\"Nej\",\nDK11=\"Nej\",\nDN11=\"Nej\",\nDQ11=\"Nej\",\n),0.55,\"\")","v":""},{"$f":"IF(OR(\nAND(X11=\"1. Dato (indsæt dato i næste felt)\",Y11<>\"\",DC11>='Data til anb. visninger'!$F$76,OR(AA11={\"2. Ikke planlagt\";\"3. Ved ikke\"})),\nAND(AF11=\"1. Dato (indsæt dato i næste felt)\",AG11<>\"\",DF11>='Data til anb. visninger'!$F$76,OR(AI11={\"2. Ikke planlagt\";\"3. Ved ikke\"})),\nAND(AN11=\"1. Dato (indsæt dato i næste felt)\",AO11<>\"\",DI11>='Data til anb. visninger'!$F$76,OR(AQ11={\"2. Ikke planlagt\";\"3. Ved ikke\"})),\nAND(AV11=\"1. Dato (indsæt dato i næste felt)\",AW11<>\"\",DL11>='Data til anb. visninger'!$F$76,OR(AY11={\"2. Ikke planlagt\";\"3. Ved ikke\"})),\nAND(BD11=\"1. Dato (indsæt dato i næste felt)\",BE11<>\"\",DO11>='Data til anb. visninger'!$F$76,OR(BG11={\"2. Ikke planlagt\";\"3. Ved ikke\"}))\n),0.45,\"\")","v":""},{"$f":"IF(OR(\nAND(X11=\"2. Ingen udløbsdato\",OR(AA11={\"2. Ikke planlagt\";\"3. Ved ikke\"})),\nAND(AF11=\"2. Ingen udløbsdato\",OR(AI11={\"2. Ikke planlagt\";\"3. Ved ikke\"})),\nAND(AN11=\"2. Ingen udløbsdato\",OR(AQ11={\"2. Ikke planlagt\";\"3. Ved ikke\"})),\nAND(AV11=\"2. Ingen udløbsdato\",OR(AY11={\"2. Ikke planlagt\";\"3. Ved ikke\"})),\nAND(BD11=\"2. Ingen udløbsdato\",OR(BG11={\"2. Ikke planlagt\";\"3. Ved ikke\"}))\n),0.3,\"\")","v":""},{"$f":"IF(OR(\nAND(X11=\"2. Ingen udløbsdato\",AA11=\"1. Dato (indsæt dato i næste felt)\"),\nAND(AF11=\"2. Ingen udløbsdato\",AI11=\"1. Dato (indsæt dato i næste felt)\"),\nAND(AN11=\"2. Ingen udløbsdato\",AQ11=\"1. Dato (indsæt dato i næste felt)\"),\nAND(AV11=\"2. Ingen udløbsdato\",AY11=\"1. Dato (indsæt dato i næste felt)\"),\nAND(BD11=\"2. Ingen udløbsdato\",BG11=\"1. Dato (indsæt dato i næste felt)\")\n),0.15,\"\")","v":""},{"$f":"IF(OR(\nDE11=\"Ja\",\nDH11=\"Ja\",\nDK11=\"Ja\",\nDN11=\"Ja\",\nDQ11=\"Ja\",\n),0,\"\")","v":""},{"$f":"IFERROR(LARGE(EB11:EI11,1),\"\")","v":""},{"$f":"IF(EA11<>\"\",OFFSET(M11,0,MATCH(EA11,DT11:DX11,0),1,1),\"\")","v":""},{"$f":"IF(AND(X11=\"1. Dato (indsæt dato i næste felt)\",Y11<>\"\",DC11<'Data til anb. visninger'!$F$76,OR(AA11={\"2. Ikke planlagt\";\"3. Ved ikke\"})),N11,\nIF(AND(AF11=\"1. Dato (indsæt dato i næste felt)\",AG11<>\"\",DF11<'Data til anb. visninger'!$F$76,OR(AI11={\"2. Ikke planlagt\";\"3. Ved ikke\"})),O11,\nIF(AND(AN11=\"1. Dato (indsæt dato i næste felt)\",AO11<>\"\",DI11<'Data til anb. visninger'!$F$76,OR(AQ11={\"2. Ikke planlagt\";\"3. Ved ikke\"})),P11,\nIF(AND(AV11=\"1. Dato (indsæt dato i næste felt)\",AW11<>\"\",DL11<'Data til anb. visninger'!$F$76,OR(AY11={\"2. Ikke planlagt\";\"3. Ved ikke\"})),Q11,\nIF(AND(BD11=\"1. Dato (indsæt dato i næste felt)\",BE11<>\"\",DO11<'Data til anb. visninger'!$F$76,OR(BG11={\"2. Ikke planlagt\";\"3. Ved ikke\"})),R11,\nIF(AND(X11=\"3. Ved ikke\",OR(AA11={\"2. Ikke planlagt\";\"3. Ved ikke\"})),N11,\nIF(AND(AF11=\"3. Ved ikke\",OR(AI11={\"2. Ikke planlagt\";\"3. Ved ikke\"})),O11,\nIF(AND(AN11=\"3. Ved ikke\",OR(AQ11={\"2. Ikke planlagt\";\"3. Ved ikke\"})),P11,\nIF(AND(AV11=\"3. Ved ikke\",OR(AY11={\"2. Ikke planlagt\";\"3. Ved ikke\"})),Q11,\nIF(AND(BD11=\"3. Ved ikke\",OR(BG11={\"2. Ikke planlagt\";\"3. Ved ikke\"})),R11,\nIF(AND(X11=\"3. Ved ikke\",AA11=\"1. Dato (indsæt dato i næste felt)\"),N11,\nIF(AND(AF11=\"3. Ved ikke\",AI11=\"1. Dato (indsæt dato i næste felt)\"),O11,\nIF(AND(AN11=\"3. Ved ikke\",AQ11=\"1. Dato (indsæt dato i næste felt)\"),P11,\nIF(AND(AV11=\"3. Ved ikke\",AY11=\"1. Dato (indsæt dato i næste felt)\"),Q11,\nIF(AND(BD11=\"3. Ved ikke\",BG11=\"1. Dato (indsæt dato i næste felt)\"),R11,\nIF(DE11=\"Nej\",N11,\nIF(DH11=\"Nej\",O11,\nIF(DK11=\"Nej\",P11,\nIF(DN11=\"Nej\",Q11,\nIF(DQ11=\"Nej\",R11,\nIF(AND(X11=\"1. Dato (indsæt dato i næste felt)\",Y11<>\"\",DC11>='Data til anb. visninger'!$F$76,OR(AA11={\"2. Ikke planlagt\";\"3. Ved ikke\"})),N11,\nIF(AND(AF11=\"1. Dato (indsæt dato i næste felt)\",AG11<>\"\",DF11>='Data til anb. visninger'!$F$76,OR(AI11={\"2. Ikke planlagt\";\"3. Ved ikke\"})),O11,\nIF(AND(AN11=\"1. Dato (indsæt dato i næste felt)\",AO11<>\"\",DI11>='Data til anb. visninger'!$F$76,OR(AQ11={\"2. Ikke planlagt\";\"3. Ved ikke\"})),P11,\nIF(AND(AV11=\"1. Dato (indsæt dato i næste felt)\",AW11<>\"\",DL11>='Data til anb. visninger'!$F$76,OR(AY11={\"2. Ikke planlagt\";\"3. Ved ikke\"})),Q11,\nIF(AND(BD11=\"1. Dato (indsæt dato i næste felt)\",BE11<>\"\",DO11>='Data til anb. visninger'!$F$76,OR(BG11={\"2. Ikke planlagt\";\"3. Ved ikke\"})),R11,\nIF(AND(X11=\"2. Ingen udløbsdato\",OR(AA11={\"2. Ikke planlagt\";\"3. Ved ikke\"})),N11,\nIF(AND(AF11=\"2. Ingen udløbsdato\",OR(AI11={\"2. Ikke planlagt\";\"3. Ved ikke\"})),O11,\nIF(AND(AN11=\"2. Ingen udløbsdato\",OR(AQ11={\"2. Ikke planlagt\";\"3. Ved ikke\"})),P11,\nIF(AND(AV11=\"2. Ingen udløbsdato\",OR(AY11={\"2. Ikke planlagt\";\"3. Ved ikke\"})),Q11,\nIF(AND(BD11=\"2. Ingen udløbsdato\",OR(BG11={\"2. Ikke planlagt\";\"3. Ved ikke\"})),R11,\nIF(AND(X11=\"2. Ingen udløbsdato\",AA11=\"1. Dato (indsæt dato i næste felt)\"),N11,\nIF(AND(AF11=\"2. Ingen udløbsdato\",AI11=\"1. Dato (indsæt dato i næste felt)\"),O11,\nIF(AND(AN11=\"2. Ingen udløbsdato\",AQ11=\"1. Dato (indsæt dato i næste felt)\"),P11,\nIF(AND(AV11=\"2. Ingen udløbsdato\",AY11=\"1. Dato (indsæt dato i næste felt)\"),Q11,\nIF(AND(BD11=\"2. Ingen udløbsdato\",BG11=\"1. Dato (indsæt dato i næste felt)\"),R11,\nIF(DE11=\"Ja\",N11,\nIF(DH11=\"Ja\",O11,\nIF(DK11=\"Ja\",P11,\nIF(DN11=\"Ja\",Q11,\nIF(DQ11=\"Ja\",R11,\n\"\"))))))))))))))))))))))))))))))))))))))))","v":""}]
[null,null,8,"Spørgsmål I","Primært understøttet forretningsområde","Valgfri"]
[null,null,9,"Spørgsmål J","It-systemets kritikalitet","Kritikalitet",null,"Farve: Må ikke ændres"]
[null,null,10,"Spørgsmål K1","It-systemets sourcingmodel for drift","Sourcing1",null,null,"Antal systemer i Dataindtastning",null,{"$f":"COUNTA(Dataindtastning!$E:$E)-16","v":0},null,"Første række til kopiering af it-systemer",null,26,null,"Kolonne med slut af masterdata",null,{"$f":"MAX(Datagrundlag!$10:$10)","v":83},null,"Række hvor heatmapdata starter",null,14]
[null,null,11,"Spørgsmål K2","It-systemets sourcingmodel for vedligehold og udvikling","Sourcing2",null,null,"Antal systemer i Datagrundlag",null,{"$f":"COUNTA(Datagrundlag!B:B)-6","v":0},null,"Sidste række til kopiering af it-systemer",null,1500,null,"Række med rækkereferencer i spørgeskemaet",null,412,null,"Antal spørgsmål i heatmap",null,19]
[null,null,12,"Spørgsmål L","Samlet antal leverandørkontrakter for drift, vedligehold og udvikling","Tal",null,null,"Række hvor systemdata starter",null,11," ","Kolonne E: Antal forskellige inputs",null,{"$f":"COUNTA(INDIRECT(\"Dataindtastning!E\"&O14&\":E\"&O15))-COUNTIF(INDIRECT(\"Dataindtastning!E\"&O14&\":E\"&O15),INDIRECT(\"Dataindtastning!E\"&O14))+1","v":1},null,"Startkolonne med rækkereferencer i spørgeskemaet",null,3]
[null,null,13,"Spørgsmål M1","Angiv navnene på leverandørkontrakterne og leverandør (leverandør 1)","Valgfri",null,null,"Navn af denne fil",null,{"$f":"\"'\"&MID(CELL(\"filename\",A1),FIND(\"[\",CELL(\"filename\",A1))+1,FIND(\"]\", CELL(\"filename\",A1))-FIND(\"[\",CELL(\"filename\",A1))-1)&\"'!\"","v":"'Datagrundlag v31 Releaseversion.xlsm'!"}," ","Kolonne F: Antal forskellige inputs",null,{"$f":"COUNTA(INDIRECT(\"Dataindtastning!F\"&O14&\":F\"&O15))-COUNTIF(INDIRECT(\"Dataindtastning!F\"&O14&\":F\"&O15),INDIRECT(\"Dataindtastning!F\"&O14))+1","v":1},null,"Kolonne med svarfelterne i spørgeskemaet",null,12]
[null,null,14,"Spørgsmål M2","Angiv navnene på leverandørkontrakterne og leverandør (leverandør 2)","Valgfri",null,null,"Dataflyt valgt?",null,null,null,"Kolonne G: Antal forskellige inputs",null,{"$f":"COUNTA(INDIRECT(\"Dataindtastning!G\"&O14&\":G\"&O15))-COUNTIF(INDIRECT(\"Dataindtastning!G\"&O14&\":G\"&O15),INDIRECT(\"Dataindtastning!G\"&O14))+1","v":1},null,"Kolonne med default værdier i spørgeskemaet",null,19]
[null,null,15,"Spørgsmål M3","Angiv navnene på leverandørkontrakterne og leverandør (leverandør 3)","Valgfri",null,null,"Antal fejl fundet i valideringen",null,0,null,"Manglende inputs til Stamdata",null,{"$f":"IFERROR(COUNTBLANK(rng_Stamdata),0)","v":0},null,"Kontaktperson"]
[null,null,16,"Spørgsmål M4","Angiv navnene på leverandørkontrakterne og leverandør (leverandør 4)","Valgfri",null,null,"Række til kopiering af it-systemer",null,26,null,"Antal spørgeskemaer der bliver genereret",null,1,null,"E-mail"]
[null,null,17,"Spørgsmål M5","Angiv navnene på leverandørkontrakterne og leverandør (leverandør 5)","Valgfri",null,null,"Antal overførte systemer",null,0,null,"Næste række i kommentar-ark",null,{"$f":"rng_NewSystemCount+3","v":3},null,"Tlf."]
[null,null,18,"Spørgsmål 1","Hvor tilfredsstillende er it-systemets understøttelse af forretningsprocesser i dag?","TLFRDS",null,null,"Antal tomme fundet i valideringen",null,0,null,"Antal duplikater i datagrundlag",null,{"$f":"SUM(1/COUNTIF(rng_SystemNames,rng_SystemNames))","v":{"$error":"#REF!"}},null,"Kolonne med kommentarfelt i spørgeskemaet",null,21]
[null,null,19,"Spørgsmål 2","I hvilken grad er der omskiftelighed i forretningsgrundlaget for it-systemet?","IVG"]
[null,null,20,"Spørgsmål 3","Hvor mange slutbrugere har it-systemet?","Tal"]
[null,null,21,"Spørgsmål 4","Hvor tilfredsstillende er it-systemets realiserede tilgængelighed?","TLFRDS",null,null,null,null,null,null,null,"note: dårligt",null,"ikke benyttet?",null,null,null,"dårligt? ","dårligt? ","dårligt? ","note: godt",null,"distance til dato?","prioritering?","prioritering?"]
[null,null,22,"Spørgsmål 5.1","Hvor tilfredsstillende er myndighedens kontraktstyring af it-systemets kontraktdokumenter i dag?\n","TLFRDS",null,"Start offset","TLFRDS","JNVIIR","DIU","DIP","JNVI","IVG","EJ","JN","JNIR","JJNIR","JJNVIIR","Kritikalitet","Sourcing1","Sourcing2","IVG_2","Valgfri","Dato","Sum","Tal"]
[null,null,23,"Spørgsmål 6.1.1","Hvad er udløbsdatoen for kontrakten eksklusiv forlængelsesperioden?","DIU",null,null,"Tilfredsstillende","Ja/nej/ved ikke/ikke relevant","Dato","Dato","Ja/nej/ved ikke","I hvilken grad","Ejerskab","Ja/nej","Ja/nej/ikke relevant","Ja/ja/nej/ikke relevant","Ja/ja/nej/ved ikke/ikke relevant","Kritikalitet","Sourcing (L1)","Sourcing (L2)","I hvilken grad","Valgfri","Dato","Sum","Tal"]
[null,null,24,"Spørgsmål 6.1.2","Hvad er udløbsdatoen for kontrakten eksklusiv forlængelsesperioden?","Dato",null,null,1,0,0,null,0,0,1,1,0,0,0,1,1,1,1]
[null,null,25,"Spørgsmål 7.1","Hvor mange forlængelsesmåneder giver kontrakten maksimalt mulighed for?","Tal",null,null,0.75,1,0,null,1,0.25,0.5,0,1,0.25,0.25,0.5,0.67,0.5,0.75," "," "," "," "]
[null,null,26,"Spørgsmål 8.1.1","Hvornår er it-systemets transition til en eventuel ny leverandør planlagt afsluttet?","DIP",null,null,0.5,1,1,null,1,0.5,0," ",-0.01,1,1,0,0.33,0,0.5," "," "," "," "]
[null,null,27,"Spørgsmål 8.1.2","Hvornår er it-systemets transition til en eventuel ny leverandør planlagt afsluttet?","Dato",null,null,0.25,-0.01," "," "," ",0.75,1," "," ",-0.01,1," ",0," ",0.25," "," "," "," "]
[null,null,28,"Spørgsmål 9.1","Er alle væsentlige kontraktdokumenter med videre for it-systemet optaget i et kontraktbibliotek?","JNVI",null,null,0," "," "," "," ",1," "," "," "," ",-0.01," "," "," ",0," "," "," "," "]
[null,null,29,"Spørgsmål 10.1","Følges faste procedurer for økonomisk controlling imod kontrakt og leverede ydelser?","JNVI",null,null," "," "," "," "," ",1," "," "," "," "," "," "," "," ",1," ","  ","  ","  "]
[null,null,30,"Spørgsmål 5.2","Hvor tilfredsstillende er myndighedens kontraktstyring af it-systemets kontraktdokumenter i dag?\n","TLFRDS",null,null," "," "," "," "," "," "," "," "," "," "," "," "," "," ",-0.01," "," "," "," "]
[null,null,31,"Spørgsmål 6.2.1","Hvad er udløbsdatoen for kontrakten eksklusiv forlængelsesperioden?","DIU"]
[null,null,32,"Spørgsmål 6.2.2","Hvad er udløbsdatoen for kontrakten eksklusiv forlængelsesperioden?","Dato"]
[null,null,33,"Spørgsmål 7.2","Hvor mange forlængelsesmåneder giver kontrakten maksimalt mulighed for?","Tal"]
[null,null,34,"Spørgsmål 8.2.1","Hvornår er it-systemets transition til en eventuel ny leverandør planlagt afsluttet?","DIP"]
[null,null,35,"Spørgsmål 8.2.2","Hvornår er it-systemets transition til en eventuel ny leverandør planlagt afsluttet?","Dato"]
[null,null,36,"Spørgsmål 9.2","Er alle væsentlige kontraktdokumenter med videre for it-systemet optaget i et kontraktbibliotek?","JNVI"]
[null,null,37,"Spørgsmål 10.2","Følges faste procedurer for økonomisk controlling imod kontrakt og leverede ydelser?","JNVI"]
[null,null,38,"Spørgsmål 5.3","Hvor tilfredsstillende er myndighedens kontraktstyring af it-systemets kontraktdokumenter i dag?\n","TLFRDS"]
[null,null,39,"Spørgsmål 6.3.1","Hvad er udløbsdatoen for kontrakten eksklusiv forlængelsesperioden?","DIU"]
[null,null,40,"Spørgsmål 6.3.2","Hvad er udløbsdatoen for kontrakten eksklusiv forlængelsesperioden?","Dato"]
[null,null,41,"Spørgsmål 7.3","Hvor mange forlængelsesmåneder giver kontrakten maksimalt mulighed for?","Tal"]
[null,null,42,"Spørgsmål 8.3.1","Hvornår er it-systemets transition til en eventuel ny leverandør planlagt afsluttet?","DIP"]
[null,null,43,"Spørgsmål 8.3.2","Hvornår er it-systemets transition til en eventuel ny leverandør planlagt afsluttet?","Dato"]
[null,null,44,"Spørgsmål 9.3","Er alle væsentlige kontraktdokumenter med videre for it-systemet optaget i et kontraktbibliotek?","JNVI",null,null,"Anbefalede visninger",null,null,null,null,"Yderligere visninger",null,null,null,null,"Heatmap variationer:",null,null,null,"Kodeord til ark og projektmappe:"]
[null,null,45,"Spørgsmål 10.3","Følges faste procedurer for økonomisk controlling imod kontrakt og leverede ydelser?","JNVI",null,null,null,null,null,null,null,null,null,null,null,null,null,null,null,null,"*Nederste på listen vil blive benyttet som nyt kodeord. Bemærk at første kode er ét mellemrum \" \""]
[null,null,46,"Spørgsmål 5.4","Hvor tilfredsstillende er myndighedens kontraktstyring af it-systemets kontraktdokumenter i dag?\n","TLFRDS",null,null,"Visning","Lvl1","Lvl2","Data completeness",null,"Visning","Lvl1","Lvl2","Data completeness",null,"Opslag",null,null,null,"Kode","Dato - log"]
[null,null,47,"Spørgsmål 6.4.1","Hvad er udløbsdatoen for kontrakten eksklusiv forlængelsesperioden?","DIU",null,null,"4.1.2.A","X1","I",{"$f":"IFERROR(OFFSET(Datagrundlag!$A$5,0,MATCH(\"Spørgsmål \"&Table1[[#This Row],[Lvl2]],rng_AnswersQ,0)),\"\")","v":true},null,"Visning I","I","I",{"$f":"IFERROR(OFFSET(Datagrundlag!$A$5,0,MATCH(\"Spørgsmål \"&Table2[[#This Row],[Lvl2]],rng_AnswersQ,0)),\"\")","v":true},null,"Original",null,null,null," ","2019-04-29"]
[null,null,48,"Spørgsmål 6.4.2","Hvad er udløbsdatoen for kontrakten eksklusiv forlængelsesperioden?","Dato",null,null,"4.1.2.A","I","I",{"$f":"IFERROR(OFFSET(Datagrundlag!$A$5,0,MATCH(\"Spørgsmål \"&Table1[[#This Row],[Lvl2]],rng_AnswersQ,0)),\"\")","v":true},null,"Visning I","X4","I",{"$f":"IFERROR(OFFSET(Datagrundlag!$A$5,0,MATCH(\"Spørgsmål \"&Table2[[#This Row],[Lvl2]],rng_AnswersQ,0)),\"\")","v":true},null,"Værst til bedst",null,null,null,"2lp1b","2019-05-06"]
[null,null,49,"Spørgsmål 7.4","Hvor mange forlængelsesmåneder giver kontrakten maksimalt mulighed for?","Tal",null,null,"4.1.2.A","J","J",{"$f":"IFERROR(OFFSET(Datagrundlag!$A$5,0,MATCH(\"Spørgsmål \"&Table1[[#This Row],[Lvl2]],rng_AnswersQ,0)),\"\")","v":true},null,"Visning I","X4","29",{"$f":"IFERROR(OFFSET(Datagrundlag!$A$5,0,MATCH(\"Spørgsmål \"&Table2[[#This Row],[Lvl2]],rng_AnswersQ,0)),\"\")","v":true}]
[null,null,50,"Spørgsmål 8.4.1","Hvornår er it-systemets transition til en eventuel ny leverandør planlagt afsluttet?","DIP",null,null,"4.1.2.A",1,"1",{"$f":"IFERROR(OFFSET(Datagrundlag!$A$5,0,MATCH(\"Spørgsmål \"&Table1[[#This Row],[Lvl2]],rng_AnswersQ,0)),\"\")","v":true},null,"Visning I","X2","29",{"$f":"IFERROR(OFFSET(Datagrundlag!$A$5,0,MATCH(\"Spørgsmål \"&Table2[[#This Row],[Lvl2]],rng_AnswersQ,0)),\"\")","v":true}]
[null,null,51,"Spørgsmål 8.4.2","Hvornår er it-systemets transition til en eventuel ny leverandør planlagt afsluttet?","Dato",null,null,"4.2.2.A","X17",12,{"$f":"IFERROR(OFFSET(Datagrundlag!$A$5,0,MATCH(\"Spørgsmål \"&Table1[[#This Row],[Lvl2]],rng_AnswersQ,0)),\"\")","v":true},null,"Visning I","X8","23",{"$f":"IFERROR(OFFSET(Datagrundlag!$A$5,0,MATCH(\"Spørgsmål \"&Table2[[#This Row],[Lvl2]],rng_AnswersQ,0)),\"\")","v":true},null,"Kritisk/Værst"]
[null,null,52,"Spørgsmål 9.4","Er alle væsentlige kontraktdokumenter med videre for it-systemet optaget i et kontraktbibliotek?","JNVI",null,null,"4.2.2.A","X17",13,{"$f":"IFERROR(OFFSET(Datagrundlag!$A$5,0,MATCH(\"Spørgsmål \"&Table1[[#This Row],[Lvl2]],rng_AnswersQ,0)),\"\")","v":true},null,"Visning I","X8","1",{"$f":"IFERROR(OFFSET(Datagrundlag!$A$5,0,MATCH(\"Spørgsmål \"&Table2[[#This Row],[Lvl2]],rng_AnswersQ,0)),\"\")","v":true}]
[null,null,53,"Spørgsmål 10.4","Følges faste procedurer for økonomisk controlling imod kontrakt og leverede ydelser?","JNVI",null,null,"4.2.2.A","X18",20,{"$f":"IFERROR(OFFSET(Datagrundlag!$A$5,0,MATCH(\"Spørgsmål \"&Table1[[#This Row],[Lvl2]],rng_AnswersQ,0)),\"\")","v":true},null,"Visning I","X8","27",{"$f":"IFERROR(OFFSET(Datagrundlag!$A$5,0,MATCH(\"Spørgsmål \"&Table2[[#This Row],[Lvl2]],rng_AnswersQ,0)),\"\")","v":true}]
[null,null,54,"Spørgsmål 5.5","Hvor tilfredsstillende er myndighedens kontraktstyring af it-systemets kontraktdokumenter i dag?\n","TLFRDS",null,null,"4.2.2.A","X18",21,{"$f":"IFERROR(OFFSET(Datagrundlag!$A$5,0,MATCH(\"Spørgsmål \"&Table1[[#This Row],[Lvl2]],rng_AnswersQ,0)),\"\")","v":true},null,"Visning II","I","I",{"$f":"IFERROR(OFFSET(Datagrundlag!$A$5,0,MATCH(\"Spørgsmål \"&Table2[[#This Row],[Lvl2]],rng_AnswersQ,0)),\"\")","v":true}]
[null,null,55,"Spørgsmål 6.5.1","Hvad er udløbsdatoen for kontrakten eksklusiv forlængelsesperioden?","DIU",null,null,"4.2.2.A","X19",17,{"$f":"IFERROR(OFFSET(Datagrundlag!$A$5,0,MATCH(\"Spørgsmål \"&Table1[[#This Row],[Lvl2]],rng_AnswersQ,0)),\"\")","v":true},null,"Visning II","X4","I",{"$f":"IFERROR(OFFSET(Datagrundlag!$A$5,0,MATCH(\"Spørgsmål \"&Table2[[#This Row],[Lvl2]],rng_AnswersQ,0)),\"\")","v":true}]
[null,null,56,"Spørgsmål 6.5.2","Hvad er udløbsdatoen for kontrakten eksklusiv forlængelsesperioden?","Dato",null,null,"4.2.2.A","X19",22,{"$f":"IFERROR(OFFSET(Datagrundlag!$A$5,0,MATCH(\"Spørgsmål \"&Table1[[#This Row],[Lvl2]],rng_AnswersQ,0)),\"\")","v":true},null,"Visning II","X4","29",{"$f":"IFERROR(OFFSET(Datagrundlag!$A$5,0,MATCH(\"Spørgsmål \"&Table2[[#This Row],[Lvl2]],rng_AnswersQ,0)),\"\")","v":true}]
[null,null,57,"Spørgsmål 7.5","Hvor mange forlængelsesmåneder giver kontrakten maksimalt mulighed for?","Tal",null,null,"4.2.2.A","X20",23,{"$f":"IFERROR(OFFSET(Datagrundlag!$A$5,0,MATCH(\"Spørgsmål \"&Table1[[#This Row],[Lvl2]],rng_AnswersQ,0)),\"\")","v":true},null,"Visning II","X2","29",{"$f":"IFERROR(OFFSET(Datagrundlag!$A$5,0,MATCH(\"Spørgsmål \"&Table2[[#This Row],[Lvl2]],rng_AnswersQ,0)),\"\")","v":true}]
[null,null,58,"Spørgsmål 8.5.1","Hvornår er it-systemets transition til en eventuel ny leverandør planlagt afsluttet?","DIP",null,null,"4.2.2.A","X20",24,{"$f":"IFERROR(OFFSET(Datagrundlag!$A$5,0,MATCH(\"Spørgsmål \"&Table1[[#This Row],[Lvl2]],rng_AnswersQ,0)),\"\")","v":true},null,"Visning II","X9","11",{"$f":"IFERROR(OFFSET(Datagrundlag!$A$5,0,MATCH(\"Spørgsmål \"&Table2[[#This Row],[Lvl2]],rng_AnswersQ,0)),\"\")","v":true},null,"Ikke kritisk/Bedst"]
[null,null,59,"Spørgsmål 8.5.2","Hvornår er it-systemets transition til en eventuel ny leverandør planlagt afsluttet?","Dato",null,null,"4.2.2.A","X20",25,{"$f":"IFERROR(OFFSET(Datagrundlag!$A$5,0,MATCH(\"Spørgsmål \"&Table1[[#This Row],[Lvl2]],rng_AnswersQ,0)),\"\")","v":true},null,"Visning II","X9","27",{"$f":"IFERROR(OFFSET(Datagrundlag!$A$5,0,MATCH(\"Spørgsmål \"&Table2[[#This Row],[Lvl2]],rng_AnswersQ,0)),\"\")","v":true},null,"Ikke relevant"]
[null,null,60,"Spørgsmål 9.5","Er alle væsentlige kontraktdokumenter med videre for it-systemet optaget i et kontraktbibliotek?","JNVI",null,null,"4.2.2.A","X20",26,{"$f":"IFERROR(OFFSET(Datagrundlag!$A$5,0,MATCH(\"Spørgsmål \"&Table1[[#This Row],[Lvl2]],rng_AnswersQ,0)),\"\")","v":true},null,"Visning III","X11","J",{"$f":"IFERROR(OFFSET(Datagrundlag!$A$5,0,MATCH(\"Spørgsmål \"&Table2[[#This Row],[Lvl2]],rng_AnswersQ,0)),\"\")","v":true}]
[null,null,61,"Spørgsmål 10.5","Følges faste procedurer for økonomisk controlling imod kontrakt og leverede ydelser?","JNVI",null,null,"4.2.3.A","X12",11,{"$f":"IFERROR(OFFSET(Datagrundlag!$A$5,0,MATCH(\"Spørgsmål \"&Table1[[#This Row],[Lvl2]],rng_AnswersQ,0)),\"\")","v":true},null,"Visning III","X11","29",{"$f":"IFERROR(OFFSET(Datagrundlag!$A$5,0,MATCH(\"Spørgsmål \"&Table2[[#This Row],[Lvl2]],rng_AnswersQ,0)),\"\")","v":true}]
[null,null,62,"Spørgsmål 11","Hvor tilfredsstillende er it-systemets tekniske tilstand i dag?\n","TLFRDS",null,null,"4.2.3.A","X13","28B",{"$f":"IFERROR(OFFSET(Datagrundlag!$A$5,0,MATCH(\"Spørgsmål \"&Table1[[#This Row],[Lvl2]],rng_AnswersQ,0)),\"\")","v":true},null,"Visning III","29","29",{"$f":"IFERROR(OFFSET(Datagrundlag!$A$5,0,MATCH(\"Spørgsmål \"&Table2[[#This Row],[Lvl2]],rng_AnswersQ,0)),\"\")","v":true}]
[null,null,63,"Spørgsmål 12","Baserer it-systemets teknologiske komponenter sig primært på versioner, som forventes vedligeholdt af et leverandørmarked fremadrettet?","JNVI",null,null,"4.2.3.A","X14",27,{"$f":"IFERROR(OFFSET(Datagrundlag!$A$5,0,MATCH(\"Spørgsmål \"&Table1[[#This Row],[Lvl2]],rng_AnswersQ,0)),\"\")","v":true},null,"Visning III","X23","1",{"$f":"IFERROR(OFFSET(Datagrundlag!$A$5,0,MATCH(\"Spørgsmål \"&Table2[[#This Row],[Lvl2]],rng_AnswersQ,0)),\"\")","v":true}]
[null,null,64,"Spørgsmål 13","Understøtter it-systemet, gennem planlagt vedligehold og videreudvikling, alle væsentlige tiltænkte processer i forretningsgrundlaget i de kommende tre år?\n","JNVIIR",null,null,"4.2.3.A","X15","28B",{"$f":"IFERROR(OFFSET(Datagrundlag!$A$5,0,MATCH(\"Spørgsmål \"&Table1[[#This Row],[Lvl2]],rng_AnswersQ,0)),\"\")","v":true},null,"Visning III","X26","11",{"$f":"IFERROR(OFFSET(Datagrundlag!$A$5,0,MATCH(\"Spørgsmål \"&Table2[[#This Row],[Lvl2]],rng_AnswersQ,0)),\"\")","v":true}]
[null,null,65,"Spørgsmål 14","Er it-systemets primære integrationer baseret på standardadaptere?","JNVI",null,null,"4.2.4.A",20,"20",{"$f":"IFERROR(OFFSET(Datagrundlag!$A$5,0,MATCH(\"Spørgsmål \"&Table1[[#This Row],[Lvl2]],rng_AnswersQ,0)),\"\")","v":true},null,"Visning IV","X5","27",{"$f":"IFERROR(OFFSET(Datagrundlag!$A$5,0,MATCH(\"Spørgsmål \"&Table2[[#This Row],[Lvl2]],rng_AnswersQ,0)),\"\")","v":true}]
[null,null,66,"Spørgsmål 15","I hvilken grad kan it-systemet skaleres kapacitetsmæssigt i forhold til behov (flere brugere, flere data)?\n","IVG_2",null,null,"4.2.4.A",21,"21",{"$f":"IFERROR(OFFSET(Datagrundlag!$A$5,0,MATCH(\"Spørgsmål \"&Table1[[#This Row],[Lvl2]],rng_AnswersQ,0)),\"\")","v":true},null,"Visning IV","I","I",{"$f":"IFERROR(OFFSET(Datagrundlag!$A$5,0,MATCH(\"Spørgsmål \"&Table2[[#This Row],[Lvl2]],rng_AnswersQ,0)),\"\")","v":true}]
[null,null,67,"Spørgsmål 16","Hvilke primære programmeringssprog er it-systemet baseret på?\n","Valgfri",null,null,"4.2.5.A",20,"20",{"$f":"IFERROR(OFFSET(Datagrundlag!$A$5,0,MATCH(\"Spørgsmål \"&Table1[[#This Row],[Lvl2]],rng_AnswersQ,0)),\"\")","v":true},null,"Visning IV","28A","28A",{"$f":"IFERROR(OFFSET(Datagrundlag!$A$5,0,MATCH(\"Spørgsmål \"&Table2[[#This Row],[Lvl2]],rng_AnswersQ,0)),\"\")","v":true}]
[null,null,68,"Spørgsmål 17","Er dokumentationen i al væsentlighed retvisende for it-systemets nuværende tilstand?","JNVI",null,null,"4.2.5.A",17,"17",{"$f":"IFERROR(OFFSET(Datagrundlag!$A$5,0,MATCH(\"Spørgsmål \"&Table1[[#This Row],[Lvl2]],rng_AnswersQ,0)),\"\")","v":true},null,"Visning IV","28B","28B",{"$f":"IFERROR(OFFSET(Datagrundlag!$A$5,0,MATCH(\"Spørgsmål \"&Table2[[#This Row],[Lvl2]],rng_AnswersQ,0)),\"\")","v":true}]
[null,null,69,"Spørgsmål 18","Hvad er myndighedens rettigheder i forhold til hovedkomponenterne i it-systemet?\n\n","EJ",null,null,"4.2.6.A","J","J",{"$f":"IFERROR(OFFSET(Datagrundlag!$A$5,0,MATCH(\"Spørgsmål \"&Table1[[#This Row],[Lvl2]],rng_AnswersQ,0)),\"\")","v":true},null,"Visning IV","28C","28C",{"$f":"IFERROR(OFFSET(Datagrundlag!$A$5,0,MATCH(\"Spørgsmål \"&Table2[[#This Row],[Lvl2]],rng_AnswersQ,0)),\"\")","v":true}]
[null,null,70,"Spørgsmål 19","Hvad er myndighedens rettigheder i forhold til data?\n","EJ",null,null,"4.2.6.A",23,23,{"$f":"IFERROR(OFFSET(Datagrundlag!$A$5,0,MATCH(\"Spørgsmål \"&Table1[[#This Row],[Lvl2]],rng_AnswersQ,0)),\"\")","v":true},null,"Visning IV","28D","28D",{"$f":"IFERROR(OFFSET(Datagrundlag!$A$5,0,MATCH(\"Spørgsmål \"&Table2[[#This Row],[Lvl2]],rng_AnswersQ,0)),\"\")","v":true}]
[null,null,71,"Spørgsmål 20","Har myndigheden mere end én ressource med teknisk viden om it-systemet?\n\n","JNVI",null,null,"4.2.6.A",24,24,{"$f":"IFERROR(OFFSET(Datagrundlag!$A$5,0,MATCH(\"Spørgsmål \"&Table1[[#This Row],[Lvl2]],rng_AnswersQ,0)),\"\")","v":true},null,"Visning V","X5","27",{"$f":"IFERROR(OFFSET(Datagrundlag!$A$5,0,MATCH(\"Spørgsmål \"&Table2[[#This Row],[Lvl2]],rng_AnswersQ,0)),\"\")","v":true}]
[null,null,72,"Spørgsmål 21","Er der en opdateret proces for håndtering af nøglepersonsafhængigheder?","JNVI",null,null,"4.3.3.A","K1","K1",{"$f":"IFERROR(OFFSET(Datagrundlag!$A$5,0,MATCH(\"Spørgsmål \"&Table1[[#This Row],[Lvl2]],rng_AnswersQ,0)),\"\")","v":true},null,"Visning V","I","I",{"$f":"IFERROR(OFFSET(Datagrundlag!$A$5,0,MATCH(\"Spørgsmål \"&Table2[[#This Row],[Lvl2]],rng_AnswersQ,0)),\"\")","v":true}]
[null,null,73,"Spørgsmål 22","Er der etableret formelle procedurer for løbende opsamling og overlevering af information for it-systemet?","JNVI",null,null,"4.3.3.A","J","J",{"$f":"IFERROR(OFFSET(Datagrundlag!$A$5,0,MATCH(\"Spørgsmål \"&Table1[[#This Row],[Lvl2]],rng_AnswersQ,0)),\"\")","v":true},null,"Visning V","27","27",{"$f":"IFERROR(OFFSET(Datagrundlag!$A$5,0,MATCH(\"Spørgsmål \"&Table2[[#This Row],[Lvl2]],rng_AnswersQ,0)),\"\")","v":true}]
[null,null,74,"Spørgsmål 23","Overholder forvaltningen af it-systemet de gældende politikker og retningslinjer, som myndigheden har implementeret i henhold til ISO 27001-standarden?","JNIR",null,null,"4.3.3.B","K2","K2",{"$f":"IFERROR(OFFSET(Datagrundlag!$A$5,0,MATCH(\"Spørgsmål \"&Table1[[#This Row],[Lvl2]],rng_AnswersQ,0)),\"\")","v":true},null,"Visning VI","C","C",{"$f":"IFERROR(OFFSET(Datagrundlag!$A$5,0,MATCH(\"Spørgsmål \"&Table2[[#This Row],[Lvl2]],rng_AnswersQ,0)),\"\")","v":true}]
[null,null,75,"Spørgsmål 24","Imødekommer it-systemet kravene i databeskyttelsesforordningen?","JJNIR",null,null,"4.3.3.B","J","J",{"$f":"IFERROR(OFFSET(Datagrundlag!$A$5,0,MATCH(\"Spørgsmål \"&Table1[[#This Row],[Lvl2]],rng_AnswersQ,0)),\"\")","v":true},null,"Visning VI","28A","28A",{"$f":"IFERROR(OFFSET(Datagrundlag!$A$5,0,MATCH(\"Spørgsmål \"&Table2[[#This Row],[Lvl2]],rng_AnswersQ,0)),\"\")","v":true}]
[null,null,76,"Spørgsmål 25","Er alle relevante sikkerhedsopdateringer og patches implementeret?","JNVI",null,null,"4.3.5.A","6.1.1","6.1.1",{"$f":"IFERROR(OFFSET(Datagrundlag!$A$5,0,MATCH(\"Spørgsmål \"&Table1[[#This Row],[Lvl2]],rng_AnswersQ,0)),\"\")","v":true},null,"Visning VI","28B","28B",{"$f":"IFERROR(OFFSET(Datagrundlag!$A$5,0,MATCH(\"Spørgsmål \"&Table2[[#This Row],[Lvl2]],rng_AnswersQ,0)),\"\")","v":true}]
[null,null,77,"Spørgsmål 26","Findes der en disaster recovery-plan for it-systemet, og er planen testet?","JJNVIIR",null,null,"4.3.5.A","6.1.2","6.1.2",{"$f":"IFERROR(OFFSET(Datagrundlag!$A$5,0,MATCH(\"Spørgsmål \"&Table1[[#This Row],[Lvl2]],rng_AnswersQ,0)),\"\")","v":true},null,"Visning VI","28D","28D",{"$f":"IFERROR(OFFSET(Datagrundlag!$A$5,0,MATCH(\"Spørgsmål \"&Table2[[#This Row],[Lvl2]],rng_AnswersQ,0)),\"\")","v":true}]
[null,null,78,"Spørgsmål 27","Hvad er de samlede årlige it-omkostninger til it-systemet?","Sum",null,null,"4.3.5.A","7.1","7.1",{"$f":"IFERROR(OFFSET(Datagrundlag!$A$5,0,MATCH(\"Spørgsmål \"&Table1[[#This Row],[Lvl2]],rng_AnswersQ,0)),\"\")","v":true},null,"Visning VII","27","27",{"$f":"IFERROR(OFFSET(Datagrundlag!$A$5,0,MATCH(\"Spørgsmål \"&Table2[[#This Row],[Lvl2]],rng_AnswersQ,0)),\"\")","v":true}]
[null,null,79,"Spørgsmål 28A","Sammensætning af omkostninger til it-systemet: Hvad er de årlige omkostninger til drift af it-systemet?\n","Tal",null,null,"4.3.5.A","8.1.1","8.1.1",{"$f":"IFERROR(OFFSET(Datagrundlag!$A$5,0,MATCH(\"Spørgsmål \"&Table1[[#This Row],[Lvl2]],rng_AnswersQ,0)),\"\")","v":true},null,"Visning VII","J","J",{"$f":"IFERROR(OFFSET(Datagrundlag!$A$5,0,MATCH(\"Spørgsmål \"&Table2[[#This Row],[Lvl2]],rng_AnswersQ,0)),\"\")","v":true}]
[null,null,80,"Spørgsmål 28B","Sammensætning af omkostninger til it-systemet: Hvad er de årlige omkostninger til vedligehold af it-systemet?","Tal",null,null,"4.3.5.A","8.1.2","8.1.2",{"$f":"IFERROR(OFFSET(Datagrundlag!$A$5,0,MATCH(\"Spørgsmål \"&Table1[[#This Row],[Lvl2]],rng_AnswersQ,0)),\"\")","v":true},null,"Visning VII","X10","27",{"$f":"IFERROR(OFFSET(Datagrundlag!$A$5,0,MATCH(\"Spørgsmål \"&Table2[[#This Row],[Lvl2]],rng_AnswersQ,0)),\"\")","v":true}]
[null,null,81,"Spørgsmål 28C","Sammensætning af omkostninger til it-systemet: Hvor meget udgør de interne personaleomkostninger af drift og vedligehold?","Tal",null,null,"4.3.5.A","6.2.1","6.2.1",{"$f":"IFERROR(OFFSET(Datagrundlag!$A$5,0,MATCH(\"Spørgsmål \"&Table1[[#This Row],[Lvl2]],rng_AnswersQ,0)),\"\")","v":true}]
[null,null,82,"Spørgsmål 28D","Sammensætning af omkostninger til it-systemet: Hvad er de årlige udviklingsomkostninger til it-systemet?","Tal",null,null,"4.3.5.A","6.2.2","6.2.2",{"$f":"IFERROR(OFFSET(Datagrundlag!$A$5,0,MATCH(\"Spørgsmål \"&Table1[[#This Row],[Lvl2]],rng_AnswersQ,0)),\"\")","v":true}]
[null,null,83,"Spørgsmål 29","Hvad er de forventede investeringer i it-systemet i it-handlingsplanens \nperiode?\n","Tal",null,null,"4.3.5.A","7.2","7.2",{"$f":"IFERROR(OFFSET(Datagrundlag!$A$5,0,MATCH(\"Spørgsmål \"&Table1[[#This Row],[Lvl2]],rng_AnswersQ,0)),\"\")","v":true}]
[null,null,null,null,null,null,null,null,"4.3.5.A","8.2.1","8.2.1",{"$f":"IFERROR(OFFSET(Datagrundlag!$A$5,0,MATCH(\"Spørgsmål \"&Table1[[#This Row],[Lvl2]],rng_AnswersQ,0)),\"\")","v":true}]
[null,null,null,null,null,null,null,null,"4.3.5.A","8.2.2","8.2.2",{"$f":"IFERROR(OFFSET(Datagrundlag!$A$5,0,MATCH(\"Spørgsmål \"&Table1[[#This Row],[Lvl2]],rng_AnswersQ,0)),\"\")","v":true}]
[null,null,null,null,null,null,null,null,"4.3.5.A","6.3.1","6.3.1",{"$f":"IFERROR(OFFSET(Datagrundlag!$A$5,0,MATCH(\"Spørgsmål \"&Table1[[#This Row],[Lvl2]],rng_AnswersQ,0)),\"\")","v":true}]
[null,null,null,null,null,null,null,null,"4.3.5.A","6.3.2","6.3.2",{"$f":"IFERROR(OFFSET(Datagrundlag!$A$5,0,MATCH(\"Spørgsmål \"&Table1[[#This Row],[Lvl2]],rng_AnswersQ,0)),\"\")","v":true}]
[null,null,null,null,null,null,null,null,"4.3.5.A","7.3","7.3",{"$f":"IFERROR(OFFSET(Datagrundlag!$A$5,0,MATCH(\"Spørgsmål \"&Table1[[#This Row],[Lvl2]],rng_AnswersQ,0)),\"\")","v":true}]
[null,null,null,null,null,null,null,null,"4.3.5.A","8.3.1","8.3.1",{"$f":"IFERROR(OFFSET(Datagrundlag!$A$5,0,MATCH(\"Spørgsmål \"&Table1[[#This Row],[Lvl2]],rng_AnswersQ,0)),\"\")","v":true}]
[null,null,null,null,null,null,null,null,"4.3.5.A","8.3.2","8.3.2",{"$f":"IFERROR(OFFSET(Datagrundlag!$A$5,0,MATCH(\"Spørgsmål \"&Table1[[#This Row],[Lvl2]],rng_AnswersQ,0)),\"\")","v":true}]
[null,null,null,null,null,null,null,null,"4.3.5.A","6.4.1","6.4.1",{"$f":"IFERROR(OFFSET(Datagrundlag!$A$5,0,MATCH(\"Spørgsmål \"&Table1[[#This Row],[Lvl2]],rng_AnswersQ,0)),\"\")","v":true}]
[null,null,null,null,null,null,null,null,"4.3.5.A","6.4.2","6.4.2",{"$f":"IFERROR(OFFSET(Datagrundlag!$A$5,0,MATCH(\"Spørgsmål \"&Table1[[#This Row],[Lvl2]],rng_AnswersQ,0)),\"\")","v":true}]
[null,null,null,null,null,null,null,null,"4.3.5.A","7.4","7.4",{"$f":"IFERROR(OFFSET(Datagrundlag!$A$5,0,MATCH(\"Spørgsmål \"&Table1[[#This Row],[Lvl2]],rng_AnswersQ,0)),\"\")","v":true}]
[null,null,null,null,null,null,null,null,"4.3.5.A","8.4.1","8.4.1",{"$f":"IFERROR(OFFSET(Datagrundlag!$A$5,0,MATCH(\"Spørgsmål \"&Table1[[#This Row],[Lvl2]],rng_AnswersQ,0)),\"\")","v":true}]
[null,null,null,null,null,null,null,null,"4.3.5.A","8.4.2","8.4.2",{"$f":"IFERROR(OFFSET(Datagrundlag!$A$5,0,MATCH(\"Spørgsmål \"&Table1[[#This Row],[Lvl2]],rng_AnswersQ,0)),\"\")","v":true}]
[null,null,null,null,null,null,null,null,"4.3.5.A","6.5.1","6.5.1",{"$f":"IFERROR(OFFSET(Datagrundlag!$A$5,0,MATCH(\"Spørgsmål \"&Table1[[#This Row],[Lvl2]],rng_AnswersQ,0)),\"\")","v":true}]
[null,null,null,null,null,null,null,null,"4.3.5.A","6.5.2","6.5.2",{"$f":"IFERROR(OFFSET(Datagrundlag!$A$5,0,MATCH(\"Spørgsmål \"&Table1[[#This Row],[Lvl2]],rng_AnswersQ,0)),\"\")","v":true}]
[null,null,null,null,null,null,null,null,"4.3.5.A","7.5","7.5",{"$f":"IFERROR(OFFSET(Datagrundlag!$A$5,0,MATCH(\"Spørgsmål \"&Table1[[#This Row],[Lvl2]],rng_AnswersQ,0)),\"\")","v":true}]
[null,null,null,null,null,null,null,null,"4.3.5.A","8.5.1","8.5.1",{"$f":"IFERROR(OFFSET(Datagrundlag!$A$5,0,MATCH(\"Spørgsmål \"&Table1[[#This Row],[Lvl2]],rng_AnswersQ,0)),\"\")","v":true}]
[null,null,null,null,null,null,null,null,"4.3.5.A","8.5.2","8.5.2",{"$f":"IFERROR(OFFSET(Datagrundlag!$A$5,0,MATCH(\"Spørgsmål \"&Table1[[#This Row],[Lvl2]],rng_AnswersQ,0)),\"\")","v":true}]
[null,null,null,null,null,null,null,null,"4.4.2.A","J","J",{"$f":"IFERROR(OFFSET(Datagrundlag!$A$5,0,MATCH(\"Spørgsmål \"&Table1[[#This Row],[Lvl2]],rng_AnswersQ,0)),\"\")","v":true}]
[null,null,null,null,null,null,null,null,"4.4.2.A","X17",12,{"$f":"IFERROR(OFFSET(Datagrundlag!$A$5,0,MATCH(\"Spørgsmål \"&Table1[[#This Row],[Lvl2]],rng_AnswersQ,0)),\"\")","v":true}]
[null,null,null,null,null,null,null,null,"4.4.2.A","X17",13,{"$f":"IFERROR(OFFSET(Datagrundlag!$A$5,0,MATCH(\"Spørgsmål \"&Table1[[#This Row],[Lvl2]],rng_AnswersQ,0)),\"\")","v":true}]
[null,null,null,null,null,null,null,null,"4.4.2.A","X18",20,{"$f":"IFERROR(OFFSET(Datagrundlag!$A$5,0,MATCH(\"Spørgsmål \"&Table1[[#This Row],[Lvl2]],rng_AnswersQ,0)),\"\")","v":true}]
[null,null,null,null,null,null,null,null,"4.4.2.A","X18",21,{"$f":"IFERROR(OFFSET(Datagrundlag!$A$5,0,MATCH(\"Spørgsmål \"&Table1[[#This Row],[Lvl2]],rng_AnswersQ,0)),\"\")","v":true}]
[null,null,null,null,null,null,null,null,"4.4.2.A","X19",17,{"$f":"IFERROR(OFFSET(Datagrundlag!$A$5,0,MATCH(\"Spørgsmål \"&Table1[[#This Row],[Lvl2]],rng_AnswersQ,0)),\"\")","v":true}]
[null,null,null,null,null,null,null,null,"4.4.2.A","X19",22,{"$f":"IFERROR(OFFSET(Datagrundlag!$A$5,0,MATCH(\"Spørgsmål \"&Table1[[#This Row],[Lvl2]],rng_AnswersQ,0)),\"\")","v":true}]
[null,null,null,null,null,null,null,null,"4.4.2.A","X20",23,{"$f":"IFERROR(OFFSET(Datagrundlag!$A$5,0,MATCH(\"Spørgsmål \"&Table1[[#This Row],[Lvl2]],rng_AnswersQ,0)),\"\")","v":true}]
[null,null,null,null,null,null,null,null,"4.4.2.A","X20",24,{"$f":"IFERROR(OFFSET(Datagrundlag!$A$5,0,MATCH(\"Spørgsmål \"&Table1[[#This Row],[Lvl2]],rng_AnswersQ,0)),\"\")","v":true}]
[null,null,null,null,null,null,null,null,"4.4.2.A","X20",25,{"$f":"IFERROR(OFFSET(Datagrundlag!$A$5,0,MATCH(\"Spørgsmål \"&Table1[[#This Row],[Lvl2]],rng_AnswersQ,0)),\"\")","v":true}]
[null,null,null,null,null,null,null,null,"4.4.2.A","X20",26,{"$f":"IFERROR(OFFSET(Datagrundlag!$A$5,0,MATCH(\"Spørgsmål \"&Table1[[#This Row],[Lvl2]],rng_AnswersQ,0)),\"\")","v":true}]
[null,null,null,null,null,null,null,null,"4.4.3.A","X10",27,{"$f":"IFERROR(OFFSET(Datagrundlag!$A$5,0,MATCH(\"Spørgsmål \"&Table1[[#This Row],[Lvl2]],rng_AnswersQ,0)),\"\")","v":true}]
[null,null,null,null,null,null,null,null,"4.4.3.A","X10","J",{"$f":"IFERROR(OFFSET(Datagrundlag!$A$5,0,MATCH(\"Spørgsmål \"&Table1[[#This Row],[Lvl2]],rng_AnswersQ,0)),\"\")","v":true}]
[null,null,null,null,null,null,null,null,"4.4.3.A",27,27,{"$f":"IFERROR(OFFSET(Datagrundlag!$A$5,0,MATCH(\"Spørgsmål \"&Table1[[#This Row],[Lvl2]],rng_AnswersQ,0)),\"\")","v":true}]
[null,null,null,null,null,null,null,null,"4.4.3.A",1,1,{"$f":"IFERROR(OFFSET(Datagrundlag!$A$5,0,MATCH(\"Spørgsmål \"&Table1[[#This Row],[Lvl2]],rng_AnswersQ,0)),\"\")","v":true}]
[null,null,null,null,null,null,null,null,"4.4.3.A",11,11,{"$f":"IFERROR(OFFSET(Datagrundlag!$A$5,0,MATCH(\"Spørgsmål \"&Table1[[#This Row],[Lvl2]],rng_AnswersQ,0)),\"\")","v":true}]

{"sheet":"Blankt spørgeskema","index":11,"n_rows":428,"n_cols":85,"rows_kept":428,"cut":false,"hidden":true,"merged":[[368,20,371,20],[322,3,322,9],[418,2,418,17],[353,3,353,9],[353,20,356,20],[355,3,355,9],[358,3,358,9],[358,20,361,20],[360,3,360,9],[339,3,339,9],[339,20,342,20],[341,3,341,9],[344,3,344,9],[344,20,346,20],[346,3,346,9],[373,3,373,9],[373,20,376,20],[375,3,375,9],[378,3,378,9],[378,20,380,20],[380,3,380,9],[363,3,363,9],[363,20,366,20],[365,3,365,9],[368,3,368,9],[370,3,370,9],[305,3,305,9],[305,20,308,20],[307,3,307,9],[310,3,310,9],[310,20,313,20],[312,3,312,9],[295,3,295,9],[295,20,298,20],[297,3,297,9],[300,3,300,9],[300,20,303,20],[302,3,302,9],[329,3,329,9],[329,20,332,20],[331,3,331,9],[334,3,334,9],[334,20,337,20],[336,3,336,9],[315,3,315,9],[315,20,318,20],[317,3,317,9],[320,3,320,9],[320,20,322,20],[279,3,279,9],[279,20,282,20],[281,3,281,9],[284,3,284,9],[284,20,287,20],[286,3,286,9],[269,3,269,9],[269,20,272,20],[271,3,271,9],[274,3,274,9],[274,20,277,20],[276,3,276,9],[259,3,259,9],[259,20,262,20],[261,3,261,9],[264,3,264,9],[264,20,267,20],[266,3,266,9],[244,3,244,9],[244,20,247,20],[246,3,246,9],[249,3,249,9],[249,20,251,20],[251,3,251,9],[231,3,231,9],[231,20,233,20],[233,3,233,9],[234,3,234,11],[237,3,237,9],[237,20,242,20],[238,3,238,9],[239,3,239,9],[240,3,240,9],[242,3,242,11],[219,3,219,9],[221,3,221,9],[222,3,222,9],[224,3,224,9],[224,20,229,20],[225,3,225,9],[226,3,226,9],[227,3,227,9],[229,3,229,11],[219,20,222,20],[207,3,207,9],[207,20,210,20],[209,3,209,9],[212,3,212,9],[212,20,214,20],[214,3,214,9],[194,3,194,9],[194,20,196,20],[196,3,196,9],[197,3,197,11],[200,3,200,9],[200,20,205,20],[201,3,201,9],[202,3,202,9],[203,3,203,9],[205,3,205,11],[182,3,182,9],[184,3,184,9],[185,3,185,9],[187,3,187,9],[187,20,192,20],[188,3,188,9],[189,3,189,9],[190,3,190,9],[192,3,192,11],[182,20,185,20],[170,3,170,9],[170,20,173,20],[172,3,172,9],[175,3,175,9],[175,20,177,20],[177,3,177,9],[157,3,157,9],[157,20,159,20],[159,3,159,9],[160,3,160,11],[163,3,163,9],[163,20,168,20],[164,3,164,9],[165,3,165,9],[166,3,166,9],[168,3,168,11],[145,3,145,9],[147,3,147,9],[148,3,148,9],[150,3,150,9],[150,20,155,20],[151,3,151,9],[152,3,152,9],[153,3,153,9],[155,3,155,11],[145,20,148,20],[133,3,133,9],[133,20,136,20],[135,3,135,9],[138,3,138,9],[138,20,140,20],[140,3,140,9],[120,3,120,9],[120,20,122,20],[122,3,122,9],[123,3,123,11],[126,3,126,9],[126,20,131,20],[127,3,127,9],[128,3,128,9],[129,3,129,9],[131,3,131,11],[108,3,108,9],[108,20,111,20],[110,3,110,9],[111,3,111,9],[113,3,113,9],[113,20,118,20],[114,3,114,9],[115,3,115,9],[116,3,116,9],[118,3,118,11],[96,3,96,9],[96,20,99,20],[98,3,98,9],[101,3,101,9],[101,20,103,20],[103,3,103,9],[83,3,83,9],[83,20,85,20],[85,3,85,9],[86,3,86,11],[89,3,89,9],[89,20,94,20],[90,3,90,9],[91,3,91,9],[92,3,92,9],[94,3,94,11],[76,3,76,9],[76,20,81,20],[77,3,77,9],[78,3,78,9],[79,3,79,9],[81,3,81,11],[64,3,64,9],[67,3,67,11],[71,3,71,9],[71,20,74,20],[73,3,73,9],[74,3,74,9],[51,20,54,20],[53,3,53,9],[56,20,59,20],[58,3,58,9],[61,3,61,9],[61,20,63,20],[63,3,63,9],[21,3,21,9],[23,3,23,9],[25,3,25,9],[46,3,46,9],[46,20,49,20],[47,3,47,9],[48,3,48,9],[49,3,49,9],[2,1,2,12],[2,20,4,20],[3,1,3,13],[9,20,10,20],[11,3,11,9],[13,3,13,9],[15,3,15,9],[17,3,17,9],[19,3,19,9]]}
[null,{"$f":"L18","v":"[Tekstfelt]"},null,null,null,null,null,null,null,null,null,null,null,null," "]
[null,null,null,null,null,null,null,null,null,null,null,null,null,null,null,null,null,null,null,null,null,null,null,"ITK-1.0.2018.06.28.001"]
[null,"Vejledning: Dette spørgeskema indeholder den samlede liste af spørgsmål, som myndigheden skal besvare for hvert it-system i kortlægningen af it-systemporteføljen. Spørgsmål A til K2 er besvaret i kortlægningsværktøjet, mens de resterende spørgsmål skal besvares i dette spørgeskema. Når alle spørgsmål er besvaret, gemmes og importeres spørgeskemaet i ark ’3 Importerede it-systemdata’ i værktøjet til kortlægning af it-systemporteføljen.\n\nDer gøres opmærksom på, at makroer skal være aktiveret, inden der indtastes besvarelser i spørgeskemaet. For at spørgeskemaet skal kunne vises optimalt, anbefales et zoomniveau på 90 procent.",null,null,null,null,null,null,null,null,null,null,null,null,null,null,null,null,null,null,{"$f":"\"Har du spørgsmål til brugen af kortlægningsværktøjet, kan du kontakte Ministeriernes kontor for it-styring i Digitaliseringsstyrelsen. Inden du går i gang,\"&\" kan du i 'Vejledning til model for porteføljestyring af statslige it-systemer' finde hjælp til brugen af kortlægningsværktøjet.\"&CHAR(10)&CHAR(10)&\"Du finder vejledningen på Digitaliseringsstyrelsens hjemmeside www.digst.dk.\"&CHAR(10)&CHAR(10)&\"Du kan også kontakte myndighedens kontaktperson: \"&$S$398&\" (e-mail: \"&$S$399&\", tlf.: \"&$S$400&\")\"","v":"Har du spørgsmål til brugen af kortlægningsværktøjet, kan du kontakte Ministeriernes kontor for it-styring i Digitaliseringsstyrelsen. Inden du går i gang, kan du i 'Vejledning til model for porteføljestyring af statslige it-systemer' finde hjælp til brugen af kortlægningsværktøjet.\n\nDu finder vejledningen på Digitaliseringsstyrelsens hjemmeside www.digst.dk.\n\nDu kan også kontakte myndighedens kontaktperson:  (e-mail: , tlf.: )"}]
[null,null,null,null,null,null,null,null,null,null,null,null,null,null,null,null,null,null,null,null,null,null,null,"Kodeord:"]
[null,null,null,{"$f":"D384","v":"Der er 36 ubesvarede spørgsmål i dette spørgeskema. Venligst genbesøg de ubesvarede spørgsmål, inden du fortsætter."},null,null,null,null,null,null,null,null,null,null,null,null,null,null,null,null,null,null,null,"2lp1b"]
[]
[null,null,null,"Grundlæggende oplysninger om myndigheden og it-systemet",null,null,null,null,null,null,null,null,null,null,null,"Numerering","Sourcing numerering","Ibrugtages?","Blankoværdier","Validering","Kommentarer",null,"Status"]
[]
[]
[null,null,null,"Spørgsmål besvaret i værktøjet til kortlægning af it-systemporteføljen",null,null,null,null,null,null,null,null,null,null,null,null,null,null,null,null,"Kommentarer vil fremgå i kortlægningsværktøj og datagrundlag via Excels standard kommenterings-funktion."]
[]
[null,null,"A.","Ministerområde",null,null,null,null,null,null,null,"[Tekstfelt]",null,null,null,{"$f":"IF(C12<>\"\",MAX($P$10:P11)+1,\"\")","v":1},null,null,"[Tekstfelt]",null,null,null,{"$f":"IF(OR(P12=\"\",R12=\"Nej\"),\"\",IF(OR(M12=\"Fejl\",L12=S12,L12=\"\"),\"Ubesvaret\",\"Besvaret\"))","v":"Ubesvaret"}]
[null,null,null,null,null,null,null,null,null,null,null,null,null,null,null,{"$f":"IF(C13<>\"\",MAX($P$10:P12)+1,\"\")","v":""},null,null,null,null,null,null,""]
[null,null,"B.","Hvad er myndighedens navn?",null,null,null,null,null,null,null,"[Tekstfelt]",null,null,null,{"$f":"IF(C14<>\"\",MAX($P$10:P13)+1,\"\")","v":2},null,null,"[Tekstfelt]",null,null,null,"Ubesvaret"]
[null,null,null,null,null,null,null,null,null,null,null,null,null,null,null,{"$f":"IF(C15<>\"\",MAX($P$10:P14)+1,\"\")","v":""},null,null,null,null,null,null,""]
["\n",null,"C.","Hvad er de samlede årlige it-omkostninger i myndigheden eksklusive overhead og fællesomkostninger?",null,null,null,null,null,null,null,"[Tekstfelt]",null,null,null,{"$f":"IF(C16<>\"\",MAX($P$10:P15)+1,\"\")","v":3},null,null,"[Tekstfelt]",null,null,null,"Ubesvaret"]
[null,null,null,null,null,null,null,null,null,null,null,null,null,null,null,{"$f":"IF(C17<>\"\",MAX($P$10:P16)+1,\"\")","v":""},null,null,null,null,null,null,""]
[null,null,"E.","It-systemnavn",null,null,null,null,null,null,null,"[Tekstfelt]",null,null,null,{"$f":"IF(C18<>\"\",MAX($P$10:P17)+1,\"\")","v":4},null,null,"[Tekstfelt]",null,null,null,"Ubesvaret"]
[null,null,null,null,null,null,null,null,null,null,null,null,null,null,null,{"$f":"IF(C19<>\"\",MAX($P$10:P18)+1,\"\")","v":""},null,null,null,null,null,null,""]
[null,null,"F.","It-systemejer",null,null,null,null,null,null,null,"[Tekstfelt]",null,null,null,{"$f":"IF(C20<>\"\",MAX($P$10:P19)+1,\"\")","v":5},null,null,"[Tekstfelt]",null,null,null,"Ubesvaret"]
[null,null,null,null,null,null,null,null,null,null,null,null,null,null,null,{"$f":"IF(C21<>\"\",MAX($P$10:P20)+1,\"\")","v":""},null,null,null,null,null,null,""]
[null,null,"G.","It-systemejernes organisatoriske placering",null,null,null,null,null,null,null,"[Tekstfelt]",null,null,null,{"$f":"IF(C22<>\"\",MAX($P$10:P21)+1,\"\")","v":6},null,null,"[Tekstfelt]",null,null,null,"Ubesvaret"]
[null,null,null,null,null,null,null,null,null,null,null,null,null,null,null,{"$f":"IF(C23<>\"\",MAX($P$10:P22)+1,\"\")","v":""},null,null,null,null,null,null,""]
[null,null,"H.","It-systemets nøglefunktion",null,null,null,null,null,null,null,"[Tekstfelt]",null,null,null,{"$f":"IF(C24<>\"\",MAX($P$10:P23)+1,\"\")","v":7},null,null,"[Tekstfelt]",null,null,null,"Ubesvaret"]
[null,null,null,null,null,null,null,null,null,null,null,null,null,null,null,{"$f":"IF(C25<>\"\",MAX($P$10:P24)+1,\"\")","v":""},null,null,null,null,null,null,""]
[null,null,"I.","Primært understøttet forretningsområde",null,null,null,null,null,null,null,"[Tekstfelt]",null,null,null,{"$f":"IF(C26<>\"\",MAX($P$10:P25)+1,\"\")","v":8},null,null,"[Tekstfelt]",null,null,null,"Ubesvaret"]
[null,null,null,null,null,null,null,null,null,null,null,null,null,null,null,{"$f":"IF(C27<>\"\",MAX($P$10:P26)+1,\"\")","v":""},null,null,null,null,null,null,""]
[null,null,"J.","It-systemets kritikalitet",null,null,null,null,null,null,null,"[Tekstfelt]",null,null,null,{"$f":"IF(C28<>\"\",MAX($P$10:P27)+1,\"\")","v":9},null,null,"[Tekstfelt]",null,null,null,"Ubesvaret"]
[null,null,null,null,null,null,null,null,null,null,null,null,null,null,null,{"$f":"IF(C29<>\"\",MAX($P$10:P28)+1,\"\")","v":""},null,null,null,null,null,null,""]
[null,null,"K1.","It-systemets sourcingmodel for drift",null,null,null,null,null,null,null,"[Tekstfelt]",null,null,null,{"$f":"IF(C30<>\"\",MAX($P$10:P29)+1,\"\")","v":10},null,null,"[Tekstfelt]",null,null,null,"Ubesvaret"]
[null,null,null,null,null,null,null,null,null,null,null,null,null,null,null,{"$f":"IF(C31<>\"\",MAX($P$10:P30)+1,\"\")","v":""},null,null,null,null,null,null,""]
[null,null,"K2.","It-systemets sourcingmodel for vedligehold og udvikling",null,null,null,null,null,null,null,"[Tekstfelt]",null,null,null,{"$f":"IF(C32<>\"\",MAX($P$10:P31)+1,\"\")","v":11},null,null,"[Tekstfelt]",null,null,null,"Ubesvaret"]
[null,null,null,"Spørgsmål til besvarelse i dette spørgeskema",null,null,null,null,null,null,null,null,null,null,null,{"$f":"IF(C33<>\"\",MAX($P$10:P32)+1,\"\")","v":""},1,{"$f":"IF($P$398=\"Outsourcet\",\"Ja\",\"Nej\")","v":"Nej"},null,null,null,null,""]
[null,null,"L.","Samlet antal leverandørkontrakter for drift, vedligehold og udvikling",null,null,null,null,null,null,null,"- vælg i dropdown -",null,null,null,{"$f":"IF(C34<>\"\",MAX($P$10:P33)+1,\"\")","v":12},1,{"$f":"IF($P$398=\"Outsourcet\",\"Ja\",\"Nej\")","v":"Nej"},"- vælg i dropdown -",null,null,null,""]
[null,null,null,null,null,null,null,null,null,null,null,null,null,null,null,{"$f":"IF(C35<>\"\",MAX($P$10:P34)+1,\"\")","v":""},1,{"$f":"IF(AND($P$398=\"Outsourcet\",Q35<=$L$34,\"- vælg i dropdown -\"<>$L$34),\"Ja\",\"Nej\")","v":"Nej"},null,null,null,null,""]
[null,null,"M.","Angiv navnene på leverandørkontrakterne og leverandør",null,null,null,null,null,null,null,"[Tekstfelt]",null,null,null,{"$f":"IF(C36<>\"\",MAX($P$10:P35)+1,\"\")","v":13},1,"Nej","[Tekstfelt]",null,null,null,""]
[null,null,"x",null,null,null,null,null,null,null,null,"[Tekstfelt]",null,null,null,{"$f":"IF(C37<>\"\",MAX($P$10:P36)+1,\"\")","v":14},2,"Nej","[Tekstfelt]",null,null,null,""]
[null,null,"x",null,null,null,null,null,null,null,null,"[Tekstfelt]",null,null,null,{"$f":"IF(C38<>\"\",MAX($P$10:P37)+1,\"\")","v":15},3,"Nej","[Tekstfelt]",null,null,null,""]
[null,null,"x",null,null,null,null,null,null,null,null,"[Tekstfelt]",null,null,null,{"$f":"IF(C39<>\"\",MAX($P$10:P38)+1,\"\")","v":16},4,"Nej","[Tekstfelt]",null,null,null,""]
[null,null,"x",null,null,null,null,null,null,null,null,"[Tekstfelt]",null,null,null,{"$f":"IF(C40<>\"\",MAX($P$10:P39)+1,\"\")","v":17},5,"Nej","[Tekstfelt]",null,null,null,""]
[null,null,null,null,null,null,null,null,null,null,null,null,null,null,null,{"$f":"IF(C41<>\"\",MAX($P$10:P40)+1,\"\")","v":""},null,null,null,null,null,null,""]
[null,null,null,null,null,null,null,null,null,null,null,null,null,null,null,{"$f":"IF(C42<>\"\",MAX($P$10:P41)+1,\"\")","v":""},null,null,null,null,null,null,""]
[null,null,null,"It-systemets forretningsunderstøttelse",null,null,null,null,null,null,null,null,null,null,null,{"$f":"IF(C43<>\"\",MAX($P$10:P42)+1,\"\")","v":""},null,null,null,null,"Kommentarer",null,""]
[null,null,null,null,null,null,null,null,null,null,null,null,null,null,null,null,null,null,null,null,null,null,""]
[null,null,null,null,null,null,null,null,null,null,null,null,null,null,null,null,null,null,null,null,null,null,""]
[null,null,null,null,null,null,null,null,null,null,null,null,null,null,null,null,null,null,null,null,null,null,""]
[null,null,"Spm.1","Hvor tilfredsstillende er it-systemets understøttelse af forretningsprocesser i dag?",null,null,null,null,null,null,null," - vælg i dropdown -",{"$f":"IF(AND(ISERROR(MATCH(L47,INDIRECT(T47),0))=TRUE,L47<>\"\"),\"FEJL\",\"\")","v":""},null,null,{"$f":"IF(C47<>\"\",MAX($P$10:P46)+1,\"\")","v":18},null,null," - vælg i dropdown -","TLFRDS",null,null,"Ubesvaret"]
[null,null,null,"Forklaring: Tilfredsheden med it-systemets understøttelse af forretningsprocesser vurderes på baggrund af følgende tre faktorer:\n• Andelen af relevante forretningsprocesser, som it-systemet procesunderstøtter uden manuelle arbejdsgange.\n• Tilbudt beslutningsstøtte i systemet.\n• Opfattet brugervenlighed for slutbrugere.\n",null,null,null,null,null,null,null,"Man kan kun vælge én svarmulighed.",null,null,null,{"$f":"IF(C48<>\"\",MAX($P$10:P47)+1,\"\")","v":""},null,null,null,null,null,null,""]
[null,null,null,"1. Meget utilfredsstillende svares, når it-systemet kun mangelfuldt understøtter forretningens behov indenfor to eller tre faktorer.\n2. Utilfredsstillende svares, når it-systemet kun mangelfuldt understøtter forretningens behov indenfor en faktor.\n3. Tilfredsstillende svares, når forretningens behov grundlæggende er opfyldt for alle tre faktorer.\n4. Meget tilfredsstillende svares, når forretningens behov er opfyldt for alle tre faktorer, hvoraf minimum en af faktorerne er opfyldt på meget fyldestgørende vis.\n5. Særdeles tilfredsstillende svares, når forretningens behov for alle tre faktorer er opfyldt på særligt fyldestgørende vis.\n\n",null,null,null,null,null,null,null,null,null,null,null,{"$f":"IF(C49<>\"\",MAX($P$10:P48)+1,\"\")","v":""},null,null,null,null,null,null,""]
[null,null,null,"I besvarelsen af spørgsmålet kan der med fordel konsulteres en ledende forretningsbruger eller procesejer og inddrages eventuelle brugertilfredshedsmålinger. Det bemærkes desuden, at myndighedens besvarelse bør afhænge af forretningens behov i forhold til de tre faktorer.",null,null,null,null,null,null,null,null,null,null,null,{"$f":"IF(C50<>\"\",MAX($P$10:P49)+1,\"\")","v":""},null,null,null,null,null,null,""]
[null,null,null,null,null,null,null,null,null,null,null,null,null,null,null,{"$f":"IF(C51<>\"\",MAX($P$10:P50)+1,\"\")","v":""},null,null,null,null,null,null,""]
[null,null,"Spm.2","I hvilken grad er der omskiftelighed i forretningsgrundlaget for it-systemet?",null,null,null,null,null,null,null," - vælg i dropdown -",{"$f":"IF(AND(ISERROR(MATCH(L52,INDIRECT(T52),0))=TRUE,L52<>\"\"),\"FEJL\",\"\")","v":""},null,null,{"$f":"IF(C52<>\"\",MAX($P$10:P51)+1,\"\")","v":19},null,null," - vælg i dropdown -","IVG",null,null,"Ubesvaret"]
[null,null,null,null,null,null,null,null,null,null,null,"Man kan kun vælge én svarmulighed.",null,null,null,{"$f":"IF(C53<>\"\",MAX($P$10:P52)+1,\"\")","v":""},null,null,null,null,null,null,""]
[null,null,null,"Forklaring: I besvarelsen bør der tages hensyn til antallet, omfang og hyppighed af ændringer i forretningsgrundlaget. \n1. I meget lav grad er, når forretningsgrundlaget kun meget sjældent ændrer sig, og hvor ændringerne består i få og små ændringer.\n2. I mindre grad er, når forretningsgrundlaget sjældent ændrer sig, og hvor ændringerne består i få og små ændringer. \n3. I nogen grad er, når der regelmæssigt sker ændringer, men hvor ændringerne består i få eller små ændringer.\n4. I høj grad er, når der hyppigt sker ændringer, og hvor ændringerne består i få eller små ændringer. \n5. I meget høj grad er, når der hyppigt sker ændringer, og hvor ændringerne er flere og større. \n",null,null,null,null,null,null,null,null,null,null,null,{"$f":"IF(C54<>\"\",MAX($P$10:P53)+1,\"\")","v":""},null,null,null,null,null,null,""]
[null,null,null,null,null,null,null,null,null,null,null,null,null,null,null,{"$f":"IF(C55<>\"\",MAX($P$10:P54)+1,\"\")","v":""},null,null,null,null,null,null,""]
[null,null,null,null,null,null,null,null,null,null,null,null,null,null,null,{"$f":"IF(C56<>\"\",MAX($P$10:P55)+1,\"\")","v":""},null,null,null,null,null,null,""]
[null,null,"Spm.3","Hvor mange slutbrugere har it-systemet?",null,null,null,null,null,null,null,"[Indsæt antal]",{"$f":"IF(OR(ISNUMBER(L57),L57=S57,L57=\"\"),\"\",\"FEJL\")","v":""},null,null,{"$f":"IF(C57<>\"\",MAX($P$10:P56)+1,\"\")","v":20},null,null,"[Indsæt antal]","n/a",null,null,"Ubesvaret"]
[null,null,null,null,null,null,null,null,null,null,null,"Man kan kun indsætte heltal.",null,null,null,{"$f":"IF(C58<>\"\",MAX($P$10:P57)+1,\"\")","v":""},null,null,null,null,null,null,""]
[null,null,null,"Forklaring: En slutbruger er en person, der har adgangsrettigheder til at logge på og anvende et it-system. Det kan for eksempel være medarbejdere i myndigheden, ministeriet, andre statslige myndigheder, kommuner, virksomheder, interesseorganisationer og borgere.",null,null,null,null,null,null,null,null,null,null,null,{"$f":"IF(C59<>\"\",MAX($P$10:P58)+1,\"\")","v":""},null,null,null,null,null,null,""]
[null,null,null,null,null,null,null,null,null,null,null,null,null,null,null,{"$f":"IF(C60<>\"\",MAX($P$10:P59)+1,\"\")","v":""},null,null,null,null,null,null,""]
[null,null,null,null,null,null,null,null,null,null,null,null,null,null,null,{"$f":"IF(C61<>\"\",MAX($P$10:P60)+1,\"\")","v":""},null,null,null,null,null,null,""]
[null,null,"Spm.4","Hvor tilfredsstillende er it-systemets realiserede tilgængelighed?",null,null,null,null,null,null,null," - vælg i dropdown -",{"$f":"IF(AND(ISERROR(MATCH(L62,INDIRECT(T62),0))=TRUE,L62<>\"\"),\"FEJL\",\"\")","v":""},null,null,{"$f":"IF(C62<>\"\",MAX($P$10:P61)+1,\"\")","v":21},null,null," - vælg i dropdown -","TLFRDS",null,null,"Ubesvaret"]
[null,null,null,null,null,null,null,null,null,null,null,"Man kan kun vælge én svarmulighed.",null,null,null,{"$f":"IF(C63<>\"\",MAX($P$10:P62)+1,\"\")","v":""},null,null,null,null,null,null,""]
[null,null,null,"Forklaring: Tilfredsheden med it-systemets realiserede tilgængelighed skal vurderes på baggrund af forretningens tilgængelighedsbehov. It-systemet er utilgængeligt, når det ikke kan anvendes eller har lange svartider, der medfører, at forretningsprocesser ikke kan gennemføres som planlagt, eller resulterer i procesforsinkelse.\n\nDet bemærkes, at aftalte servicevinduer med videre også kan vurderes som manglende tilgængelighed, hvis disse er placeret i et tidsrum, hvor dette medfører ovennævnte konsekvenser.",null,null,null,null,null,null,null,null,null,null,null,{"$f":"IF(C64<>\"\",MAX($P$10:P63)+1,\"\")","v":""},null,null,null,null,null,null,""]
[null,null,null,"1. Meget utilfredsstillende svares, når der i forhold til forretningens behov hyppigt opleves utilgængelighed.\n2. Utilfredsstillende svares, når der i forhold til forretningens behov lejlighedsvis opleves utilgængelighed.\n3. Tilfredsstillende svares, når it-systemet overordnet set opfylder forretningens behov i forhold til tilgængelighed.\n4. Meget tilfredsstillende svares, når der meget sjældent opleves manglende tilgængelighed i forhold til forretningens behov.\n5. Særdeles tilfredsstillende svares, når der ikke er oplevet manglende tilgængelighed. \n\nI besvarelsen af spørgsmålet kan en ledende forretningsbruger med fordel konsulteres.",null,null,null,null,null,null,null,null,null,null,null,{"$f":"IF(C65<>\"\",MAX($P$10:P64)+1,\"\")","v":""},null,null,null,null,null,null,""]
[null,null,null,null,null,null,null,null,null,null,null,null,null,null,null,{"$f":"IF(C66<>\"\",MAX($P$10:P65)+1,\"\")","v":""},null,null,null,null,null,null,""]
[null,null,null,"It-systemets kontrakter og sourcing",null,null,null,null,null,null,null,null,null,null,null,{"$f":"IF(C67<>\"\",MAX($P$10:P66)+1,\"\")","v":""},null,null,null,null,"Kommentarer",null,""]
[null,null,null,"Denne kortlægningsdimension er kun relevant for it-systemer, hvor spørgsmål K1 eller K2 er besvaret med ’Delvist outsourcet’ eller ’Overvejende outsourcet’.",null,null,null,null,null,null,null,null,null,null,null,{"$f":"IF(C68<>\"\",MAX($P$10:P67)+1,\"\")","v":""},0,{"$f":"IF(P398=\"Insourcet\",\"Ja\",\"Nej\")","v":"Ja"},null,null,null,null,""]
[null,null,null,null,null,null,null,null,null,null,null,null,null,null,null,{"$f":"IF(C69<>\"\",MAX($P$10:P68)+1,\"\")","v":""},1,{"$f":"IF(AND($P$398=\"Outsourcet\",Q69<=$L$34,\"- vælg i dropdown -\"<>$L$34),\"Ja\",\"Nej\")","v":"Nej"},null,null,null,null,""]
[null,null,null,{"$f":"CONCATENATE(\"Leverandør 1 - \"&L36)","v":"Leverandør 1 - [Tekstfelt]"},null,null,null,null,null,null,null,null,null,null,null,{"$f":"IF(C70<>\"\",MAX($P$10:P69)+1,\"\")","v":""},1,"Nej",null,null,null,null,""]
[null,null,null,null,null,null,null,null,null,null,null,null,null,null,null,{"$f":"IF(C71<>\"\",MAX($P$10:P70)+1,\"\")","v":""},1,"Nej",null,null,null,null,""]
[null,null,"Spm.5.1","Hvor tilfredsstillende er myndighedens kontraktstyring af it-systemets kontraktdokumenter i dag?\n",null,null,null,null,null,null,null," - vælg i dropdown -",{"$f":"IF(AND(ISERROR(MATCH(L72,INDIRECT(T72),0))=TRUE,L72<>\"\"),\"FEJL\",\"\")","v":""},null,null,{"$f":"IF(C72<>\"\",MAX($P$10:P71)+1,\"\")","v":22},1,"Nej"," - vælg i dropdown -","TLFRDS",null,null,""]
[null,null,null,null,null,null,null,null,null,null,null,"Man kan kun vælge én svarmulighed.",null,null,null,{"$f":"IF(C73<>\"\",MAX($P$10:P72)+1,\"\")","v":""},1,"Nej",null,null,null,null,""]
[null,null,null,"Forklaring: Vurderingen af myndighedens kontraktstyring baseres på opfyldelse af følgende punkter for kontrakten:\nA. Hovedkontrakt, stamdata tillæg med videre er placeret i et tilgængeligt og opdateret bibliotek.\nB. Der vedligeholdes en kontraktkalender, som understøtter den kontraktansvarlige medarbejders styring af kontraktuelle forpligtelser og rettigheder.\nC. Der gennemføres struktureret modtagelse af leverancer, som sammenholdes med fakturaer inden betaling.\nD. Der er etableret mekanismer, som sikrer, at udbud påbegyndes rettidigt i forhold til at gennemføre transition til en eventuel ny leverandør inden kontraktudløb.\n\n",null,null,null,null,null,null,null,null,null,null,null,{"$f":"IF(C74<>\"\",MAX($P$10:P73)+1,\"\")","v":""},1,"Nej",null,null,null,null,""]
[null,null,null,"\n1. Meget utilfredsstillende svares, når ingen af ovenstående punkter opfyldes for kontrakten.\n2. Utilfredsstillende svares, når op til tre af ovenstående punkter opfyldes for kontrakten.\n3. Tilfredsstillende svares, når alle fire punkter opfyldes med en procesmodenhed, der svarer til en udokumenteret ad hoc-proces.\n4. Meget tilfredsstillende svares, når alle fire punkter opfyldes med en procesmodenhed, der svarer til en dokumenteret proces, som gentages ensartet og periodisk, eksempelvis gennem anvendelse af de kontrakt- og leverandørstyringsværktøjer, der er stillet til rådighed.\n5. Særdeles tilfredsstillende svares, når alle fire punkter opfyldes med en høj modenhed og gennem anvendelse af specialiserede kontraktstyringsværktøjer.",null,null,null,null,null,null,null,null,null,null,null,{"$f":"IF(C75<>\"\",MAX($P$10:P74)+1,\"\")","v":""},1,"Nej",null,null,null,null,""]
[null,null,null,null,null,null,null,null,null,null,null,null,null,null,null,{"$f":"IF(C76<>\"\",MAX($P$10:P75)+1,\"\")","v":""},1,"Nej",null,null,null,null,{"$f":"IF(OR(P76=\"\",R76=\"Nej\"),\"\",IF(OR(M76=\"Fejl\",L76=S76,L76=\"\"),\"Ubesvaret\",\"Besvaret\"))","v":""}]
[null,null,"Spm.6.1","Hvad er udløbsdatoen for kontrakten eksklusive forlængelsesperioden?",null,null,null,null,null,null,null," - vælg i dropdown -",{"$f":"IF(AND(ISERROR(MATCH(L77,INDIRECT(T77),0))=TRUE,L77<>\"\"),\"FEJL\",\"\")","v":""},null,null,{"$f":"IF(C77<>\"\",MAX($P$10:P76)+1,\"\")","v":23},1,"Nej"," - vælg i dropdown -","DIU",null,null,""]
[null,null,null,"\nForklaring: Udløbsdatoen, eksklusive forlængelse for it-systemets primære kontrakt.",null,null,null,null,null,null,null,"Man kan kun vælge én svarmulighed.",null,null,null,{"$f":"IF(C78<>\"\",MAX($P$10:P77)+1,\"\")","v":""},1,"Nej",null,null,null,null,""]
[null,null,null,null,null,null,null,null,null,null,null,null,null,null,null,{"$f":"IF(C79<>\"\",MAX($P$10:P78)+1,\"\")","v":""},1,{"$f":"IF(AND($P$398=\"Outsourcet\",Q79<=$L$34,\"- vælg i dropdown -\"<>$L$34,L77=\"1. Dato (indsæt dato i næste felt)\"),\"Ja\",\"Nej\")","v":"Nej"},null,null,null,null,""]
[null,null,"x",null,null,null,null,null,null,null,null,"[Indsæt dato]",{"$f":"(IF(OR(L80=S80,AND(ISNUMBER(L80)=TRUE,L80>29220,L80<55154)),\"\", \"FEJL\"))","v":""},null,null,{"$f":"IF(C80<>\"\",MAX($P$10:P79)+1,\"\")","v":24},1,{"$f":"IF(AND($P$398=\"Outsourcet\",Q80<=$L$34,\"- vælg i dropdown -\"<>$L$34,L77=\"1. Dato (indsæt dato i næste felt)\"),\"Ja\",\"Nej\")","v":"Nej"},"[Indsæt dato]",null,null,null,""]
[null,null,null,null,null,null,null,null,null,null,null,"Indsæt dato i format DD-MM-ÅÅÅÅ (fx 01-01-2020).",null,null,null,{"$f":"IF(C81<>\"\",MAX($P$10:P80)+1,\"\")","v":""},1,{"$f":"IF(AND($P$398=\"Outsourcet\",Q81<=$L$34,\"- vælg i dropdown -\"<>$L$34,L77=\"1. Dato (indsæt dato i næste felt)\"),\"Ja\",\"Nej\")","v":"Nej"},null,null,null,null,""]
[null,null,null,{"$f":"IF(M80=\"Fejl\",\"Myndigheden bør sikre sig, at datoen ligger mellem 31-12-1979 og 01-01-2051, og at der er indtastet en gyldig dato.\"&\" Eksempelvis vil indtastninger som 32-02-2021 blive markeret som fejl. Endvidere bør myndigheden sikre sig, at datoformatet, som vist ovenfor, overholdes.\",\"\")","v":""},null,null,null,null,null,null,null,null,null,null,null,{"$f":"IF(C82<>\"\",MAX($P$10:P81)+1,\"\")","v":""},1,{"$f":"IF(AND($P$398=\"Outsourcet\",Q82<=$L$34,\"- vælg i dropdown -\"<>$L$34),\"Ja\",\"Nej\")","v":"Nej"},null,null,null,null,""]
[null,null,null,null,null,null,null,null,null,null,null,null,null,null,null,{"$f":"IF(C83<>\"\",MAX($P$10:P82)+1,\"\")","v":""},1,{"$f":"IF(AND($P$398=\"Outsourcet\",Q83<=$L$34,\"- vælg i dropdown -\"<>$L$34),\"Ja\",\"Nej\")","v":"Nej"},null,null,null,null,""]
[null,null,"Spm.7.1","Hvor mange forlængelsesmåneder giver kontrakten maksimalt mulighed for?",null,null,null,null,null,null,null,"[Indsæt antal måneder]",{"$f":"IF(AND(ISNUMBER(L84)=FALSE,L84<>$S84,L84<>\"\"),\"FEJL\",\"\")","v":""},null,null,{"$f":"IF(C84<>\"\",MAX($P$10:P83)+1,\"\")","v":25},1,{"$f":"IF(AND($P$398=\"Outsourcet\",Q84<=$L$34,\"- vælg i dropdown -\"<>$L$34,L77=\"1. Dato (indsæt dato i næste felt)\"),\"Ja\",\"Nej\")","v":"Nej"},"[Indsæt antal måneder]","n/a",null,null,""]
[null,null,null,null,null,null,null,null,null,null,null,"Indsæt antal måneder.",null,null,null,{"$f":"IF(C85<>\"\",MAX($P$10:P84)+1,\"\")","v":""},1,{"$f":"IF(AND($P$398=\"Outsourcet\",Q85<=$L$34,\"- vælg i dropdown -\"<>$L$34,L77=\"1. Dato (indsæt dato i næste felt)\"),\"Ja\",\"Nej\")","v":"Nej"},null,null,null,null,""]
[null,null,null,"Forklaring: Forlængelsesmåneder for it-systemets primære kontrakt.",null,null,null,null,null,null,null,null,null,null,null,{"$f":"IF(C86<>\"\",MAX($P$10:P85)+1,\"\")","v":""},1,{"$f":"IF(AND($P$398=\"Outsourcet\",Q86<=$L$34,\"- vælg i dropdown -\"<>$L$34,L77=\"1. Dato (indsæt dato i næste felt)\"),\"Ja\",\"Nej\")","v":"Nej"},null,null,null,null,""]
[null,null,"Spm.7.1","Dette spørgsmål er kun relevant, hvis det foregående spørgsmål er besvaret med '1. Dato (indsæt dato i næste felt)'.",null,null,null,null,null,null,null,null,null,null,null,null,1,{"$f":"IF(AND($P$398=\"Outsourcet\",Q87<=$L$34,\"- vælg i dropdown -\"<>$L$34,OR(L77=\"2. Ingen udløbsdato\",L77=\"3. Ved ikke\",L77=S77)),\"Ja\",\"Nej\")","v":"Nej"},null,null,null,null,""]
[null,null,null,null,null,null,null,null,null,null,null,null,null,null,null,{"$f":"IF(C88<>\"\",MAX($P$10:P86)+1,\"\")","v":""},1,{"$f":"IF(AND($P$398=\"Outsourcet\",Q88<=$L$34,\"- vælg i dropdown -\"<>$L$34),\"Ja\",\"Nej\")","v":"Nej"},null,null,null,null,""]
[null,null,null,null,null,null,null,null,null,null,null,null,null,null,null,{"$f":"IF(C89<>\"\",MAX($P$10:P88)+1,\"\")","v":""},1,{"$f":"IF(AND($P$398=\"Outsourcet\",Q89<=$L$34,\"- vælg i dropdown -\"<>$L$34),\"Ja\",\"Nej\")","v":"Nej"},null,null,null,null,""]
[null,null,"Spm.8.1","Hvornår er it-systemets transition til en eventuel ny leverandør planlagt afsluttet?",null,null,null,null,null,null,null," - vælg i dropdown -",{"$f":"IF(AND(ISERROR(MATCH(L90,INDIRECT(T90),0))=TRUE,L90<>\"\"),\"FEJL\",\"\")","v":""},null,null,{"$f":"IF(C90<>\"\",MAX($P$10:P89)+1,\"\")","v":26},1,{"$f":"IF(AND($P$398=\"Outsourcet\",Q90<=$L$34,\"- vælg i dropdown -\"<>$L$34),\"Ja\",\"Nej\")","v":"Nej"}," - vælg i dropdown -","DIP",null,null,""]
[null,null,null,"\nForklaring: Dato for afsluttet transition til en eventuel ny leverandør efter udbud af it-systemet.",null,null,null,null,null,null,null,"Man kan kun vælge én svarmulighed.",null,null,null,{"$f":"IF(C91<>\"\",MAX($P$10:P90)+1,\"\")","v":""},1,{"$f":"IF(AND($P$398=\"Outsourcet\",Q91<=$L$34,\"- vælg i dropdown -\"<>$L$34),\"Ja\",\"Nej\")","v":"Nej"},null,null,null,null,""]
[null,null,null,null,null,null,null,null,null,null,null,null,null,null,null,{"$f":"IF(C92<>\"\",MAX($P$10:P91)+1,\"\")","v":""},1,{"$f":"IF(AND($P$398=\"Outsourcet\",Q92<=$L$34,\"- vælg i dropdown -\"<>$L$34,L90=\"1. Dato (indsæt dato i næste felt)\"),\"Ja\",\"Nej\")","v":"Nej"},null,null,null,null,""]
[null,null,"x",null,null,null,null,null,null,null,null,"[Indsæt dato]",{"$f":"(IF(OR(L93=S93,AND(ISNUMBER(L93)=TRUE,L93>29220,L93<55154)),\"\", \"FEJL\"))","v":""},null,null,{"$f":"IF(C93<>\"\",MAX($P$10:P92)+1,\"\")","v":27},1,{"$f":"IF(AND($P$398=\"Outsourcet\",Q93<=$L$34,\"- vælg i dropdown -\"<>$L$34,L90=\"1. Dato (indsæt dato i næste felt)\"),\"Ja\",\"Nej\")","v":"Nej"},"[Indsæt dato]",null,null,null,""]
[null,null,null,null,null,null,null,null,null,null,null,"Indsæt dato i format DD-MM-ÅÅÅÅ (fx 01-01-2020).",null,null,null,{"$f":"IF(C94<>\"\",MAX($P$10:P93)+1,\"\")","v":""},1,{"$f":"IF(AND($P$398=\"Outsourcet\",Q94<=$L$34,\"- vælg i dropdown -\"<>$L$34,L90=\"1. Dato (indsæt dato i næste felt)\"),\"Ja\",\"Nej\")","v":"Nej"},null,null,null,null,""]
[null,null,null,{"$f":"IF(M93=\"Fejl\",\"Myndigheden bør sikre sig, at datoen ligger mellem 31-12-1979 og 01-01-2051, og at der er indtastet en gyldig dato.\"&\" Eksempelvis vil indtastninger som 32-02-2021 blive markeret som fejl. Endvidere bør myndigheden sikre sig, at datoformatet, som vist ovenfor, overholdes.\",\"\")","v":""},null,null,null,null,null,null,null,null,null,null,null,{"$f":"IF(C95<>\"\",MAX($P$10:P94)+1,\"\")","v":""},1,{"$f":"IF(AND($P$398=\"Outsourcet\",Q95<=$L$34,\"- vælg i dropdown -\"<>$L$34),\"Ja\",\"Nej\")","v":"Nej"},null,null,null,null,{"$f":"IF(OR(P95=\"\",R95=\"Nej\"),\"\",IF(OR(M95=\"Fejl\",D95=S95,D95=\"\"),\"Ubesvaret\",\"Besvaret\"))","v":""}]
[null,null,null,null,null,null,null,null,null,null,null,null,null,null,null,{"$f":"IF(C96<>\"\",MAX($P$10:P95)+1,\"\")","v":""},1,"Nej",null,null,null,null,""]
[null,null,"Spm.9.1","Er alle væsentlige kontraktdokumenter med videre for it-systemet optaget i et kontraktbibliotek?",null,null,null,null,null,null,null," - vælg i dropdown -",{"$f":"IF(AND(ISERROR(MATCH(L97,INDIRECT(T97),0))=TRUE,L97<>\"\"),\"FEJL\",\"\")","v":""},null,null,{"$f":"IF(C97<>\"\",MAX($P$10:P96)+1,\"\")","v":28},1,"Nej"," - vælg i dropdown -","JNVI",null,null,""]
[null,null,null,null,null,null,null,null,null,null,null,"Man kan kun vælge én svarmulighed.",null,null,null,{"$f":"IF(C98<>\"\",MAX($P$10:P97)+1,\"\")","v":""},1,"Nej",null,null,null,null,""]
[null,null,null,"Forklaring: Myndighedens kontraktbibliotek indeholder en samlet oversigt over alle væsentlige kontraktdokumenter for it-systemet, herunder tillæg, allonger, aftaler om ændring af priser, bilag mv.",null,null,null,null,null,null,null,null,null,null,null,{"$f":"IF(C99<>\"\",MAX($P$10:P98)+1,\"\")","v":""},1,"Nej",null,null,null,null,""]
[null,null,null,null,null,null,null,null,null,null,null,null,null,null,null,{"$f":"IF(C100<>\"\",MAX($P$10:P99)+1,\"\")","v":""},1,"Nej",null,null,null,null,""]
[null,null,null,null,null,null,null,null,null,null,null,null,null,null,null,{"$f":"IF(C101<>\"\",MAX($P$10:P100)+1,\"\")","v":""},1,"Nej",null,null,null,null,""]
[null,null,"Spm.10.1","Følges faste procedurer for økonomisk controlling imod kontrakt og leverede ydelser?",null,null,null,null,null,null,null," - vælg i dropdown -",{"$f":"IF(AND(ISERROR(MATCH(L102,INDIRECT(T102),0))=TRUE,L102<>\"\"),\"FEJL\",\"\")","v":""},null,null,{"$f":"IF(C102<>\"\",MAX($P$10:P101)+1,\"\")","v":29},1,"Nej"," - vælg i dropdown -","JNVI",null,null,""]
[null,null,null,null,null,null,null,null,null,null,null,"Man kan kun vælge én svarmulighed.",null,null,null,{"$f":"IF(C103<>\"\",MAX($P$10:P102)+1,\"\")","v":""},1,"Nej",null,null,null,null,""]
[null,null,null,"Forklaring: Følges der procedurer for løbende stikprøvemålinger af fakturaer for at se, om de stemmer overens med kontrakten og de leverede ydelser, og er der i henhold til disse procedurer eksempelvis foretaget gennemgang af det seneste års fakturaer mod kontrakten og de leverede ydelser, så skal der svares 'ja'. Hvis dette ikke er tilfældet, skal der svares 'nej'.",null,null,null,null,null,null,null,null,null,null,null,{"$f":"IF(C104<>\"\",MAX($P$10:P103)+1,\"\")","v":""},1,"Nej",null,null,null,null,""]
[null,null,null,null,null,null,null,null,null,null,null,null,null,null,null,{"$f":"IF(C105<>\"\",MAX($P$10:P104)+1,\"\")","v":""},1,"Nej",null,null,null,null,""]
[null,null,null,null,null,null,null,null,null,null,null,null,null,null,null,{"$f":"IF(C106<>\"\",MAX($P$10:P105)+1,\"\")","v":""},2,"Nej",null,null,null,null,""]
[null,null,null,{"$f":"CONCATENATE(\"Leverandør 2 - \"&L37)","v":"Leverandør 2 - [Tekstfelt]"},null,null,null,null,null,null,null,null,null,null,null,{"$f":"IF(C107<>\"\",MAX($P$10:P106)+1,\"\")","v":""},2,"Nej",null,null,null,null,""]
[null,null,null,null,null,null,null,null,null,null,null,null,null,null,null,{"$f":"IF(C108<>\"\",MAX($P$10:P107)+1,\"\")","v":""},2,"Nej",null,null,null,null,""]
[null,null,"Spm.5.2","Hvor tilfredsstillende er myndighedens kontraktstyring af it-systemets kontraktdokumenter i dag?\n",null,null,null,null,null,null,null," - vælg i dropdown -",{"$f":"IF(AND(ISERROR(MATCH(L109,INDIRECT(T109),0))=TRUE,L109<>\"\"),\"FEJL\",\"\")","v":""},null,null,{"$f":"IF(C109<>\"\",MAX($P$10:P108)+1,\"\")","v":30},2,"Nej"," - vælg i dropdown -","TLFRDS",null,null,""]
[null,null,null,null,null,null,null,null,null,null,null,"Man kan kun vælge én svarmulighed.",null,null,null,{"$f":"IF(C110<>\"\",MAX($P$10:P109)+1,\"\")","v":""},2,"Nej",null,null,null,null,""]
[null,null,null,"Forklaring: Vurderingen af myndighedens kontraktstyring baseres på opfyldelse af følgende punkter for kontrakten:\nA. Hovedkontrakt, stamdata tillæg med videre er placeret i et tilgængeligt og opdateret bibliotek.\nB. Der vedligeholdes en kontraktkalender, som understøtter den kontraktansvarlige medarbejders styring af kontraktuelle forpligtelser og rettigheder.\nC. Der gennemføres struktureret modtagelse af leverancer, som sammenholdes med fakturaer inden betaling.\nD. Der er etableret mekanismer, som sikrer, at udbud påbegyndes rettidigt i forhold til at gennemføre transition til en eventuel ny leverandør inden kontraktudløb.\n",null,null,null,null,null,null,null,null,null,null,null,{"$f":"IF(C111<>\"\",MAX($P$10:P110)+1,\"\")","v":""},2,"Nej",null,null,null,null,""]
[null,null,null,"\n1. Meget utilfredsstillende svares, når ingen af ovenstående punkter opfyldes for kontrakten.\n2. Utilfredsstillende svares, når op til tre af ovenstående punkter opfyldes for kontrakten.\n3. Tilfredsstillende svares, når alle fire punkter opfyldes med en procesmodenhed, der svarer til en udokumenteret ad hoc-proces.\n4. Meget tilfredsstillende svares, når alle fire punkter opfyldes med en procesmodenhed, der svarer til en dokumenteret proces, som gentages ensartet og periodisk, eksempelvis gennem anvendelse af de kontrakt- og leverandørstyringsværktøjer, der er stillet til rådighed.\n5. Særdeles tilfredsstillende svares, når alle fire punkter opfyldes med en høj modenhed og gennem anvendelse af specialiserede kontraktstyringsværktøjer.",null,null,null,null,null,null,null,null,null,null,null,{"$f":"IF(C112<>\"\",MAX($P$10:P111)+1,\"\")","v":""},2,"Nej",null,null,null,null,""]
[null,null,null,null,null,null,null,null,null,null,null,null,null,null,null,{"$f":"IF(C113<>\"\",MAX($P$10:P112)+1,\"\")","v":""},2,"Nej",null,null,null,null,""]
[null,null,"Spm.6.2","Hvad er udløbsdatoen for kontrakten eksklusive forlængelsesperioden?",null,null,null,null,null,null,null," - vælg i dropdown -",{"$f":"IF(AND(ISERROR(MATCH(L114,INDIRECT(T114),0))=TRUE,L114<>\"\"),\"FEJL\",\"\")","v":""},null,null,{"$f":"IF(C114<>\"\",MAX($P$10:P113)+1,\"\")","v":31},2,"Nej"," - vælg i dropdown -","DIU",null,null,""]
[null,null,null,"\nForklaring: Udløbsdatoen, eksklusive forlængelse for it-systemets primære kontrakt.",null,null,null,null,null,null,null,"Man kan kun vælge én svarmulighed.",null,null,null,{"$f":"IF(C115<>\"\",MAX($P$10:P114)+1,\"\")","v":""},2,"Nej",null,null,null,null,""]
[null,null,null,null,null,null,null,null,null,null,null,null,null,null,null,{"$f":"IF(C116<>\"\",MAX($P$10:P115)+1,\"\")","v":""},2,{"$f":"IF(AND($P$398=\"Outsourcet\",Q116<=$L$34,\"- vælg i dropdown -\"<>$L$34,L114=\"1. Dato (indsæt dato i næste felt)\"),\"Ja\",\"Nej\")","v":"Nej"},null,null,null,null,""]
[null,null,"x",null,null,null,null,null,null,null,null,"[Indsæt dato]",{"$f":"(IF(OR(L117=S117,AND(ISNUMBER(L117)=TRUE,L117>29220,L117<55154)),\"\", \"FEJL\"))","v":""},null,null,{"$f":"IF(C117<>\"\",MAX($P$10:P116)+1,\"\")","v":32},2,{"$f":"IF(AND($P$398=\"Outsourcet\",Q117<=$L$34,\"- vælg i dropdown -\"<>$L$34,L114=\"1. Dato (indsæt dato i næste felt)\"),\"Ja\",\"Nej\")","v":"Nej"},"[Indsæt dato]",null,null,null,""]
[null,null,null,null,null,null,null,null,null,null,null,"Indsæt dato i format DD-MM-ÅÅÅÅ (fx 01-01-2020).",null,null,null,{"$f":"IF(C118<>\"\",MAX($P$10:P117)+1,\"\")","v":""},2,{"$f":"IF(AND($P$398=\"Outsourcet\",Q118<=$L$34,\"- vælg i dropdown -\"<>$L$34,L114=\"1. Dato (indsæt dato i næste felt)\"),\"Ja\",\"Nej\")","v":"Nej"},null,null,null,null,""]
[null,null,null,{"$f":"IF(M117=\"Fejl\",\"Myndigheden bør sikre sig, at datoen ligger mellem 31-12-1979 og 01-01-2051, og at der er indtastet en gyldig dato.\"&\" Eksempelvis vil indtastninger som 32-02-2021 blive markeret som fejl. Endvidere bør myndigheden sikre sig, at datoformatet, som vist ovenfor, overholdes.\",\"\")","v":""},null,null,null,null,null,null,null,null,null,null,null,{"$f":"IF(C119<>\"\",MAX($P$10:P118)+1,\"\")","v":""},2,{"$f":"IF(AND($P$398=\"Outsourcet\",Q119<=$L$34,\"- vælg i dropdown -\"<>$L$34),\"Ja\",\"Nej\")","v":"Nej"},null,null,null,null,""]
[null,null,null,null,null,null,null,null,null,null,null,null,null,null,null,{"$f":"IF(C120<>\"\",MAX($P$10:P119)+1,\"\")","v":""},2,{"$f":"IF(AND($P$398=\"Outsourcet\",Q120<=$L$34,\"- vælg i dropdown -\"<>$L$34),\"Ja\",\"Nej\")","v":"Nej"},null,null,null,null,""]
[null,null,"Spm.7.2","Hvor mange forlængelsesmåneder giver kontrakten maksimalt mulighed for?",null,null,null,null,null,null,null,"[Indsæt antal måneder]",{"$f":"IF(AND(ISNUMBER(L121)=FALSE,L121<>$S121,L121<>\"\"),\"FEJL\",\"\")","v":""},null,null,{"$f":"IF(C121<>\"\",MAX($P$10:P120)+1,\"\")","v":33},2,{"$f":"IF(AND($P$398=\"Outsourcet\",Q121<=$L$34,\"- vælg i dropdown -\"<>$L$34,L114=\"1. Dato (indsæt dato i næste felt)\"),\"Ja\",\"Nej\")","v":"Nej"},"[Indsæt antal måneder]","n/a",null,null,""]
[null,null,null,null,null,null,null,null,null,null,null,"Indsæt antal måneder.",null,null,null,{"$f":"IF(C122<>\"\",MAX($P$10:P121)+1,\"\")","v":""},2,{"$f":"IF(AND($P$398=\"Outsourcet\",Q122<=$L$34,\"- vælg i dropdown -\"<>$L$34,L114=\"1. Dato (indsæt dato i næste felt)\"),\"Ja\",\"Nej\")","v":"Nej"},null,null,null,null,""]
[null,null,null,"Forklaring: Forlængelsesmåneder for it-systemets primære kontrakt.",null,null,null,null,null,null,null,null,null,null,null,{"$f":"IF(C123<>\"\",MAX($P$10:P122)+1,\"\")","v":""},2,{"$f":"IF(AND($P$398=\"Outsourcet\",Q123<=$L$34,\"- vælg i dropdown -\"<>$L$34,L114=\"1. Dato (indsæt dato i næste felt)\"),\"Ja\",\"Nej\")","v":"Nej"},null,null,null,null,""]
[null,null,"Spm.7.2","Dette spørgsmål er kun relevant, hvis det foregående spørgsmål er besvaret med '1. Dato (indsæt dato i næste felt)'.",null,null,null,null,null,null,null,null,null,null,null,null,2,{"$f":"IF(AND($P$398=\"Outsourcet\",Q124<=$L$34,\"- vælg i dropdown -\"<>$L$34,OR(L114=\"2. Ingen udløbsdato\",L114=\"3. Ved ikke\",L114=S114)),\"Ja\",\"Nej\")","v":"Nej"},null,null,null,null,""]
[null,null,null,null,null,null,null,null,null,null,null,null,null,null,null,{"$f":"IF(C125<>\"\",MAX($P$10:P123)+1,\"\")","v":""},2,{"$f":"IF(AND($P$398=\"Outsourcet\",Q125<=$L$34,\"- vælg i dropdown -\"<>$L$34),\"Ja\",\"Nej\")","v":"Nej"},null,null,null,null,""]
[null,null,null,null,null,null,null,null,null,null,null,null,null,null,null,{"$f":"IF(C126<>\"\",MAX($P$10:P125)+1,\"\")","v":""},2,{"$f":"IF(AND($P$398=\"Outsourcet\",Q126<=$L$34,\"- vælg i dropdown -\"<>$L$34),\"Ja\",\"Nej\")","v":"Nej"},null,null,null,null,""]
[null,null,"Spm.8.2","Hvornår er it-systemets transition til en eventuel ny leverandør planlagt afsluttet?",null,null,null,null,null,null,null," - vælg i dropdown -",{"$f":"IF(AND(ISERROR(MATCH(L127,INDIRECT(T127),0))=TRUE,L127<>\"\"),\"FEJL\",\"\")","v":""},null,null,{"$f":"IF(C127<>\"\",MAX($P$10:P126)+1,\"\")","v":34},2,{"$f":"IF(AND($P$398=\"Outsourcet\",Q127<=$L$34,\"- vælg i dropdown -\"<>$L$34),\"Ja\",\"Nej\")","v":"Nej"}," - vælg i dropdown -","DIP",null,null,""]
[null,null,null,"\nForklaring: Dato for afsluttet transition til en eventuel ny leverandør efter udbud af it-systemet.",null,null,null,null,null,null,null,"Man kan kun vælge én svarmulighed.",null,null,null,{"$f":"IF(C128<>\"\",MAX($P$10:P127)+1,\"\")","v":""},2,{"$f":"IF(AND($P$398=\"Outsourcet\",Q128<=$L$34,\"- vælg i dropdown -\"<>$L$34),\"Ja\",\"Nej\")","v":"Nej"},null,null,null,null,""]
[null,null,null,null,null,null,null,null,null,null,null,null,null,null,null,{"$f":"IF(C129<>\"\",MAX($P$10:P128)+1,\"\")","v":""},2,{"$f":"IF(AND($P$398=\"Outsourcet\",Q129<=$L$34,\"- vælg i dropdown -\"<>$L$34,L127=\"1. Dato (indsæt dato i næste felt)\"),\"Ja\",\"Nej\")","v":"Nej"},null,null,null,null,""]
[null,null,"x",null,null,null,null,null,null,null,null,"[Indsæt dato]",{"$f":"(IF(OR(L130=S130,AND(ISNUMBER(L130)=TRUE,L130>29220,L130<55154)),\"\", \"FEJL\"))","v":""},null,null,{"$f":"IF(C130<>\"\",MAX($P$10:P129)+1,\"\")","v":35},2,{"$f":"IF(AND($P$398=\"Outsourcet\",Q130<=$L$34,\"- vælg i dropdown -\"<>$L$34,L127=\"1. Dato (indsæt dato i næste felt)\"),\"Ja\",\"Nej\")","v":"Nej"},"[Indsæt dato]",null,null,null,""]
[null,null,null,null,null,null,null,null,null,null,null,"Indsæt dato i format DD-MM-ÅÅÅÅ (fx 01-01-2020).",null,null,null,{"$f":"IF(C131<>\"\",MAX($P$10:P130)+1,\"\")","v":""},2,{"$f":"IF(AND($P$398=\"Outsourcet\",Q131<=$L$34,\"- vælg i dropdown -\"<>$L$34,L127=\"1. Dato (indsæt dato i næste felt)\"),\"Ja\",\"Nej\")","v":"Nej"},null,null,null,null,""]
[null,null,null,{"$f":"IF(M130=\"Fejl\",\"Myndigheden bør sikre sig, at datoen ligger mellem 31-12-1979 og 01-01-2051, og at der er indtastet en gyldig dato.\"&\" Eksempelvis vil indtastninger som 32-02-2021 blive markeret som fejl. Endvidere bør myndigheden sikre sig, at datoformatet, som vist ovenfor, overholdes.\",\"\")","v":""},null,null,null,null,null,null,null,null,null,null,null,{"$f":"IF(C132<>\"\",MAX($P$10:P131)+1,\"\")","v":""},2,{"$f":"IF(AND($P$398=\"Outsourcet\",Q132<=$L$34,\"- vælg i dropdown -\"<>$L$34),\"Ja\",\"Nej\")","v":"Nej"},null,null,null,null,""]
[null,null,null,null,null,null,null,null,null,null,null,null,null,null,null,{"$f":"IF(C133<>\"\",MAX($P$10:P132)+1,\"\")","v":""},2,"Nej",null,null,null,null,""]
[null,null,"Spm.9.2","Er alle væsentlige kontraktdokumenter med videre for it-systemet optaget i et kontraktbibliotek?",null,null,null,null,null,null,null," - vælg i dropdown -",{"$f":"IF(AND(ISERROR(MATCH(L134,INDIRECT(T134),0))=TRUE,L134<>\"\"),\"FEJL\",\"\")","v":""},null,null,{"$f":"IF(C134<>\"\",MAX($P$10:P133)+1,\"\")","v":36},2,"Nej"," - vælg i dropdown -","JNVI",null,null,""]
[null,null,null,null,null,null,null,null,null,null,null,"Man kan kun vælge én svarmulighed.",null,null,null,{"$f":"IF(C135<>\"\",MAX($P$10:P134)+1,\"\")","v":""},2,"Nej",null,null,null,null,""]
[null,null,null,"Forklaring: Myndighedens kontraktbibliotek indeholder en samlet oversigt over alle væsentlige kontraktdokumenter for it-systemet, herunder tillæg, allonger, aftaler om ændring af priser, bilag mv.",null,null,null,null,null,null,null,null,null,null,null,{"$f":"IF(C136<>\"\",MAX($P$10:P135)+1,\"\")","v":""},2,"Nej",null,null,null,null,""]
[null,null,null,null,null,null,null,null,null,null,null,null,null,null,null,{"$f":"IF(C137<>\"\",MAX($P$10:P136)+1,\"\")","v":""},2,"Nej",null,null,null,null,""]
[null,null,null,null,null,null,null,null,null,null,null,null,null,null,null,{"$f":"IF(C138<>\"\",MAX($P$10:P137)+1,\"\")","v":""},2,"Nej",null,null,null,null,""]
[null,null,"Spm.10.2","Følges faste procedurer for økonomisk controlling imod kontrakt og leverede ydelser?",null,null,null,null,null,null,null," - vælg i dropdown -",{"$f":"IF(AND(ISERROR(MATCH(L139,INDIRECT(T139),0))=TRUE,L139<>\"\"),\"FEJL\",\"\")","v":""},null,null,{"$f":"IF(C139<>\"\",MAX($P$10:P138)+1,\"\")","v":37},2,"Nej"," - vælg i dropdown -","JNVI",null,null,""]
[null,null,null,null,null,null,null,null,null,null,null,"Man kan kun vælge én svarmulighed.",null,null,null,{"$f":"IF(C140<>\"\",MAX($P$10:P139)+1,\"\")","v":""},2,"Nej",null,null,null,null,{"$f":"IF(OR(P140=\"\",R140=\"Nej\"),\"\",IF(OR(M140=\"Fejl\",L140=S140,L140=\"\"),\"Ubesvaret\",\"Besvaret\"))","v":""}]
[null,null,null,"Forklaring: Følges der procedurer for løbende stikprøvemålinger af fakturaer for at se, om de stemmer overens med kontrakten og de leverede ydelser, og er der i henhold til disse procedurer eksempelvis foretaget gennemgang af det seneste års fakturaer mod kontrakten og de leverede ydelser, så skal der svares 'ja'. Hvis dette ikke er tilfældet, skal der svares 'nej'.",null,null,null,null,null,null,null,null,null,null,null,{"$f":"IF(C141<>\"\",MAX($P$10:P140)+1,\"\")","v":""},2,"Nej",null,null,null,null,""]
[null,null,null,null,null,null,null,null,null,null,null,null,null,null,null,{"$f":"IF(C142<>\"\",MAX($P$10:P141)+1,\"\")","v":""},2,"Nej",null,null,null,null,""]
[null,null,null,null,null,null,null,null,null,null,null,null,null,null,null,{"$f":"IF(C143<>\"\",MAX($P$10:P142)+1,\"\")","v":""},3,"Nej",null,null,null,null,""]
[null,null,null,{"$f":"CONCATENATE(\"Leverandør 3 - \"&L38)","v":"Leverandør 3 - [Tekstfelt]"},null,null,null,null,null,null,null,null,null,null,null,{"$f":"IF(C144<>\"\",MAX($P$10:P143)+1,\"\")","v":""},3,"Nej",null,null,null,null,""]
[null,null,null,null,null,null,null,null,null,null,null,null,null,null,null,{"$f":"IF(C145<>\"\",MAX($P$10:P144)+1,\"\")","v":""},3,"Nej",null,null,null,null,""]
[null,null,"Spm.5.3","Hvor tilfredsstillende er myndighedens kontraktstyring af it-systemets kontraktdokumenter i dag?\n",null,null,null,null,null,null,null," - vælg i dropdown -",{"$f":"IF(AND(ISERROR(MATCH(L146,INDIRECT(T146),0))=TRUE,L146<>\"\"),\"FEJL\",\"\")","v":""},null,null,{"$f":"IF(C146<>\"\",MAX($P$10:P145)+1,\"\")","v":38},3,"Nej"," - vælg i dropdown -","TLFRDS",null,null,{"$f":"IF(OR(P146=\"\",R146=\"Nej\"),\"\",IF(OR(M146=\"Fejl\",L146=S146,L146=\"\"),\"Ubesvaret\",\"Besvaret\"))","v":""}]
[null,null,null,null,null,null,null,null,null,null,null,"Man kan kun vælge én svarmulighed.",null,null,null,{"$f":"IF(C147<>\"\",MAX($P$10:P146)+1,\"\")","v":""},3,"Nej",null,null,null,null,{"$f":"IF(OR(P147=\"\",R147=\"Nej\"),\"\",IF(OR(M147=\"Fejl\",L147=S147,L147=\"\"),\"Ubesvaret\",\"Besvaret\"))","v":""}]
[null,null,null,"Forklaring: Vurderingen af myndighedens kontraktstyring baseres på opfyldelse af følgende punkter for kontrakten:\nA. Hovedkontrakt, stamdata tillæg med videre er placeret i et tilgængeligt og opdateret bibliotek.\nB. Der vedligeholdes en kontraktkalender, som understøtter den kontraktansvarlige medarbejders styring af kontraktuelle forpligtelser og rettigheder.\nC. Der gennemføres struktureret modtagelse af leverancer, som sammenholdes med fakturaer inden betaling.\nD. Der er etableret mekanismer, som sikrer, at udbud påbegyndes rettidigt i forhold til at gennemføre transition til en eventuel ny leverandør inden kontraktudløb.\n\n",null,null,null,null,null,null,null,null,null,null,null,{"$f":"IF(C148<>\"\",MAX($P$10:P147)+1,\"\")","v":""},3,"Nej",null,null,null,null,""]
[null,null,null,"\n1. Meget utilfredsstillende svares, når ingen af ovenstående punkter opfyldes for kontrakten.\n2. Utilfredsstillende svares, når op til tre af ovenstående punkter opfyldes for kontrakten.\n3. Tilfredsstillende svares, når alle fire punkter opfyldes med en procesmodenhed, der svarer til en udokumenteret ad hoc-proces.\n4. Meget tilfredsstillende svares, når alle fire punkter opfyldes med en procesmodenhed, der svarer til en dokumenteret proces, som gentages ensartet og periodisk, eksempelvis gennem anvendelse af de kontrakt- og leverandørstyringsværktøjer, der er stillet til rådighed.\n5. Særdeles tilfredsstillende svares, når alle fire punkter opfyldes med en høj modenhed og gennem anvendelse af specialiserede kontraktstyringsværktøjer.",null,null,null,null,null,null,null,null,null,null,null,{"$f":"IF(C149<>\"\",MAX($P$10:P148)+1,\"\")","v":""},3,"Nej",null,null,null,null,""]
[null,null,null,null,null,null,null,null,null,null,null,null,null,null,null,{"$f":"IF(C150<>\"\",MAX($P$10:P149)+1,\"\")","v":""},3,"Nej",null,null,null,null,""]
[null,null,"Spm.6.3","Hvad er udløbsdatoen for kontrakten eksklusive forlængelsesperioden?",null,null,null,null,null,null,null," - vælg i dropdown -",{"$f":"IF(AND(ISERROR(MATCH(L151,INDIRECT(T151),0))=TRUE,L151<>\"\"),\"FEJL\",\"\")","v":""},null,null,{"$f":"IF(C151<>\"\",MAX($P$10:P150)+1,\"\")","v":39},3,"Nej"," - vælg i dropdown -","DIU",null,null,""]
[null,null,null,"\nForklaring: Udløbsdatoen, eksklusive forlængelse for it-systemets primære kontrakt.",null,null,null,null,null,null,null,"Man kan kun vælge én svarmulighed.",null,null,null,{"$f":"IF(C152<>\"\",MAX($P$10:P151)+1,\"\")","v":""},3,"Nej",null,null,null,null,""]
[null,null,null,null,null,null,null,null,null,null,null,null,null,null,null,{"$f":"IF(C153<>\"\",MAX($P$10:P152)+1,\"\")","v":""},3,{"$f":"IF(AND($P$398=\"Outsourcet\",Q153<=$L$34,\"- vælg i dropdown -\"<>$L$34,L151=\"1. Dato (indsæt dato i næste felt)\"),\"Ja\",\"Nej\")","v":"Nej"},null,null,null,null,""]
[null,null,"x",null,null,null,null,null,null,null,null,"[Indsæt dato]",{"$f":"(IF(OR(L154=S154,AND(ISNUMBER(L154)=TRUE,L154>29220,L154<55154)),\"\", \"FEJL\"))","v":""},null,null,{"$f":"IF(C154<>\"\",MAX($P$10:P153)+1,\"\")","v":40},3,{"$f":"IF(AND($P$398=\"Outsourcet\",Q154<=$L$34,\"- vælg i dropdown -\"<>$L$34,L151=\"1. Dato (indsæt dato i næste felt)\"),\"Ja\",\"Nej\")","v":"Nej"},"[Indsæt dato]",null,null,null,""]
[null,null,null,null,null,null,null,null,null,null,null,"Indsæt dato i format DD-MM-ÅÅÅÅ (fx 01-01-2020).",null,null,null,{"$f":"IF(C155<>\"\",MAX($P$10:P154)+1,\"\")","v":""},3,{"$f":"IF(AND($P$398=\"Outsourcet\",Q155<=$L$34,\"- vælg i dropdown -\"<>$L$34,L151=\"1. Dato (indsæt dato i næste felt)\"),\"Ja\",\"Nej\")","v":"Nej"},null,null,null,null,""]
[null,null,null,{"$f":"IF(M154=\"Fejl\",\"Myndigheden bør sikre sig, at datoen ligger mellem 31-12-1979 og 01-01-2051, og at der er indtastet en gyldig dato.\"&\" Eksempelvis vil indtastninger som 32-02-2021 blive markeret som fejl. Endvidere bør myndigheden sikre sig, at datoformatet, som vist ovenfor, overholdes.\",\"\")","v":""},null,null,null,null,null,null,null,null,null,null,null,{"$f":"IF(C156<>\"\",MAX($P$10:P155)+1,\"\")","v":""},3,{"$f":"IF(AND($P$398=\"Outsourcet\",Q156<=$L$34,\"- vælg i dropdown -\"<>$L$34),\"Ja\",\"Nej\")","v":"Nej"},null,null,null,null,""]
[null,null,null,null,null,null,null,null,null,null,null,null,null,null,null,{"$f":"IF(C157<>\"\",MAX($P$10:P156)+1,\"\")","v":""},3,{"$f":"IF(AND($P$398=\"Outsourcet\",Q157<=$L$34,\"- vælg i dropdown -\"<>$L$34),\"Ja\",\"Nej\")","v":"Nej"},null,null,null,null,""]
[null,null,"Spm.7.3","Hvor mange forlængelsesmåneder giver kontrakten maksimalt mulighed for?",null,null,null,null,null,null,null,"[Indsæt antal måneder]",{"$f":"IF(AND(ISNUMBER(L158)=FALSE,L158<>$S158,L158<>\"\"),\"FEJL\",\"\")","v":""},null,null,{"$f":"IF(C158<>\"\",MAX($P$10:P157)+1,\"\")","v":41},3,{"$f":"IF(AND($P$398=\"Outsourcet\",Q158<=$L$34,\"- vælg i dropdown -\"<>$L$34,L151=\"1. Dato (indsæt dato i næste felt)\"),\"Ja\",\"Nej\")","v":"Nej"},"[Indsæt antal måneder]",null,null,null,""]
[null,null,null,null,null,null,null,null,null,null,null,"Indsæt antal måneder.",null,null,null,{"$f":"IF(C159<>\"\",MAX($P$10:P158)+1,\"\")","v":""},3,{"$f":"IF(AND($P$398=\"Outsourcet\",Q159<=$L$34,\"- vælg i dropdown -\"<>$L$34,L151=\"1. Dato (indsæt dato i næste felt)\"),\"Ja\",\"Nej\")","v":"Nej"},null,null,null,null,""]
[null,null,null,"Forklaring: Forlængelsesmåneder for it-systemets primære kontrakt.",null,null,null,null,null,null,null,null,null,null,null,{"$f":"IF(C160<>\"\",MAX($P$10:P159)+1,\"\")","v":""},3,{"$f":"IF(AND($P$398=\"Outsourcet\",Q160<=$L$34,\"- vælg i dropdown -\"<>$L$34,L151=\"1. Dato (indsæt dato i næste felt)\"),\"Ja\",\"Nej\")","v":"Nej"},null,null,null,null,""]
[null,null,"Spm.7.3","Dette spørgsmål er kun relevant, hvis det foregående spørgsmål er besvaret med '1. Dato (indsæt dato i næste felt)'.",null,null,null,null,null,null,null,null,null,null,null,null,3,{"$f":"IF(AND($P$398=\"Outsourcet\",Q161<=$L$34,\"- vælg i dropdown -\"<>$L$34,OR(L151=\"2. Ingen udløbsdato\",L151=\"3. Ved ikke\",L151=S151)),\"Ja\",\"Nej\")","v":"Nej"},null,null,null,null,""]
[null,null,null,null,null,null,null,null,null,null,null,null,null,null,null,{"$f":"IF(C162<>\"\",MAX($P$10:P160)+1,\"\")","v":""},3,{"$f":"IF(AND($P$398=\"Outsourcet\",Q162<=$L$34,\"- vælg i dropdown -\"<>$L$34),\"Ja\",\"Nej\")","v":"Nej"},null,null,null,null,""]
[null,null,null,null,null,null,null,null,null,null,null,null,null,null,null,{"$f":"IF(C163<>\"\",MAX($P$10:P162)+1,\"\")","v":""},3,{"$f":"IF(AND($P$398=\"Outsourcet\",Q163<=$L$34,\"- vælg i dropdown -\"<>$L$34),\"Ja\",\"Nej\")","v":"Nej"},null,null,null,null,""]
[null,null,"Spm.8.3","Hvornår er it-systemets transition til en eventuel ny leverandør planlagt afsluttet?",null,null,null,null,null,null,null," - vælg i dropdown -",{"$f":"IF(AND(ISERROR(MATCH(L164,INDIRECT(T164),0))=TRUE,L164<>\"\"),\"FEJL\",\"\")","v":""},null,null,{"$f":"IF(C164<>\"\",MAX($P$10:P163)+1,\"\")","v":42},3,{"$f":"IF(AND($P$398=\"Outsourcet\",Q164<=$L$34,\"- vælg i dropdown -\"<>$L$34),\"Ja\",\"Nej\")","v":"Nej"}," - vælg i dropdown -","DIP",null,null,""]
[null,null,null,"\nForklaring: Dato for afsluttet transition til en eventuel ny leverandør efter udbud af it-systemet.",null,null,null,null,null,null,null,"Man kan kun vælge én svarmulighed.",null,null,null,{"$f":"IF(C165<>\"\",MAX($P$10:P164)+1,\"\")","v":""},3,{"$f":"IF(AND($P$398=\"Outsourcet\",Q165<=$L$34,\"- vælg i dropdown -\"<>$L$34),\"Ja\",\"Nej\")","v":"Nej"},null,null,null,null,""]
[null,null,null,null,null,null,null,null,null,null,null,null,null,null,null,{"$f":"IF(C166<>\"\",MAX($P$10:P165)+1,\"\")","v":""},3,{"$f":"IF(AND($P$398=\"Outsourcet\",Q166<=$L$34,\"- vælg i dropdown -\"<>$L$34,L164=\"1. Dato (indsæt dato i næste felt)\"),\"Ja\",\"Nej\")","v":"Nej"},null,null,null,null,""]
[null,null,"x",null,null,null,null,null,null,null,null,"[Indsæt dato]",{"$f":"(IF(OR(L167=S167,AND(ISNUMBER(L167)=TRUE,L167>29220,L167<55154)),\"\", \"FEJL\"))","v":""},null,null,{"$f":"IF(C167<>\"\",MAX($P$10:P166)+1,\"\")","v":43},3,{"$f":"IF(AND($P$398=\"Outsourcet\",Q167<=$L$34,\"- vælg i dropdown -\"<>$L$34,L164=\"1. Dato (indsæt dato i næste felt)\"),\"Ja\",\"Nej\")","v":"Nej"},"[Indsæt dato]",null,null,null,""]
[null,null,null,null,null,null,null,null,null,null,null,"Indsæt dato i format DD-MM-ÅÅÅÅ (fx 01-01-2020).",null,null,null,{"$f":"IF(C168<>\"\",MAX($P$10:P167)+1,\"\")","v":""},3,{"$f":"IF(AND($P$398=\"Outsourcet\",Q168<=$L$34,\"- vælg i dropdown -\"<>$L$34,L164=\"1. Dato (indsæt dato i næste felt)\"),\"Ja\",\"Nej\")","v":"Nej"},null,null,null,null,""]
[null,null,null,{"$f":"IF(M167=\"Fejl\",\"Myndigheden bør sikre sig, at datoen ligger mellem 31-12-1979 og 01-01-2051, og at der er indtastet en gyldig dato.\"&\" Eksempelvis vil indtastninger som 32-02-2021 blive markeret som fejl. Endvidere bør myndigheden sikre sig, at datoformatet, som vist ovenfor, overholdes.\",\"\")","v":""},null,null,null,null,null,null,null,null,null,null,null,{"$f":"IF(C169<>\"\",MAX($P$10:P168)+1,\"\")","v":""},3,{"$f":"IF(AND($P$398=\"Outsourcet\",Q169<=$L$34,\"- vælg i dropdown -\"<>$L$34),\"Ja\",\"Nej\")","v":"Nej"},null,null,null,null,""]
[null,null,null,null,null,null,null,null,null,null,null,null,null,null,null,{"$f":"IF(C170<>\"\",MAX($P$10:P169)+1,\"\")","v":""},3,"Nej",null,null,null,null,""]
[null,null,"Spm.9.3","Er alle væsentlige kontraktdokumenter med videre for it-systemet optaget i et kontraktbibliotek?",null,null,null,null,null,null,null," - vælg i dropdown -",{"$f":"IF(AND(ISERROR(MATCH(L171,INDIRECT(T171),0))=TRUE,L171<>\"\"),\"FEJL\",\"\")","v":""},null,null,{"$f":"IF(C171<>\"\",MAX($P$10:P170)+1,\"\")","v":44},3,"Nej"," - vælg i dropdown -","JNVI",null,null,""]
[null,null,null,null,null,null,null,null,null,null,null,"Man kan kun vælge én svarmulighed.",null,null,null,{"$f":"IF(C172<>\"\",MAX($P$10:P171)+1,\"\")","v":""},3,"Nej",null,null,null,null,""]
[null,null,null,"Forklaring: Myndighedens kontraktbibliotek indeholder en samlet oversigt over alle væsentlige kontraktdokumenter for it-systemet, herunder tillæg, allonger, aftaler om ændring af priser, bilag mv.",null,null,null,null,null,null,null,null,null,null,null,{"$f":"IF(C173<>\"\",MAX($P$10:P172)+1,\"\")","v":""},3,"Nej",null,null,null,null,""]
[null,null,null,null,null,null,null,null,null,null,null,null,null,null,null,{"$f":"IF(C174<>\"\",MAX($P$10:P173)+1,\"\")","v":""},3,"Nej",null,null,null,null,""]
[null,null,null,null,null,null,null,null,null,null,null,null,null,null,null,{"$f":"IF(C175<>\"\",MAX($P$10:P174)+1,\"\")","v":""},3,"Nej",null,null,null,null,""]
[null,null,"Spm.10.3","Følges faste procedurer for økonomisk controlling imod kontrakt og leverede ydelser?",null,null,null,null,null,null,null," - vælg i dropdown -",{"$f":"IF(AND(ISERROR(MATCH(L176,INDIRECT(T176),0))=TRUE,L176<>\"\"),\"FEJL\",\"\")","v":""},null,null,{"$f":"IF(C176<>\"\",MAX($P$10:P175)+1,\"\")","v":45},3,"Nej"," - vælg i dropdown -","JNVI",null,null,""]
[null,null,null,null,null,null,null,null,null,null,null,"Man kan kun vælge én svarmulighed.",null,null,null,{"$f":"IF(C177<>\"\",MAX($P$10:P176)+1,\"\")","v":""},3,"Nej",null,null,null,null,""]
[null,null,null,"Forklaring: Følges der procedurer for løbende stikprøvemålinger af fakturaer for at se, om de stemmer overens med kontrakten og de leverede ydelser, og er der i henhold til disse procedurer eksempelvis foretaget gennemgang af det seneste års fakturaer mod kontrakten og de leverede ydelser, så skal der svares 'ja'. Hvis dette ikke er tilfældet, skal der svares 'nej'.",null,null,null,null,null,null,null,null,null,null,null,{"$f":"IF(C178<>\"\",MAX($P$10:P177)+1,\"\")","v":""},3,"Nej",null,null,null,null,""]
[null,null,null,null,null,null,null,null,null,null,null,null,null,null,null,{"$f":"IF(C179<>\"\",MAX($P$10:P178)+1,\"\")","v":""},3,"Nej",null,null,null,null,""]
[null,null,null,null,null,null,null,null,null,null,null,null,null,null,null,{"$f":"IF(C180<>\"\",MAX($P$10:P179)+1,\"\")","v":""},4,"Nej",null,null,null,null,""]
[null,null,null,{"$f":"CONCATENATE(\"Leverandør 4 - \"&L39)","v":"Leverandør 4 - [Tekstfelt]"},null,null,null,null,null,null,null,null,null,null,null,{"$f":"IF(C181<>\"\",MAX($P$10:P180)+1,\"\")","v":""},4,"Nej",null,null,null,null,""]
[null,null,null,null,null,null,null,null,null,null,null,null,null,null,null,{"$f":"IF(C182<>\"\",MAX($P$10:P181)+1,\"\")","v":""},4,"Nej",null,null,null,null,""]
[null,null,"Spm.5.4","Hvor tilfredsstillende er myndighedens kontraktstyring af it-systemets kontraktdokumenter i dag?\n",null,null,null,null,null,null,null," - vælg i dropdown -",{"$f":"IF(AND(ISERROR(MATCH(L183,INDIRECT(T183),0))=TRUE,L183<>\"\"),\"FEJL\",\"\")","v":""},null,null,{"$f":"IF(C183<>\"\",MAX($P$10:P182)+1,\"\")","v":46},4,"Nej"," - vælg i dropdown -","TLFRDS",null,null,""]
[null,null,null,null,null,null,null,null,null,null,null,"Man kan kun vælge én svarmulighed.",null,null,null,{"$f":"IF(C184<>\"\",MAX($P$10:P183)+1,\"\")","v":""},4,"Nej",null,null,null,null,""]
[null,null,null,"Forklaring: Vurderingen af myndighedens kontraktstyring baseres på opfyldelse af følgende punkter for kontrakten:\nA. Hovedkontrakt, stamdata tillæg med videre er placeret i et tilgængeligt og opdateret bibliotek.\nB. Der vedligeholdes en kontraktkalender, som understøtter den kontraktansvarlige medarbejders styring af kontraktuelle forpligtelser og rettigheder.\nC. Der gennemføres struktureret modtagelse af leverancer, som sammenholdes med fakturaer inden betaling.\nD. Der er etableret mekanismer, som sikrer, at udbud påbegyndes rettidigt i forhold til at gennemføre transition til en eventuel ny leverandør inden kontraktudløb.\n",null,null,null,null,null,null,null,null,null,null,null,{"$f":"IF(C185<>\"\",MAX($P$10:P184)+1,\"\")","v":""},4,"Nej",null,null,null,null,""]
[null,null,null,"\n1. Meget utilfredsstillende svares, når ingen af ovenstående punkter opfyldes for kontrakten.\n2. Utilfredsstillende svares, når op til tre af ovenstående punkter opfyldes for kontrakten.\n3. Tilfredsstillende svares, når alle fire punkter opfyldes med en procesmodenhed, der svarer til en udokumenteret ad hoc-proces.\n4. Meget tilfredsstillende svares, når alle fire punkter opfyldes med en procesmodenhed, der svarer til en dokumenteret proces, som gentages ensartet og periodisk, eksempelvis gennem anvendelse af de kontrakt- og leverandørstyringsværktøjer, der er stillet til rådighed.\n5. Særdeles tilfredsstillende svares, når alle fire punkter opfyldes med en høj modenhed og gennem anvendelse af specialiserede kontraktstyringsværktøjer.",null,null,null,null,null,null,null,null,null,null,null,{"$f":"IF(C186<>\"\",MAX($P$10:P185)+1,\"\")","v":""},4,"Nej",null,null,null,null,""]
[null,null,null,null,null,null,null,null,null,null,null,null,null,null,null,{"$f":"IF(C187<>\"\",MAX($P$10:P186)+1,\"\")","v":""},4,"Nej",null,null,null,null,""]
[null,null,"Spm.6.4","Hvad er udløbsdatoen for kontrakten eksklusive forlængelsesperioden?",null,null,null,null,null,null,null," - vælg i dropdown -",{"$f":"IF(AND(ISERROR(MATCH(L188,INDIRECT(T188),0))=TRUE,L188<>\"\"),\"FEJL\",\"\")","v":""},null,null,{"$f":"IF(C188<>\"\",MAX($P$10:P187)+1,\"\")","v":47},4,"Nej"," - vælg i dropdown -","DIU",null,null,""]
[null,null,null,"\nForklaring: Udløbsdatoen, eksklusive forlængelse for it-systemets primære kontrakt.",null,null,null,null,null,null,null,"Man kan kun vælge én svarmulighed.",null,null,null,{"$f":"IF(C189<>\"\",MAX($P$10:P188)+1,\"\")","v":""},4,"Nej",null,null,null,null,""]
[null,null,null,null,null,null,null,null,null,null,null,null,null,null,null,{"$f":"IF(C190<>\"\",MAX($P$10:P189)+1,\"\")","v":""},4,{"$f":"IF(AND($P$398=\"Outsourcet\",Q190<=$L$34,\"- vælg i dropdown -\"<>$L$34,L188=\"1. Dato (indsæt dato i næste felt)\"),\"Ja\",\"Nej\")","v":"Nej"},null,null,null,null,""]
[null,null,"x",null,null,null,null,null,null,null,null,"[Indsæt dato]",{"$f":"(IF(OR(L191=S191,AND(ISNUMBER(L191)=TRUE,L191>29220,L191<55154)),\"\", \"FEJL\"))","v":""},null,null,{"$f":"IF(C191<>\"\",MAX($P$10:P190)+1,\"\")","v":48},4,{"$f":"IF(AND($P$398=\"Outsourcet\",Q191<=$L$34,\"- vælg i dropdown -\"<>$L$34,L188=\"1. Dato (indsæt dato i næste felt)\"),\"Ja\",\"Nej\")","v":"Nej"},"[Indsæt dato]",null,null,null,""]
[null,null,null,null,null,null,null,null,null,null,null,"Indsæt dato i format DD-MM-ÅÅÅÅ (fx 01-01-2020).",null,null,null,{"$f":"IF(C192<>\"\",MAX($P$10:P191)+1,\"\")","v":""},4,{"$f":"IF(AND($P$398=\"Outsourcet\",Q192<=$L$34,\"- vælg i dropdown -\"<>$L$34,L188=\"1. Dato (indsæt dato i næste felt)\"),\"Ja\",\"Nej\")","v":"Nej"},null,null,null,null,""]
[null,null,null,{"$f":"IF(M191=\"Fejl\",\"Myndigheden bør sikre sig, at datoen ligger mellem 31-12-1979 og 01-01-2051, og at der er indtastet en gyldig dato.\"&\" Eksempelvis vil indtastninger som 32-02-2021 blive markeret som fejl. Endvidere bør myndigheden sikre sig, at datoformatet, som vist ovenfor, overholdes.\",\"\")","v":""},null,null,null,null,null,null,null,null,null,null,null,{"$f":"IF(C193<>\"\",MAX($P$10:P192)+1,\"\")","v":""},4,{"$f":"IF(AND($P$398=\"Outsourcet\",Q193<=$L$34,\"- vælg i dropdown -\"<>$L$34),\"Ja\",\"Nej\")","v":"Nej"},null,null,null,null,""]
[null,null,null,null,null,null,null,null,null,null,null,null,null,null,null,{"$f":"IF(C194<>\"\",MAX($P$10:P193)+1,\"\")","v":""},4,{"$f":"IF(AND($P$398=\"Outsourcet\",Q194<=$L$34,\"- vælg i dropdown -\"<>$L$34),\"Ja\",\"Nej\")","v":"Nej"},null,null,null,null,""]
[null,null,"Spm.7.4","Hvor mange forlængelsesmåneder giver kontrakten maksimalt mulighed for?",null,null,null,null,null,null,null,"[Indsæt antal måneder]",{"$f":"IF(AND(ISNUMBER(L195)=FALSE,L195<>$S195,L195<>\"\"),\"FEJL\",\"\")","v":""},null,null,{"$f":"IF(C195<>\"\",MAX($P$10:P194)+1,\"\")","v":49},4,{"$f":"IF(AND($P$398=\"Outsourcet\",Q195<=$L$34,\"- vælg i dropdown -\"<>$L$34,L188=\"1. Dato (indsæt dato i næste felt)\"),\"Ja\",\"Nej\")","v":"Nej"},"[Indsæt antal måneder]",null,null,null,""]
[null,null,null,null,null,null,null,null,null,null,null,"Indsæt antal måneder.",null,null,null,{"$f":"IF(C196<>\"\",MAX($P$10:P195)+1,\"\")","v":""},4,{"$f":"IF(AND($P$398=\"Outsourcet\",Q196<=$L$34,\"- vælg i dropdown -\"<>$L$34,L188=\"1. Dato (indsæt dato i næste felt)\"),\"Ja\",\"Nej\")","v":"Nej"},null,null,null,null,""]
[null,null,null,"Forklaring: Forlængelsesmåneder for it-systemets primære kontrakt.",null,null,null,null,null,null,null,null,null,null,null,{"$f":"IF(C197<>\"\",MAX($P$10:P196)+1,\"\")","v":""},4,{"$f":"IF(AND($P$398=\"Outsourcet\",Q197<=$L$34,\"- vælg i dropdown -\"<>$L$34,L188=\"1. Dato (indsæt dato i næste felt)\"),\"Ja\",\"Nej\")","v":"Nej"},null,null,null,null,""]
[null,null,"Spm.7.4","Dette spørgsmål er kun relevant, hvis det foregående spørgsmål er besvaret med '1. Dato (indsæt dato i næste felt)'.",null,null,null,null,null,null,null,null,null,null,null,null,4,{"$f":"IF(AND($P$398=\"Outsourcet\",Q198<=$L$34,\"- vælg i dropdown -\"<>$L$34,OR(L188=\"2. Ingen udløbsdato\",L188=\"3. Ved ikke\",L188=S188)),\"Ja\",\"Nej\")","v":"Nej"},null,null,null,null,""]
[null,null,null,null,null,null,null,null,null,null,null,null,null,null,null,{"$f":"IF(C199<>\"\",MAX($P$10:P197)+1,\"\")","v":""},4,{"$f":"IF(AND($P$398=\"Outsourcet\",Q199<=$L$34,\"- vælg i dropdown -\"<>$L$34),\"Ja\",\"Nej\")","v":"Nej"},null,null,null,null,""]
[null,null,null,null,null,null,null,null,null,null,null,null,null,null,null,{"$f":"IF(C200<>\"\",MAX($P$10:P199)+1,\"\")","v":""},4,{"$f":"IF(AND($P$398=\"Outsourcet\",Q200<=$L$34,\"- vælg i dropdown -\"<>$L$34),\"Ja\",\"Nej\")","v":"Nej"},null,null,null,null,""]
[null,null,"Spm.8.4","Hvornår er it-systemets transition til en eventuel ny leverandør planlagt afsluttet?",null,null,null,null,null,null,null," - vælg i dropdown -",{"$f":"IF(AND(ISERROR(MATCH(L201,INDIRECT(T201),0))=TRUE,L201<>\"\"),\"FEJL\",\"\")","v":""},null,null,{"$f":"IF(C201<>\"\",MAX($P$10:P200)+1,\"\")","v":50},4,{"$f":"IF(AND($P$398=\"Outsourcet\",Q201<=$L$34,\"- vælg i dropdown -\"<>$L$34),\"Ja\",\"Nej\")","v":"Nej"}," - vælg i dropdown -","DIP",null,null,""]
[null,null,null,"\nForklaring: Dato for afsluttet transition til en eventuel ny leverandør efter udbud af it-systemet.",null,null,null,null,null,null,null,"Man kan kun vælge én svarmulighed.",null,null,null,{"$f":"IF(C202<>\"\",MAX($P$10:P201)+1,\"\")","v":""},4,{"$f":"IF(AND($P$398=\"Outsourcet\",Q202<=$L$34,\"- vælg i dropdown -\"<>$L$34),\"Ja\",\"Nej\")","v":"Nej"},null,null,null,null,""]
[null,null,null,null,null,null,null,null,null,null,null,null,null,null,null,{"$f":"IF(C203<>\"\",MAX($P$10:P202)+1,\"\")","v":""},4,{"$f":"IF(AND($P$398=\"Outsourcet\",Q203<=$L$34,\"- vælg i dropdown -\"<>$L$34,L201=\"1. Dato (indsæt dato i næste felt)\"),\"Ja\",\"Nej\")","v":"Nej"},null,null,null,null,""]
[null,null,"x",null,null,null,null,null,null,null,null,"[Indsæt dato]",{"$f":"(IF(OR(L204=S204,AND(ISNUMBER(L204)=TRUE,L204>29220,L204<55154)),\"\", \"FEJL\"))","v":""},null,null,{"$f":"IF(C204<>\"\",MAX($P$10:P203)+1,\"\")","v":51},4,{"$f":"IF(AND($P$398=\"Outsourcet\",Q204<=$L$34,\"- vælg i dropdown -\"<>$L$34,L201=\"1. Dato (indsæt dato i næste felt)\"),\"Ja\",\"Nej\")","v":"Nej"},"[Indsæt dato]",null,null,null,""]
[null,null,null,null,null,null,null,null,null,null,null,"Indsæt dato i format DD-MM-ÅÅÅÅ (fx 01-01-2020).",null,null,null,{"$f":"IF(C205<>\"\",MAX($P$10:P204)+1,\"\")","v":""},4,{"$f":"IF(AND($P$398=\"Outsourcet\",Q205<=$L$34,\"- vælg i dropdown -\"<>$L$34,L201=\"1. Dato (indsæt dato i næste felt)\"),\"Ja\",\"Nej\")","v":"Nej"},null,null,null,null,""]
[null,null,null,{"$f":"IF(M204=\"Fejl\",\"Myndigheden bør sikre sig, at datoen ligger mellem 31-12-1979 og 01-01-2051, og at der er indtastet en gyldig dato.\"&\" Eksempelvis vil indtastninger som 32-02-2021 blive markeret som fejl. Endvidere bør myndigheden sikre sig, at datoformatet, som vist ovenfor, overholdes.\",\"\")","v":""},null,null,null,null,null,null,null,null,null,null,null,{"$f":"IF(C206<>\"\",MAX($P$10:P205)+1,\"\")","v":""},4,{"$f":"IF(AND($P$398=\"Outsourcet\",Q206<=$L$34,\"- vælg i dropdown -\"<>$L$34),\"Ja\",\"Nej\")","v":"Nej"},null,null,null,null,""]
[null,null,null,null,null,null,null,null,null,null,null,null,null,null,null,{"$f":"IF(C207<>\"\",MAX($P$10:P206)+1,\"\")","v":""},4,"Nej",null,null,null,null,""]
[null,null,"Spm.9.4","Er alle væsentlige kontraktdokumenter med videre for it-systemet optaget i et kontraktbibliotek?",null,null,null,null,null,null,null," - vælg i dropdown -",{"$f":"IF(AND(ISERROR(MATCH(L208,INDIRECT(T208),0))=TRUE,L208<>\"\"),\"FEJL\",\"\")","v":""},null,null,{"$f":"IF(C208<>\"\",MAX($P$10:P207)+1,\"\")","v":52},4,"Nej"," - vælg i dropdown -","JNVI",null,null,""]
[null,null,null,null,null,null,null,null,null,null,null,"Man kan kun vælge én svarmulighed.",null,null,null,{"$f":"IF(C209<>\"\",MAX($P$10:P208)+1,\"\")","v":""},4,"Nej",null,null,null,null,""]
[null,null,null,"Forklaring: Myndighedens kontraktbibliotek indeholder en samlet oversigt over alle væsentlige kontraktdokumenter for it-systemet, herunder tillæg, allonger, aftaler om ændring af priser, bilag mv.",null,null,null,null,null,null,null,null,null,null,null,{"$f":"IF(C210<>\"\",MAX($P$10:P209)+1,\"\")","v":""},4,"Nej",null,null,null,null,""]
[null,null,null,null,null,null,null,null,null,null,null,null,null,null,null,{"$f":"IF(C211<>\"\",MAX($P$10:P210)+1,\"\")","v":""},4,"Nej",null,null,null,null,{"$f":"IF(OR(P211=\"\",R211=\"Nej\"),\"\",IF(OR(M211=\"Fejl\",L211=S211,L211=\"\"),\"Ubesvaret\",\"Besvaret\"))","v":""}]
[null,null,null,null,null,null,null,null,null,null,null,null,null,null,null,{"$f":"IF(C212<>\"\",MAX($P$10:P211)+1,\"\")","v":""},4,"Nej",null,null,null,null,""]
[null,null,"Spm.10.4","Følges faste procedurer for økonomisk controlling imod kontrakt og leverede ydelser?",null,null,null,null,null,null,null," - vælg i dropdown -",{"$f":"IF(AND(ISERROR(MATCH(L213,INDIRECT(T213),0))=TRUE,L213<>\"\"),\"FEJL\",\"\")","v":""},null,null,{"$f":"IF(C213<>\"\",MAX($P$10:P212)+1,\"\")","v":53},4,"Nej"," - vælg i dropdown -","JNVI",null,null,""]
[null,null,null,null,null,null,null,null,null,null,null,"Man kan kun vælge én svarmulighed.",null,null,null,{"$f":"IF(C214<>\"\",MAX($P$10:P213)+1,\"\")","v":""},4,"Nej",null,null,null,null,""]
[null,null,null,"Forklaring: Følges der procedurer for løbende stikprøvemålinger af fakturaer for at se, om de stemmer overens med kontrakten og de leverede ydelser, og er der i henhold til disse procedurer eksempelvis foretaget gennemgang af det seneste års fakturaer mod kontrakten og de leverede ydelser, så skal der svares 'ja'. Hvis dette ikke er tilfældet, skal der svares 'nej'.",null,null,null,null,null,null,null,null,null,null,null,{"$f":"IF(C215<>\"\",MAX($P$10:P214)+1,\"\")","v":""},4,"Nej",null,null,null,null,""]
[null,null,null,null,null,null,null,null,null,null,null,null,null,null,null,{"$f":"IF(C216<>\"\",MAX($P$10:P215)+1,\"\")","v":""},4,"Nej",null,null,null,null,""]
[null,null,null,null,null,null,null,null,null,null,null,null,null,null,null,{"$f":"IF(C217<>\"\",MAX($P$10:P216)+1,\"\")","v":""},5,"Nej",null,null,null,null,""]
[null,null,null,{"$f":"CONCATENATE(\"Leverandør 5 - \"&L40)","v":"Leverandør 5 - [Tekstfelt]"},null,null,null,null,null,null,null,null,null,null,null,{"$f":"IF(C218<>\"\",MAX($P$10:P217)+1,\"\")","v":""},5,"Nej",null,null,null,null,""]
[null,null,null,null,null,null,null,null,null,null,null,null,null,null,null,{"$f":"IF(C219<>\"\",MAX($P$10:P218)+1,\"\")","v":""},5,"Nej",null,null,null,null,""]
[null,null,"Spm.5.5","Hvor tilfredsstillende er myndighedens kontraktstyring af it-systemets kontraktdokumenter i dag?\n",null,null,null,null,null,null,null," - vælg i dropdown -",{"$f":"IF(AND(ISERROR(MATCH(L220,INDIRECT(T220),0))=TRUE,L220<>\"\"),\"FEJL\",\"\")","v":""},null,null,{"$f":"IF(C220<>\"\",MAX($P$10:P219)+1,\"\")","v":54},5,"Nej"," - vælg i dropdown -","TLFRDS",null,null,""]
[null,null,null,null,null,null,null,null,null,null,null,"Man kan kun vælge én svarmulighed.",null,null,null,{"$f":"IF(C221<>\"\",MAX($P$10:P220)+1,\"\")","v":""},5,"Nej",null,null,null,null,""]
[null,null,null,"Forklaring: Vurderingen af myndighedens kontraktstyring baseres på opfyldelse af følgende punkter for kontrakten:\nA. Hovedkontrakt, stamdata tillæg med videre er placeret i et tilgængeligt og opdateret bibliotek.\nB. Der vedligeholdes en kontraktkalender, som understøtter den kontraktansvarlige medarbejders styring af kontraktuelle forpligtelser og rettigheder.\nC. Der gennemføres struktureret modtagelse af leverancer, som sammenholdes med fakturaer inden betaling.\nD. Der er etableret mekanismer, som sikrer, at udbud påbegyndes rettidigt i forhold til at gennemføre transition til en eventuel ny leverandør inden kontraktudløb.\n",null,null,null,null,null,null,null,null,null,null,null,{"$f":"IF(C222<>\"\",MAX($P$10:P221)+1,\"\")","v":""},5,"Nej",null,null,null,null,""]
[null,null,null,"1. Meget utilfredsstillende svares, når ingen af ovenstående punkter opfyldes for kontrakten.\n2. Utilfredsstillende svares, når op til tre af ovenstående punkter opfyldes for kontrakten.\n3. Tilfredsstillende svares, når alle fire punkter opfyldes med en procesmodenhed, der svarer til en udokumenteret ad hoc-proces.\n4. Meget tilfredsstillende svares, når alle fire punkter opfyldes med en procesmodenhed, der svarer til en dokumenteret proces, som gentages ensartet og periodisk, eksempelvis gennem anvendelse af de kontrakt- og leverandørstyringsværktøjer, der er stillet til rådighed.\n5. Særdeles tilfredsstillende svares, når alle fire punkter opfyldes med en høj modenhed og gennem anvendelse af specialiserede kontraktstyringsværktøjer.",null,null,null,null,null,null,null,null,null,null,null,{"$f":"IF(C223<>\"\",MAX($P$10:P222)+1,\"\")","v":""},5,"Nej",null,null,null,null,""]
[null,null,null,null,null,null,null,null,null,null,null,null,null,null,null,{"$f":"IF(C224<>\"\",MAX($P$10:P223)+1,\"\")","v":""},5,"Nej",null,null,null,null,""]
[null,null,"Spm.6.5","Hvad er udløbsdatoen for kontrakten eksklusive forlængelsesperioden?",null,null,null,null,null,null,null," - vælg i dropdown -",{"$f":"IF(AND(ISERROR(MATCH(L225,INDIRECT(T225),0))=TRUE,L225<>\"\"),\"FEJL\",\"\")","v":""},null,null,{"$f":"IF(C225<>\"\",MAX($P$10:P224)+1,\"\")","v":55},5,"Nej"," - vælg i dropdown -","DIU",null,null,""]
[null,null,null,"\nForklaring: Udløbsdatoen, eksklusive forlængelse for it-systemets primære kontrakt.",null,null,null,null,null,null,null,"Man kan kun vælge én svarmulighed.",null,null,null,{"$f":"IF(C226<>\"\",MAX($P$10:P225)+1,\"\")","v":""},5,"Nej",null,null,null,null,""]
[null,null,null,null,null,null,null,null,null,null,null,null,null,null,null,{"$f":"IF(C227<>\"\",MAX($P$10:P226)+1,\"\")","v":""},5,{"$f":"IF(AND($P$398=\"Outsourcet\",Q227<=$L$34,\"- vælg i dropdown -\"<>$L$34,L225=\"1. Dato (indsæt dato i næste felt)\"),\"Ja\",\"Nej\")","v":"Nej"},null,null,null,null,""]
[null,null,"x",null,null,null,null,null,null,null,null,"[Indsæt dato]",{"$f":"(IF(OR(L228=S228,AND(ISNUMBER(L228)=TRUE,L228>29220,L228<55154)),\"\", \"FEJL\"))","v":""},null,null,{"$f":"IF(C228<>\"\",MAX($P$10:P227)+1,\"\")","v":56},5,{"$f":"IF(AND($P$398=\"Outsourcet\",Q228<=$L$34,\"- vælg i dropdown -\"<>$L$34,L225=\"1. Dato (indsæt dato i næste felt)\"),\"Ja\",\"Nej\")","v":"Nej"},"[Indsæt dato]",null,null,null,""]
[null,null,null,null,null,null,null,null,null,null,null,"Indsæt dato i format DD-MM-ÅÅÅÅ (fx 01-01-2020).",null,null,null,{"$f":"IF(C229<>\"\",MAX($P$10:P228)+1,\"\")","v":""},5,{"$f":"IF(AND($P$398=\"Outsourcet\",Q229<=$L$34,\"- vælg i dropdown -\"<>$L$34,L225=\"1. Dato (indsæt dato i næste felt)\"),\"Ja\",\"Nej\")","v":"Nej"},null,null,null,null,""]
[null,null,null,{"$f":"IF(M228=\"Fejl\",\"Myndigheden bør sikre sig, at datoen ligger mellem 31-12-1979 og 01-01-2051, og at der er indtastet en gyldig dato.\"&\" Eksempelvis vil indtastninger som 32-02-2021 blive markeret som fejl. Endvidere bør myndigheden sikre sig, at datoformatet, som vist ovenfor, overholdes.\",\"\")","v":""},null,null,null,null,null,null,null,null,null,null,null,{"$f":"IF(C230<>\"\",MAX($P$10:P229)+1,\"\")","v":""},5,{"$f":"IF(AND($P$398=\"Outsourcet\",Q230<=$L$34,\"- vælg i dropdown -\"<>$L$34),\"Ja\",\"Nej\")","v":"Nej"},null,null,null,null,""]
[null,null,null,null,null,null,null,null,null,null,null,null,null,null,null,{"$f":"IF(C231<>\"\",MAX($P$10:P230)+1,\"\")","v":""},5,{"$f":"IF(AND($P$398=\"Outsourcet\",Q231<=$L$34,\"- vælg i dropdown -\"<>$L$34),\"Ja\",\"Nej\")","v":"Nej"},null,null,null,null,""]
[null,null,"Spm.7.5","Hvor mange forlængelsesmåneder giver kontrakten maksimalt mulighed for?",null,null,null,null,null,null,null,"[Indsæt antal måneder]",{"$f":"IF(AND(ISNUMBER(L232)=FALSE,L232<>$S232,L232<>\"\"),\"FEJL\",\"\")","v":""},null,null,{"$f":"IF(C232<>\"\",MAX($P$10:P231)+1,\"\")","v":57},5,{"$f":"IF(AND($P$398=\"Outsourcet\",Q232<=$L$34,\"- vælg i dropdown -\"<>$L$34,L225=\"1. Dato (indsæt dato i næste felt)\"),\"Ja\",\"Nej\")","v":"Nej"},"[Indsæt antal måneder]",null,null,null,""]
[null,null,null,null,null,null,null,null,null,null,null,"Indsæt antal måneder.",null,null,null,{"$f":"IF(C233<>\"\",MAX($P$10:P232)+1,\"\")","v":""},5,{"$f":"IF(AND($P$398=\"Outsourcet\",Q233<=$L$34,\"- vælg i dropdown -\"<>$L$34,L225=\"1. Dato (indsæt dato i næste felt)\"),\"Ja\",\"Nej\")","v":"Nej"},null,null,null,null,""]
[null,null,null,"Forklaring: Forlængelsesmåneder for it-systemets primære kontrakt.",null,null,null,null,null,null,null,null,null,null,null,{"$f":"IF(C234<>\"\",MAX($P$10:P233)+1,\"\")","v":""},5,{"$f":"IF(AND($P$398=\"Outsourcet\",Q234<=$L$34,\"- vælg i dropdown -\"<>$L$34,L225=\"1. Dato (indsæt dato i næste felt)\"),\"Ja\",\"Nej\")","v":"Nej"},null,null,null,null,{"$f":"IF(OR(P234=\"\",R234=\"Nej\"),\"\",IF(OR(M234=\"Fejl\",L234=S234,L234=\"\"),\"Ubesvaret\",\"Besvaret\"))","v":""}]
[null,null,"Spm.7.5","Dette spørgsmål er kun relevant, hvis det foregående spørgsmål er besvaret med '1. Dato (indsæt dato i næste felt)'.",null,null,null,null,null,null,null,null,null,null,null,null,5,{"$f":"IF(AND($P$398=\"Outsourcet\",Q235<=$L$34,\"- vælg i dropdown -\"<>$L$34,OR(L225=\"2. Ingen udløbsdato\",L225=\"3. Ved ikke\",L225=S225)),\"Ja\",\"Nej\")","v":"Nej"},null,null,null,null,{"$f":"IF(OR(P235=\"\",R235=\"Nej\"),\"\",IF(OR(M235=\"Fejl\",L235=S235,L235=\"\"),\"Ubesvaret\",\"Besvaret\"))","v":""}]
[null,null,null,null,null,null,null,null,null,null,null,null,null,null,null,{"$f":"IF(C236<>\"\",MAX($P$10:P235)+1,\"\")","v":""},5,{"$f":"IF(AND($P$398=\"Outsourcet\",Q236<=$L$34,\"- vælg i dropdown -\"<>$L$34),\"Ja\",\"Nej\")","v":"Nej"},null,null,null,null,""]
[null,null,null,null,null,null,null,null,null,null,null,null,null,null,null,{"$f":"IF(C237<>\"\",MAX($P$10:P236)+1,\"\")","v":""},5,{"$f":"IF(AND($P$398=\"Outsourcet\",Q237<=$L$34,\"- vælg i dropdown -\"<>$L$34),\"Ja\",\"Nej\")","v":"Nej"},null,null,null,null,""]
[null,null,"Spm.8.5","Hvornår er it-systemets transition til en eventuel ny leverandør planlagt afsluttet?",null,null,null,null,null,null,null," - vælg i dropdown -",{"$f":"IF(AND(ISERROR(MATCH(L238,INDIRECT(T238),0))=TRUE,L238<>\"\"),\"FEJL\",\"\")","v":""},null,null,{"$f":"IF(C238<>\"\",MAX($P$10:P237)+1,\"\")","v":58},5,{"$f":"IF(AND($P$398=\"Outsourcet\",Q238<=$L$34,\"- vælg i dropdown -\"<>$L$34),\"Ja\",\"Nej\")","v":"Nej"}," - vælg i dropdown -","DIP",null,null,""]
[null,null,null,"\nForklaring: Dato for afsluttet transition til en eventuel ny leverandør efter udbud af it-systemet.",null,null,null,null,null,null,null,"Man kan kun vælge én svarmulighed.",null,null,null,{"$f":"IF(C239<>\"\",MAX($P$10:P238)+1,\"\")","v":""},5,{"$f":"IF(AND($P$398=\"Outsourcet\",Q239<=$L$34,\"- vælg i dropdown -\"<>$L$34),\"Ja\",\"Nej\")","v":"Nej"},null,null,null,null,""]
[null,null,null,null,null,null,null,null,null,null,null,null,null,null,null,{"$f":"IF(C240<>\"\",MAX($P$10:P239)+1,\"\")","v":""},5,{"$f":"IF(AND($P$398=\"Outsourcet\",Q240<=$L$34,\"- vælg i dropdown -\"<>$L$34,L238=\"1. Dato (indsæt dato i næste felt)\"),\"Ja\",\"Nej\")","v":"Nej"},null,null,null,null,""]
[null,null,"x",null,null,null,null,null,null,null,null,"[Indsæt dato]",{"$f":"(IF(OR(L241=S241,AND(ISNUMBER(L241)=TRUE,L241>29220,L241<55154)),\"\", \"FEJL\"))","v":""},null,null,{"$f":"IF(C241<>\"\",MAX($P$10:P240)+1,\"\")","v":59},5,{"$f":"IF(AND($P$398=\"Outsourcet\",Q241<=$L$34,\"- vælg i dropdown -\"<>$L$34,L238=\"1. Dato (indsæt dato i næste felt)\"),\"Ja\",\"Nej\")","v":"Nej"},"[Indsæt dato]",null,null,null,""]
[null,null,null,null,null,null,null,null,null,null,null,"Indsæt dato i format DD-MM-ÅÅÅÅ (fx 01-01-2020).",null,null,null,{"$f":"IF(C242<>\"\",MAX($P$10:P241)+1,\"\")","v":""},5,{"$f":"IF(AND($P$398=\"Outsourcet\",Q242<=$L$34,\"- vælg i dropdown -\"<>$L$34,L238=\"1. Dato (indsæt dato i næste felt)\"),\"Ja\",\"Nej\")","v":"Nej"},null,null,null,null,""]
[null,null,null,{"$f":"IF(M241=\"Fejl\",\"Myndigheden bør sikre sig, at datoen ligger mellem 31-12-1979 og 01-01-2051, og at der er indtastet en gyldig dato.\"&\" Eksempelvis vil indtastninger som 32-02-2021 blive markeret som fejl. Endvidere bør myndigheden sikre sig, at datoformatet, som vist ovenfor, overholdes.\",\"\")","v":""},null,null,null,null,null,null,null,null,null,null,null,{"$f":"IF(C243<>\"\",MAX($P$10:P242)+1,\"\")","v":""},5,{"$f":"IF(AND($P$398=\"Outsourcet\",Q243<=$L$34,\"- vælg i dropdown -\"<>$L$34),\"Ja\",\"Nej\")","v":"Nej"},null,null,null,null,""]
[null,null,null,null,null,null,null,null,null,null,null,null,null,null,null,{"$f":"IF(C244<>\"\",MAX($P$10:P243)+1,\"\")","v":""},5,"Nej",null,null,null,null,""]
[null,null,"Spm.9.5","Er alle væsentlige kontraktdokumenter med videre for it-systemet optaget i et kontraktbibliotek?",null,null,null,null,null,null,null," - vælg i dropdown -",{"$f":"IF(AND(ISERROR(MATCH(L245,INDIRECT(T245),0))=TRUE,L245<>\"\"),\"FEJL\",\"\")","v":""},null,null,{"$f":"IF(C245<>\"\",MAX($P$10:P244)+1,\"\")","v":60},5,"Nej"," - vælg i dropdown -","JNVI",null,null,""]
[null,null,null,null,null,null,null,null,null,null,null,"Man kan kun vælge én svarmulighed.",null,null,null,{"$f":"IF(C246<>\"\",MAX($P$10:P245)+1,\"\")","v":""},5,"Nej",null,null,null,null,""]
[null,null,null,"Forklaring: Myndighedens kontraktbibliotek indeholder en samlet oversigt over alle væsentlige kontraktdokumenter for it-systemet, herunder tillæg, allonger, aftaler om ændring af priser, bilag mv.",null,null,null,null,null,null,null,null,null,null,null,{"$f":"IF(C247<>\"\",MAX($P$10:P246)+1,\"\")","v":""},5,"Nej",null,null,null,null,""]
[null,null,null,null,null,null,null,null,null,null,null,null,null,null,null,{"$f":"IF(C248<>\"\",MAX($P$10:P247)+1,\"\")","v":""},5,"Nej",null,null,null,null,""]
[null,null,null,null,null,null,null,null,null,null,null,null,null,null,null,{"$f":"IF(C249<>\"\",MAX($P$10:P248)+1,\"\")","v":""},5,"Nej",null,null,null,null,""]
[null,null,"Spm.10.5","Følges faste procedurer for økonomisk controlling imod kontrakt og leverede ydelser?",null,null,null,null,null,null,null," - vælg i dropdown -",{"$f":"IF(AND(ISERROR(MATCH(L250,INDIRECT(T250),0))=TRUE,L250<>\"\"),\"FEJL\",\"\")","v":""},null,null,{"$f":"IF(C250<>\"\",MAX($P$10:P249)+1,\"\")","v":61},5,"Nej"," - vælg i dropdown -","JNVI",null,null,""]
[null,null,null,null,null,null,null,null,null,null,null,"Man kan kun vælge én svarmulighed.",null,null,null,{"$f":"IF(C251<>\"\",MAX($P$10:P250)+1,\"\")","v":""},5,"Nej",null,null,null,null,""]
[null,null,null,"Forklaring: Følges der procedurer for løbende stikprøvemålinger af fakturaer for at se, om de stemmer overens med kontrakten og de leverede ydelser, og er der i henhold til disse procedurer eksempelvis foretaget gennemgang af det seneste års fakturaer mod kontrakten og de leverede ydelser, så skal der svares 'ja'. Hvis dette ikke er tilfældet, skal der svares 'nej'.",null,null,null,null,null,null,null,null,null,null,null,{"$f":"IF(C252<>\"\",MAX($P$10:P251)+1,\"\")","v":""},5,"Nej",null,null,null,null,""]
[null,null,null,null,null,null,null,null,null,null,null,null,null,null,null,{"$f":"IF(C253<>\"\",MAX($P$10:P252)+1,\"\")","v":""},5,"Nej",null,null,null,null,""]
[null,null,null,null,null,null,null,null,null,null,null,null,null,null,null,{"$f":"IF(C254<>\"\",MAX($P$10:P253)+1,\"\")","v":""},null,"END",null,null,null,null,""]
[null,null,null,"It-systemets tekniske tilstand",null,null,null,null,null,null,null,null,null,null,null,{"$f":"IF(C255<>\"\",MAX($P$10:P254)+1,\"\")","v":""},null,null,null,null,"Kommentarer",null,""]
[null,null,null,null,null,null,null,null,null,null,null,null,null,null,null,{"$f":"IF(C256<>\"\",MAX($P$10:P255)+1,\"\")","v":""},null,null,null,null,null,null,""]
[null,null,null,null,null,null,null,null,null,null,null,null,null,null,null,null,null,null,null,null,null,null,""]
[null,null,null,null,null,null,null,null,null,null,null,null,null,null,null,{"$f":"IF(C258<>\"\",MAX($P$10:P257)+1,\"\")","v":""},null,null,null,null,null,null,""]
[null,null,null,null,null,null,null,null,null,null,null,null,null,null,null,{"$f":"IF(C259<>\"\",MAX($P$10:P258)+1,\"\")","v":""},null,null,null,null,null,null,""]
[null,null,"Spm.11","Hvor tilfredsstillende er it-systemets tekniske tilstand i dag?\n",null,null,null,null,null,null,null," - vælg i dropdown -",{"$f":"IF(AND(ISERROR(MATCH(L260,INDIRECT(T260),0))=TRUE,L260<>\"\"),\"FEJL\",\"\")","v":""},null,null,{"$f":"IF(C260<>\"\",MAX($P$10:P259)+1,\"\")","v":62},null,null," - vælg i dropdown -","TLFRDS",null,null,"Ubesvaret"]
[null,null,null,null,null,null,null,null,null,null,null,"Man kan kun vælge én svarmulighed.",null,null,null,{"$f":"IF(C261<>\"\",MAX($P$10:P260)+1,\"\")","v":""},null,null,null,null,null,null,""]
[null,null,null,"Forklaring: Besvarelsen af spørgsmålet bør omfatte overvejelser omkring følgende faktorer:\n• Teknisk gæld\n• Muligheden for at videreudvikle og integrere it-systemet\n• Anvendte programmeringssprog\n• Skaleringsmuligheder og -udfordringer.\n\n1. Meget utilfredsstillende svares, når der er betydelige mangler i systemets tekniske tilstand i forhold til tre eller fire faktorer.\n2. Utilfredsstillende svares, når der er betydelige mangler i systemets tekniske tilstand i forhold til en eller to faktorer.\n3. Tilfredsstillende svares, når der ikke vurderes at være betydelige mangler i systemets tekniske tilstand for nogle af de fire faktorer.\n4. Meget tilfredsstillende svares, når der ikke er mangler i systemets tekniske tilstand, og systemet herudover vurderes at have en teknisk tilstand, som for minimum to af faktorerne forventes at sikre god teknisk fremtidssikring.\n5. Særdeles tilfredsstillende svares, når der ikke er mangler i systemets tekniske tilstand, og når systemet for alle fire faktorer forventes at sikre betydelig teknisk fremtidssikring.\n",null,null,null,null,null,null,null,null,null,null,null,{"$f":"IF(C262<>\"\",MAX($P$10:P261)+1,\"\")","v":""},null,null,null,null,null,null,""]
[null,null,null,null,null,null,null,null,null,null,null,null,null,null,null,{"$f":"IF(C263<>\"\",MAX($P$10:P262)+1,\"\")","v":""},null,null,null,null,null,null,""]
[null,null,null,null,null,null,null,null,null,null,null,null,null,null,null,{"$f":"IF(C264<>\"\",MAX($P$10:P263)+1,\"\")","v":""},null,null,null,null,null,null,""]
[null,null,"Spm.12","Baserer it-systemets teknologiske komponenter sig primært på versioner, som forventes vedligeholdt af et leverandørmarked fremadrettet?",null,null,null,null,null,null,null," - vælg i dropdown -",{"$f":"IF(AND(ISERROR(MATCH(L265,INDIRECT(T265),0))=TRUE,L265<>\"\"),\"FEJL\",\"\")","v":""},null,null,{"$f":"IF(C265<>\"\",MAX($P$10:P264)+1,\"\")","v":63},null,null," - vælg i dropdown -","JNVI",null,null,"Ubesvaret"]
[null,null,null,null,null,null,null,null,null,null,null,"Man kan kun vælge én svarmulighed.",null,null,null,{"$f":"IF(C266<>\"\",MAX($P$10:P265)+1,\"\")","v":""},null,null,null,null,null,null,""]
[null,null,null,"Forklaring: Teknologiske komponenter er alle de elementer, som et it-system benytter for at fungere.\n\nHvis myndigheden forventer, at der for samtlige primære indeholdte komponenter er opdateringer, patches og support tilgængelig fra et leverandørmarked de næste to år svares der ’ja’. Er dette ikke tilfældet, svares der 'nej'.\n",null,null,null,null,null,null,null,null,null,null,null,{"$f":"IF(C267<>\"\",MAX($P$10:P266)+1,\"\")","v":""},null,null,null,null,null,null,""]
[null,null,null,null,null,null,null,null,null,null,null,null,null,null,null,{"$f":"IF(C268<>\"\",MAX($P$10:P267)+1,\"\")","v":""},null,null,null,null,null,null,""]
[null,null,null,null,null,null,null,null,null,null,null,null,null,null,null,{"$f":"IF(C269<>\"\",MAX($P$10:P268)+1,\"\")","v":""},null,null,null,null,null,null,""]
[null,null,"Spm.13","Understøtter it-systemet, gennem planlagt vedligehold og videreudvikling, alle væsentlige tiltænkte processer i forretningsgrundlaget i de kommende tre år?\n",null,null,null,null,null,null,null," - vælg i dropdown -",{"$f":"IF(AND(ISERROR(MATCH(L270,INDIRECT(T270),0))=TRUE,L270<>\"\"),\"FEJL\",\"\")","v":""},null,null,{"$f":"IF(C270<>\"\",MAX($P$10:P269)+1,\"\")","v":64},null,null," - vælg i dropdown -","JNVIIR",null,null,"Ubesvaret"]
[null,null,null,null,null,null,null,null,null,null,null,"Man kan kun vælge én svarmulighed.",null,null,null,{"$f":"IF(C271<>\"\",MAX($P$10:P270)+1,\"\")","v":""},null,null,null,null,null,null,""]
[null,null,null,"Forklaring: Hvis det forventes, at it-systemet, gennem planlagt vedligehold og videreudvikling, fortsat kan understøtte væsentlige tiltænkte processer i forretningsgrundlaget om tre år, skal der svares 'ja'. Hvis dette ikke er tilfældet, skal der svares 'nej'.",null,null,null,null,null,null,null,null,null,null,null,{"$f":"IF(C272<>\"\",MAX($P$10:P271)+1,\"\")","v":""},null,null,null,null,null,null,""]
[null,null,null,null,null,null,null,null,null,null,null,null,null,null,null,{"$f":"IF(C273<>\"\",MAX($P$10:P272)+1,\"\")","v":""},null,null,null,null,null,null,""]
[null,null,null,null,null,null,null,null,null,null,null,null,null,null,null,{"$f":"IF(C274<>\"\",MAX($P$10:P273)+1,\"\")","v":""},null,null,null,null,null,null,""]
[null,null,"Spm.14","Er it-systemets primære integrationer baseret på standardadaptere?",null,null,null,null,null,null,null," - vælg i dropdown -",{"$f":"IF(AND(ISERROR(MATCH(L275,INDIRECT(T275),0))=TRUE,L275<>\"\"),\"FEJL\",\"\")","v":""},null,null,{"$f":"IF(C275<>\"\",MAX($P$10:P274)+1,\"\")","v":65},null,null," - vælg i dropdown -","JNVI",null,null,{"$f":"IF(OR(P275=\"\",R275=\"Nej\"),\"\",IF(OR(M275=\"Fejl\",L275=S275,L275=\"\"),\"Ubesvaret\",\"Besvaret\"))","v":"Ubesvaret"}]
[null,null,null,null,null,null,null,null,null,null,null,"Man kan kun vælge én svarmulighed.",null,null,null,{"$f":"IF(C276<>\"\",MAX($P$10:P275)+1,\"\")","v":""},null,null,null,null,null,null,""]
[null,null,null,"Forklaring: Hvis it-systemets primære integrationer er baseret på åbne adaptere, såsom internt udstillede webservices med dækkende specifikation, kan der svares 'ja'. Hvis dette ikke er tilfældet, eller hvis it-systemets primære integrationer eksempelvis er baseret på system-til-system-integrationer, skal der svares 'nej'.",null,null,null,null,null,null,null,null,null,null,null,{"$f":"IF(C277<>\"\",MAX($P$10:P276)+1,\"\")","v":""},null,null,null,null,null,null,""]
[null,null,null,null,null,null,null,null,null,null,null,null,null,null,null,{"$f":"IF(C278<>\"\",MAX($P$10:P277)+1,\"\")","v":""},null,null,null,null,null,null,""]
[null,null,null,null,null,null,null,null,null,null,null,null,null,null,null,{"$f":"IF(C279<>\"\",MAX($P$10:P278)+1,\"\")","v":""},null,null,null,null,null,null,""]
[null,null,"Spm.15","I hvilken grad kan it-systemet skaleres kapacitetsmæssigt i forhold til behov (flere brugere, flere data)?\n",null,null,null,null,null,null,null," - vælg i dropdown -",{"$f":"IF(AND(ISERROR(MATCH(L280,INDIRECT(T280),0))=TRUE,L280<>\"\"),\"FEJL\",\"\")","v":""},null,null,{"$f":"IF(C280<>\"\",MAX($P$10:P279)+1,\"\")","v":66},null,null," - vælg i dropdown -","IVG_2",null,null,"Ubesvaret"]
[null,null,null,null,null,null,null,null,null,null,null,"Man kan kun vælge én svarmulighed.",null,null,null,{"$f":"IF(C281<>\"\",MAX($P$10:P280)+1,\"\")","v":""},null,null,null,null,null,null,""]
[null,null,null,"Forklaring:\n1. I meget lav grad er, når it-systemet ikke kan skaleres kapacitetsmæssigt uden uproportionelle omkostninger.\n2. I mindre grad er, når it-systemet med gennemgribende programmatiske ændringer og udskiftning af standardkomponenter vil kunne skaleres kapacitetsmæssigt. \n3. I nogen grad er, når it-systemet med betydelige programmatiske ændringer vil kunne skaleres kapacitetsmæssigt.\n4. I høj grad er, når it-systemet med simple ændringer (for eksempel en simpel udskiftning af en standardkomponent) vil kunne skaleres kapacitetsmæssigt. \n5. I meget høj grad er, når it-systemet problemfrit kan skaleres. Det vil sige, at det ikke vil kræve strukturelle ændringer (programmatiske ændringer, udskiftninger af standardkomponenter mv.).\n6. Ved ikke anvendes, hvis det ikke er muligt at indhente oplysninger om muligheden for skalering.\n7. Ikke relevant bør kun anvendes, hvis it-systemet ikke fremadrettet forventes, at skulle kunne skalere til at understøtte flere brugere eller flere data end det nuværende niveau.",null,null,null,null,null,null,null,null,null,null,null,{"$f":"IF(C282<>\"\",MAX($P$10:P281)+1,\"\")","v":""},null,null,null,null,null,null,""]
[null,null,null,null,null,null,null,null,null,null,null,null,null,null,null,{"$f":"IF(C283<>\"\",MAX($P$10:P282)+1,\"\")","v":""},null,null,null,null,null,null,""]
[null,null,null,null,null,null,null,null,null,null,null,null,null,null,null,{"$f":"IF(C284<>\"\",MAX($P$10:P283)+1,\"\")","v":""},null,null,null,null,null,null,""]
["\n\n\n\n\n",null,"Spm.16","Hvilke primære programmeringssprog er it-systemet baseret på?\n\n\n\n",null,null,null,null,null,null,null,"[Tekstfelt]",null,null,null,{"$f":"IF(C285<>\"\",MAX($P$10:P284)+1,\"\")","v":67},null,null,"[Tekstfelt]","n/a",null,null,"Ubesvaret"]
[null,null,null,null,null,null,null,null,null,null,null,"Indsæt beskrivelse.",null,null,null,{"$f":"IF(C286<>\"\",MAX($P$10:P285)+1,\"\")","v":""},null,null,null,null,null,null,""]
[null,null,null,"Forklaring: Angiv de primære programmeringssprog, som it-systemets kildekode er baseret på.",null,null,null,null,null,null,null,null,null,null,null,{"$f":"IF(C287<>\"\",MAX($P$10:P286)+1,\"\")","v":""},null,null,null,null,null,null,""]
[null,null,null,null,null,null,null,null,null,null,null,null,null,null,null,{"$f":"IF(C288<>\"\",MAX($P$10:P287)+1,\"\")","v":""},null,null,null,null,null,null,""]
[null,null,null,null,null,null,null,null,null,null,null,null,null,null,null,{"$f":"IF(C289<>\"\",MAX($P$10:P288)+1,\"\")","v":""},null,null,null,null,null,null,""]
[null,null,null,null,null,null,null,null,null,null,null,null,null,null,null,{"$f":"IF(C290<>\"\",MAX($P$10:P289)+1,\"\")","v":""},null,null,null,null,null,null,""]
[null,null,null,"It-systemets dokumentation og viden",null,null,null,null,null,null,null,null,null,null,null,{"$f":"IF(C291<>\"\",MAX($P$10:P290)+1,\"\")","v":""},null,null,null,null,"Kommentarer",null,""]
[null,null,null,null,null,null,null,null,null,null,null,null,null,null,null,null,null,null,null,null,null,null,""]
[null,null,null,null,null,null,null,null,null,null,null,null,null,null,null,null,null,null,null,null,null,null,""]
[null,null,null,null,null,null,null,null,null,null,null,null,null,null,null,null,null,null,null,null,null,null,""]
[null,null,null,null,null,null,null,null,null,null,null,null,null,null,null,{"$f":"IF(C295<>\"\",MAX($P$10:P294)+1,\"\")","v":""},null,null,null,null,null,null,""]
[null,null,"Spm.17","Er dokumentationen i al væsentlighed retvisende for it-systemets nuværende tilstand?",null,null,null,null,null,null,null," - vælg i dropdown -",{"$f":"IF(AND(ISERROR(MATCH(L296,INDIRECT(T296),0))=TRUE,L296<>\"\"),\"FEJL\",\"\")","v":""},null,null,{"$f":"IF(C296<>\"\",MAX($P$10:P295)+1,\"\")","v":68},null,null," - vælg i dropdown -","JNVI",null,null,"Ubesvaret"]
[null,null,null,null,null,null,null,null,null,null,null,"Man kan kun vælge én svarmulighed.",null,null,null,{"$f":"IF(C297<>\"\",MAX($P$10:P296)+1,\"\")","v":""},null,null,null,null,null,null,""]
[null,null,null,"Forklaring: Hvis dokumentationen af it-systemet (herunder it-systemets arkitektur, datagrundlag, datamodel og integrationer) i al væsentlighed er beskrevet og opdateret, skal der svares ‘ja’. Hvis dette ikke er tilfældet, skal der svares 'nej'.",null,null,null,null,null,null,null,null,null,null,null,{"$f":"IF(C298<>\"\",MAX($P$10:P297)+1,\"\")","v":""},null,null,null,null,null,null,""]
[null,null,null,null,null,null,null,null,null,null,null,null,null,null,null,{"$f":"IF(C299<>\"\",MAX($P$10:P298)+1,\"\")","v":""},null,null,null,null,null,null,""]
[null,null,null,null,null,null,null,null,null,null,null,null,null,null,null,{"$f":"IF(C300<>\"\",MAX($P$10:P299)+1,\"\")","v":""},null,null,null,null,null,null,""]
[null,null,"Spm.18","Hvad er myndighedens rettigheder i forhold til hovedkomponenterne i it-systemet?\n\n",null,null,null,null,null,null,null," - vælg i dropdown -",{"$f":"IF(AND(ISERROR(MATCH(L301,INDIRECT(T301),0))=TRUE,L301<>\"\"),\"FEJL\",\"\")","v":""},null,null,{"$f":"IF(C301<>\"\",MAX($P$10:P300)+1,\"\")","v":69},null,null," - vælg i dropdown -","EJ",null,null,"Ubesvaret"]
[null,null,null,null,null,null,null,null,null,null,null,"Man kan kun vælge én svarmulighed.",null,null,null,{"$f":"IF(C302<>\"\",MAX($P$10:P301)+1,\"\")","v":""},null,null,null,null,null,null,""]
[null,null,null,"Forklaring: Myndighedens rettigheder i forhold til hovedkomponenterne i et it-system kan variere i forhold til it-systemets type og aftalte kontraktforhold. \n\n1. Ingen rettigheder vælges, hvis myndigheden ikke har nogen rettigheder til it-systemets kildekode, eksempelvis hvis myndigheden køber sig adgang til it-systemet som en service.\n\n2. Udvidet brugsret vælges for de tilfælde, hvor leverandøren forsat har ophavsretten til den kundespecifikke software, men hvor myndigheden har ret til at få udleveret og anvende kildekoden. Ved udvidet brugsret har leverandøren af it-systemet stadig fuldt ejerskab over kildekoden og kan frit benytte denne i forbindelse med andre it-systemer eller ved markedsføring på andre markeder.\n\n3. Fulde rettigheder vælges, når myndigheden har de fulde rettigheder og ophavsretten til it-systemet.",null,null,null,null,null,null,null,null,null,null,null,{"$f":"IF(C303<>\"\",MAX($P$10:P302)+1,\"\")","v":""},null,null,null,null,null,null,""]
[null,null,null,null,null,null,null,null,null,null,null,null,null,null,null,{"$f":"IF(C304<>\"\",MAX($P$10:P303)+1,\"\")","v":""},null,null,null,null,null,null,""]
[null,null,null,null,null,null,null,null,null,null,null,null,null,null,null,{"$f":"IF(C305<>\"\",MAX($P$10:P304)+1,\"\")","v":""},null,null,null,null,null,null,""]
[null,null,"Spm.19","Hvad er myndighedens rettigheder i forhold til data?\n",null,null,null,null,null,null,null," - vælg i dropdown -",{"$f":"IF(AND(ISERROR(MATCH(L306,INDIRECT(T306),0))=TRUE,L306<>\"\"),\"FEJL\",\"\")","v":""},null,null,{"$f":"IF(C306<>\"\",MAX($P$10:P305)+1,\"\")","v":70},null,null," - vælg i dropdown -","EJ",null,null,"Ubesvaret"]
[null,null,null,null,null,null,null,null,null,null,null,"Man kan kun vælge én svarmulighed.",null,null,null,{"$f":"IF(C307<>\"\",MAX($P$10:P306)+1,\"\")","v":""},null,null,null,null,null,null,""]
[null,null,null,"Forklaring: Myndighedens rettigheder i forhold til data kan variere i forhold til it-systemets type og de aftalte kontraktforhold. \n\n1. Ingen rettigheder vælges, hvis leverandøren har de fulde rettigheder til data i it-systemet.\n\n2. Udvidet brugsret vælges i de tilfælde, hvor leverandøren forsat har ophavsretten til data, men hvor myndigheden har ret til at få data udleveret. Leverandøren har de fulde rettigheder til data og kan anvende disse i andre sammenhænge. \n\n3. Fulde rettigheder vælges, når myndigheden har de fulde rettigheder til data i it-systemet.",null,null,null,null,null,null,null,null,null,null,null,{"$f":"IF(C308<>\"\",MAX($P$10:P307)+1,\"\")","v":""},null,null,null,null,null,null,""]
[null,null,null,null,null,null,null,null,null,null,null,null,null,null,null,{"$f":"IF(C309<>\"\",MAX($P$10:P308)+1,\"\")","v":""},null,null,null,null,null,null,""]
[null,null,null,null,null,null,null,null,null,null,null,null,null,null,null,{"$f":"IF(C310<>\"\",MAX($P$10:P309)+1,\"\")","v":""},null,null,null,null,null,null,""]
[null,null,"Spm.20","Har myndigheden mere end én ressource med teknisk viden om it-systemet?\n\n",null,null,null,null,null,null,null," - vælg i dropdown -",{"$f":"IF(AND(ISERROR(MATCH(L311,INDIRECT(T311),0))=TRUE,L311<>\"\"),\"FEJL\",\"\")","v":""},null,null,{"$f":"IF(C311<>\"\",MAX($P$10:P310)+1,\"\")","v":71},null,null," - vælg i dropdown -","JNVI",null,null,"Ubesvaret"]
[null,null,null,null,null,null,null,null,null,null,null,"Man kan kun vælge én svarmulighed.",null,null,null,{"$f":"IF(C312<>\"\",MAX($P$10:P311)+1,\"\")","v":""},null,null,null,null,null,null,""]
[null,null,null,"Forklaring: En person med teknisk viden om it-systemet har indsigt i it-systemets arkitektur, datagrundlag og integrationerne for it-systemet.\n\nHvis myndigheden har mere end én person med teknisk viden om it-systemet, svares der ’ja’.\n\nHvis der er én eller ingen personer i myndigheden, som har den fornødne tekniske viden om it-systemet, skal der svares ‘nej’.",null,null,null,null,null,null,null,null,null,null,null,{"$f":"IF(C313<>\"\",MAX($P$10:P312)+1,\"\")","v":""},null,null,null,null,null,null,""]
[null,null,null,null,null,null,null,null,null,null,null,null,null,null,null,{"$f":"IF(C314<>\"\",MAX($P$10:P313)+1,\"\")","v":""},null,null,null,null,null,null,""]
[null,null,null,null,null,null,null,null,null,null,null,null,null,null,null,{"$f":"IF(C315<>\"\",MAX($P$10:P314)+1,\"\")","v":""},null,null,null,null,null,null,""]
[null,null,"Spm.21","Er der en opdateret proces for håndtering af nøglepersonsafhængigheder?",null,null,null,null,null,null,null," - vælg i dropdown -",{"$f":"IF(AND(ISERROR(MATCH(L316,INDIRECT(T316),0))=TRUE,L316<>\"\"),\"FEJL\",\"\")","v":""},null,null,{"$f":"IF(C316<>\"\",MAX($P$10:P315)+1,\"\")","v":72},null,null," - vælg i dropdown -","JNVI",null,null,"Ubesvaret"]
[null,null,null,null,null,null,null,null,null,null,null,"Man kan kun vælge én svarmulighed.",null,null,null,{"$f":"IF(C317<>\"\",MAX($P$10:P316)+1,\"\")","v":""},null,null,null,null,null,null,""]
[null,null,null,"Forklaring: En proces for nøglepersonsafhængigheder har til formål proaktivt at beskytte myndigheden fra at komme i situationer, hvor der kun er få eller ingen personer med teknisk viden om it-systemet. \n\nHvis der for it-systemet findes en proces for håndtering af nøglepersonsafhængigheder, og denne er blevet opdateret indenfor det seneste år, skal der svares 'ja'. Hvis dette ikke er tilfældet, skal der svares 'nej'.\n",null,null,null,null,null,null,null,null,null,null,null,{"$f":"IF(C318<>\"\",MAX($P$10:P317)+1,\"\")","v":""},null,null,null,null,null,null,""]
[null,null,null,null,null,null,null,null,null,null,null,null,null,null,null,{"$f":"IF(C319<>\"\",MAX($P$10:P318)+1,\"\")","v":""},null,null,null,null,null,null,""]
[null,null,null,null,null,null,null,null,null,null,null,null,null,null,null,{"$f":"IF(C320<>\"\",MAX($P$10:P319)+1,\"\")","v":""},null,null,null,null,null,null,""]
[null,null,"Spm.22","Er der etableret formelle procedurer for løbende opsamling og overlevering af information for it-systemet?",null,null,null,null,null,null,null," - vælg i dropdown -",{"$f":"IF(AND(ISERROR(MATCH(L321,INDIRECT(T321),0))=TRUE,L321<>\"\"),\"FEJL\",\"\")","v":""},null,null,{"$f":"IF(C321<>\"\",MAX($P$10:P320)+1,\"\")","v":73},null,null," - vælg i dropdown -","JNVI",null,null,"Ubesvaret"]
[null,null,null,null,null,null,null,null,null,null,null,"Man kan kun vælge én svarmulighed.",null,null,null,{"$f":"IF(C322<>\"\",MAX($P$10:P321)+1,\"\")","v":""},null,null,null,null,null,null,""]
[null,null,null,"Forklaring: En procedure for løbende opsamling og overlevering af information, særligt i forhold til it-systemhændelser (incidents), skal sikre, at information om it-systemet er tilgængelig for rette vedkommende, så beslutninger om it-systemet kan træffes på et informativt grundlag.\n\nHvis der findes en dokumenteret, implementeret og håndhævet procedure for løbende opsamling og overlevering af information om it-systemet, svares der ‘ja’. Hvis dette ikke er tilfældet, fordi der for eksempel ikke eksisterer nogen procedure, eller fordi proceduren ikke bliver håndhævet for it-systemet eller i myndigheden, skal der svares ‘nej’.",null,null,null,null,null,null,null,null,null,null,null,{"$f":"IF(C323<>\"\",MAX($P$10:P322)+1,\"\")","v":""},null,null,null,null,null,null,""]
[null,null,null,null,null,null,null,null,null,null,null,null,null,null,null,{"$f":"IF(C324<>\"\",MAX($P$10:P323)+1,\"\")","v":""},null,null,null,null,null,null,""]
[null,null,null,null,null,null,null,null,null,null,null,null,null,null,null,{"$f":"IF(C325<>\"\",MAX($P$10:P324)+1,\"\")","v":""},null,null,null,null,null,null,""]
[null,null,null,"It-systemets sikkerhed",null,null,null,null,null,null,null,null,null,null,null,{"$f":"IF(C326<>\"\",MAX($P$10:P325)+1,\"\")","v":""},null,null,null,null,"Kommentarer",null,""]
[null,null,null,null,null,null,null,null,null,null,null,null,null,null,null,null,null,null,null,null,null,null,""]
[null,null,null,null,null,null,null,null,null,null,null,null,null,null,null,null,null,null,null,null,null,null,""]
[null,null,null,null,null,null,null,null,null,null,null,null,null,null,null,null,null,null,null,null,null,null,""]
[null,null,"Spm.23","Overholder forvaltningen af it-systemet de gældende politikker og retningslinjer, som myndigheden har implementeret i henhold til ISO 27001-standarden?",null,null,null,null,null,null,null," - vælg i dropdown -",{"$f":"IF(AND(ISERROR(MATCH(L330,INDIRECT(T330),0))=TRUE,L330<>\"\"),\"FEJL\",\"\")","v":""},null,null,{"$f":"IF(C330<>\"\",MAX($P$10:P329)+1,\"\")","v":74},null,null," - vælg i dropdown -","JNIR",null,null,"Ubesvaret"]
[null,null,null,null,null,null,null,null,null,null,null,"Man kan kun vælge én svarmulighed.",null,null,null,{"$f":"IF(C331<>\"\",MAX($P$10:P330)+1,\"\")","v":""},null,null,null,null,null,null,""]
[null,null,null,"Forklaring: I den danske stat er det besluttet, at alle myndigheder skal følge sikkerhedsstandarden i ISO 27001. Hvis forvaltningen af it-systemet overholder de politikker og retningslinjer, som myndigheden har implementeret i henhold til ISO 27001-standarden, skal der svares ‘ja’.\n\nHvis forvaltningen af it-systemet ikke overholder politikker og retningslinjer i henhold til ISO 27001-standarden, eller hvis der ikke er kendskab til, om it-systemet overholder politikker og retningslinjer i henhold til ISO 27001-standarden, skal der svares ‘nej’. Hvis politikker og retningslinjer i henhold til ISO 27001-standarden ikke er relevante for it-systemet, svares der ’ikke relevant’.\n",null,null,null,null,null,null,null,null,null,null,null,{"$f":"IF(C332<>\"\",MAX($P$10:P331)+1,\"\")","v":""},null,null,null,null,null,null,""]
[null,null,null,null,null,null,null,null,null,null,null,null,null,null,null,{"$f":"IF(C333<>\"\",MAX($P$10:P332)+1,\"\")","v":""},null,null,null,null,null,null,""]
[null,null,null,null,null,null,null,null,null,null,null,null,null,null,null,{"$f":"IF(C334<>\"\",MAX($P$10:P333)+1,\"\")","v":""},null,null,null,null,null,null,""]
[null,null,"Spm.24","Imødekommer it-systemet kravene i databeskyttelsesforordningen?",null,null,null,null,null,null,null," - vælg i dropdown -",{"$f":"IF(AND(ISERROR(MATCH(L335,INDIRECT(T335),0))=TRUE,L335<>\"\"),\"FEJL\",\"\")","v":""},null,null,{"$f":"IF(C335<>\"\",MAX($P$10:P334)+1,\"\")","v":75},null,null," - vælg i dropdown -","JJNIR",null,null,"Ubesvaret"]
[null,null,null,null,null,null,null,null,null,null,null,"Man kan kun vælge én svarmulighed.",null,null,null,{"$f":"IF(C336<>\"\",MAX($P$10:P335)+1,\"\")","v":""},null,null,null,null,null,null,""]
[null,null,null,"Forklaring: Hvis databeskyttelse gennem design og standardindstillinger er fuldt implementeret, og de registreredes rettigheder håndteres effektivt i it-systemerne, vælges svarmulighed 1. Hvis der på baggrund af risikovurderinger og eventuelt konsekvensanalyser er valgt at understøtte systemet med manuelle processer, vælges svarmulighed 2. Hvis kravene i databeskyttelsesforordningen ikke kan imødekommes, vælges svarmulighed 3. Har myndigheden vurderet, at databeskyttelsesforordningens krav ikke er relevante for it-systemet, svares der ’ikke relevant’.\n",null,null,null,null,null,null,null,null,null,null,null,{"$f":"IF(C337<>\"\",MAX($P$10:P336)+1,\"\")","v":""},null,null,null,null,null,null,""]
[null,null,null,null,null,null,null,null,null,null,null,null,null,null,null,{"$f":"IF(C338<>\"\",MAX($P$10:P337)+1,\"\")","v":""},null,null,null,null,null,null,""]
[null,null,null,null,null,null,null,null,null,null,null,null,null,null,null,{"$f":"IF(C339<>\"\",MAX($P$10:P338)+1,\"\")","v":""},null,null,null,null,null,null,{"$f":"IF(OR(P339=\"\",R339=\"Nej\"),\"\",IF(OR(M339=\"Fejl\",L339=S339,L339=\"\"),\"Ubesvaret\",\"Besvaret\"))","v":""}]
[null,null,"Spm.25","Er alle relevante sikkerhedsopdateringer og patches implementeret?",null,null,null,null,null,null,null," - vælg i dropdown -",{"$f":"IF(AND(ISERROR(MATCH(L340,INDIRECT(T340),0))=TRUE,L340<>\"\"),\"FEJL\",\"\")","v":""},null,null,{"$f":"IF(C340<>\"\",MAX($P$10:P339)+1,\"\")","v":76},null,null," - vælg i dropdown -","JNVI",null,null,"Ubesvaret"]
[null,null,null,null,null,null,null,null,null,null,null,"Man kan kun vælge én svarmulighed.",null,null,null,{"$f":"IF(C341<>\"\",MAX($P$10:P340)+1,\"\")","v":""},null,null,null,null,null,null,""]
[null,null,null,"Forklaring: Hvis it-systemet har installeret alle relevante sikkerhedsopdateringer og patches, og der foreligger en proces for, hvordan det løbende verificeres, om it-systemet har fået de seneste sikkerhedsopdateringer og patches installeret, svares der 'ja'. Hvis dette ikke er tilfældet, skal der svares 'nej'.",null,null,null,null,null,null,null,null,null,null,null,{"$f":"IF(C342<>\"\",MAX($P$10:P341)+1,\"\")","v":""},null,null,null,null,null,null,""]
[null,null,null,null,null,null,null,null,null,null,null,null,null,null,null,{"$f":"IF(C343<>\"\",MAX($P$10:P342)+1,\"\")","v":""},null,null,null,null,null,null,""]
[null,null,null,null,null,null,null,null,null,null,null,null,null,null,null,{"$f":"IF(C344<>\"\",MAX($P$10:P343)+1,\"\")","v":""},null,null,null,null,null,null,""]
[null,null,"Spm.26","Findes der en disaster recovery-plan for it-systemet, og er planen testet?",null,null,null,null,null,null,null," - vælg i dropdown -",{"$f":"IF(AND(ISERROR(MATCH(L345,INDIRECT(T345),0))=TRUE,L345<>\"\"),\"FEJL\",\"\")","v":""},null,null,{"$f":"IF(C345<>\"\",MAX($P$10:P344)+1,\"\")","v":77},null,null," - vælg i dropdown -","JJNVIIR",null,null,"Ubesvaret"]
[null,null,null,null,null,null,null,null,null,null,null,"Man kan kun vælge én svarmulighed.",null,null,null,{"$f":"IF(C346<>\"\",MAX($P$10:P345)+1,\"\")","v":""},null,null,null,null,null,null,""]
[null,null,null,"Forklaring: Disaster recovery er en metode, hvorved myndigheden kan formindske reetableringstiden i de situationer, hvor større dele af en organisations tekniske miljøer går ned.\nHvis der findes en disaster recovery-plan for it-systemet og planen er testet, skal der svares 'Ja, og planen er testet '. Hvis der findes en plan, men denne ikke er testet, skal der svares 'Ja, der er en plan'. Findes der ikke en plan, skal der svares ‘Nej’. 'Ikke relevant' kan benyttes for eksempelvis mindre it-systemer, som vurderes ikke at behøve en disaster recovery-plan.",null,null,null,null,null,null,null,null,null,null,null,{"$f":"IF(C347<>\"\",MAX($P$10:P346)+1,\"\")","v":""},null,null,null,null,null,null,""]
[null,null,null,null,null,null,null,null,null,null,null,null,null,null,null,{"$f":"IF(C348<>\"\",MAX($P$10:P347)+1,\"\")","v":""},null,null,null,null,null,null,""]
[null,null,null,null,null,null,null,null,null,null,null,null,null,null,null,{"$f":"IF(C349<>\"\",MAX($P$10:P348)+1,\"\")","v":""},null,null,null,null,null,null,""]
[null,null,null,"It-systemets økonomi",null,null,null,null,null,null,null,null,null,null,null,{"$f":"IF(C350<>\"\",MAX($P$10:P349)+1,\"\")","v":""},null,null,null,null,"Kommentarer",null,""]
[null,null,null,null,null,null,null,null,null,null,null,null,null,null,null,null,null,null,null,null,null,null,""]
[null,null,null,null,null,null,null,null,null,null,null,null,null,null,null,null,null,null,null,null,null,null,""]
[null,null,null,null,null,null,null,null,null,null,null,null,null,null,null,null,null,null,null,null,null,null,""]
[null,null,"Spm.27","Hvad er de samlede årlige it-omkostninger til it-systemet?",null,null,null,null,null,null,null,{"$f":"IF(IF(L359=S359,0,L359)+IF(L364=S364,0,L364)+IF(L374=S374,0,L374)=0,\"\",IF(L359=S359,0,L359)+IF(L364=S364,0,L364)+IF(L374=S374,0,L374))","v":""},{"$f":"IF(AND(NOT(ISNUMBER(L354)),L354<>S354,L354<>\"\"),\"FEJL\",\"\")","v":""},null,null,{"$f":"IF(C354<>\"\",MAX($P$10:P353)+1,\"\")","v":78}]
[null,null,null,null,null,null,null,null,null,null,null,"Dette felt beregnes automatisk.",null,null,null,{"$f":"IF(C355<>\"\",MAX($P$10:P354)+1,\"\")","v":""},null,null,null,null,null,null,""]
[null,null,null,"Forklaring: Heri opgøres de samlede årlige omkostninger til it-systemet, eksklusive overhead og fællesomkostninger.\nOmkostningerne opgøres brutto. Dette beløb svarer til summen af omkostningerne til drift, vedligehold og udvikling, der angives i spørgsmål 28A, 28B, og 28D.\nFor definitioner og uddybende vejledning til opgørelsen af it-omkostninger henvises til bilag 2 om uddybende vejledning til kortlægningsdimensionen økonomi.",null,null,null,null,null,null,null,null,null,null,null,{"$f":"IF(C356<>\"\",MAX($P$10:P355)+1,\"\")","v":""},null,null,null,null,null,null,""]
[null,null,null,null,null,null,null,null,null,null,null,null,null,null,null,{"$f":"IF(C357<>\"\",MAX($P$10:P356)+1,\"\")","v":""},null,null,null,null,null,null,""]
[null,null,null,null,null,null,null,null,null,null,null,null,null,null,null,{"$f":"IF(C358<>\"\",MAX($P$10:P357)+1,\"\")","v":""},null,null,null,null,null,null,""]
[null,null,"Spm.28A","Sammensætning af omkostninger til it-systemet: Hvad er de årlige omkostninger til drift af it-systemet?\n",null,null,null,null,null,null,null,"[Indsæt sum]",{"$f":"IF(AND(NOT(ISNUMBER(L359)),L359<>S359,L359<>\"\"),\"FEJL\",\"\")","v":""},null,null,{"$f":"IF(C359<>\"\",MAX($P$10:P358)+1,\"\")","v":79},null,null,"[Indsæt sum]",null,null,null,"Ubesvaret"]
[null,null,null,null,null,null,null,null,null,null,null,"Indsæt omkostninger i kr.",null,null,null,{"$f":"IF(C360<>\"\",MAX($P$10:P359)+1,\"\")","v":""},null,null,null,null,null,null,""]
[null,null,null,"Forklaring: Drift omfatter de aktiviteter, der sikrer, at it-systemet afvikles under stabil drift og dermed er tilgængeligt for forretningsmæssig brug i henhold til aftalte oppetider og performancemål.\nHeri opgøres omkostningerne til de aktiviteter, der skal til for at holde it-systemet kørende såsom forvaltning, support og lignende. De omfatter både eksterne og interne driftsomkostninger, herunder også internt medgåede lønudgifter. De kan også omfatte afskrivninger og renteudgifter til fx. licenser og hardware.\nBemærk, at omkostningerne opgøres brutto, samt eksklusive overhead og fællesomkostninger.\n",null,null,null,null,null,null,null,null,null,null,null,{"$f":"IF(C361<>\"\",MAX($P$10:P360)+1,\"\")","v":""},null,null,null,null,null,null,""]
[null,null,null,null,null,null,null,null,null,null,null,null,null,null,null,{"$f":"IF(C362<>\"\",MAX($P$10:P361)+1,\"\")","v":""},null,null,null,null,null,null,""]
[null,null,null,null,null,null,null,null,null,null,null,null,null,null,null,{"$f":"IF(C363<>\"\",MAX($P$10:P362)+1,\"\")","v":""},null,null,null,null,null,null,""]
[null,null,"Spm.28B","Sammensætning af omkostninger til it-systemet: Hvad er de årlige omkostninger til vedligehold af it-systemet?",null,null,null,null,null,null,null,"[Indsæt sum]",{"$f":"IF(AND(NOT(ISNUMBER(L364)),L364<>S364,L364<>\"\"),\"FEJL\",\"\")","v":""},null,null,{"$f":"IF(C364<>\"\",MAX($P$10:P363)+1,\"\")","v":80},null,null,"[Indsæt sum]",null,null,null,"Ubesvaret"]
[null,null,null,null,null,null,null,null,null,null,null,"Indsæt omkostninger i kr.",null,null,null,{"$f":"IF(C365<>\"\",MAX($P$10:P364)+1,\"\")","v":""},null,null,null,null,null,null,""]
[null,null,null,"Forklaring: Vedligehold omfatter de aktiviteter, der opretholder it-systemets forretningsmæssige værdi, og som ikke er udvikling af nye komponenter eller ny funktionalitet til it-systemet.\nHeri opgøres omkostningerne til aktiviteter såsom fejlrettelser, sikkerhedsopgraderinger, mindre opgraderinger mv. Vedligehold omfatter ikke opgaver, der på nogen måder udvider it-systemets anvendelsesmuligheder eller funktionalitet, eksempelvis som følge af et ændret forretningsgrundlag. Både eksterne og interne vedligeholdelsesomkostninger medtages, herunder også internt medgåede lønudgifter. Såfremt der er tale om vedligeholdelsesaktiviteter kan afskrivninger og renteudgifter til fx. licenser og hardware indgå i opgørelsen.\nBemærk, at omkostningerne opgøres brutto, samt eksklusive overhead og fællesomkostninger.",null,null,null,null,null,null,null,null,null,null,null,{"$f":"IF(C366<>\"\",MAX($P$10:P365)+1,\"\")","v":""},null,null,null,null,null,null,""]
[null,null,null,null,null,null,null,null,null,null,null,null,null,null,null,{"$f":"IF(C367<>\"\",MAX($P$10:P366)+1,\"\")","v":""},null,null,null,null,null,null,""]
[null,null,null,null,null,null,null,null,null,null,null,null,null,null,null,{"$f":"IF(C368<>\"\",MAX($P$10:P367)+1,\"\")","v":""},null,null,null,null,null,null,""]
[null,null,"Spm.28C","Sammensætning af omkostninger til it-systemet: Hvor meget udgør de interne personaleomkostninger af drift og vedligehold?",null,null,null,null,null,null,null,"[Indsæt sum]",{"$f":"IF(OR(L371<>\"\",AND(NOT(ISNUMBER(L369)),L369<>S369,L369<>\"\")),\"FEJL\",\"\")","v":""},null,null,{"$f":"IF(C369<>\"\",MAX($P$10:P368)+1,\"\")","v":81},null,null,"[Indsæt sum]",null,null,null,"Ubesvaret"]
[null,null,null,null,null,null,null,null,null,null,null,"Indsæt omkostninger i kr.",null,null,null,{"$f":"IF(C370<>\"\",MAX($P$10:P369)+1,\"\")","v":""},null,null,null,null,null,null,""]
[null,null,null,"Forklaring: Heri opgøres de internt medgåede lønudgifter til drifts- og vedligeholdelsesaktiviteter, som er opgjort i ovenstående opgørelser. Bemærk, at de skal opgøres både for drift og vedligehold i tillæg til at være en del af 28A og 28B, og at interne personaleomkostninger til udvikling ikke opgøres her.",null,null,null,null,null,null,null,{"$f":"IF(NOT(ISNUMBER(L369)),\"\",IF(L369>SUM(IF(ISNUMBER(L364),L364,0),IF(ISNUMBER(L359),L359,0)),\"Besvarelsen i dette felt må ikke overskride summen af besvarelserne i spørgsmål 28A og 28B.\",\"\"))","v":""},null,null,null,{"$f":"IF(C371<>\"\",MAX($P$10:P370)+1,\"\")","v":""},null,null,null,null,null,null,""]
[null,null,null,null,null,null,null,null,null,null,null,null,null,null,null,{"$f":"IF(C372<>\"\",MAX($P$10:P371)+1,\"\")","v":""},null,null,null,null,null,null,""]
[null,null,null,null,null,null,null,null,null,null,null,null,null,null,null,{"$f":"IF(C373<>\"\",MAX($P$10:P372)+1,\"\")","v":""},null,null,null,null,null,null,""]
[null,null,"Spm.28D","Sammensætning af omkostninger til it-systemet: Hvad er de årlige udviklingsomkostninger til it-systemet?",null,null,null,null,null,null,null,"[Indsæt sum]",{"$f":"IF(AND(NOT(ISNUMBER(L374)),L374<>S374,L374<>\"\"),\"FEJL\",\"\")","v":""},null,null,{"$f":"IF(C374<>\"\",MAX($P$10:P373)+1,\"\")","v":82},null,null,"[Indsæt sum]",null,null,null,"Ubesvaret"]
[null,null,null,null,null,null,null,null,null,null,null,"Indsæt omkostninger i kr.",null,null,null,{"$f":"IF(C375<>\"\",MAX($P$10:P374)+1,\"\")","v":""},null,null,null,null,null,null,""]
[null,null,null,"Forklaring: Med udvikling forstås udvikling af nye komponenter eller ny funktionalitet til it-systemet som følge af ændret forretningsgrundlag eller nye behov.  \nHeri opgøres de samlede årlige udviklingsomkostninger for it-systemet, det vil sige de samlede ned- og afskrivninger, renteudgifter samt de årlige udgifter afholdt i forbindelse med udvikling, som ikke er blevet aktiveret/anlægsført. Dette omfatter både eksterne og interne udviklingsomkostninger, herunder også internt medgåede lønudgifter. Konceptuelt skal det således forstås som de udviklingsaktiviteter, der vil være at finde på myndighedens årlige resultatopgørelse.\nBemærk, at omkostningerne opgøres brutto, samt eksklusive overhead og fællesomkostninger.",null,null,null,null,null,null,null,null,null,null,null,{"$f":"IF(C376<>\"\",MAX($P$10:P375)+1,\"\")","v":""},null,null,null,null,null,null,""]
[null,null,null,null,null,null,null,null,null,null,null,null,null,null,null,{"$f":"IF(C377<>\"\",MAX($P$10:P376)+1,\"\")","v":""},null,null,null,null,null,null,""]
[null,null,null,null,null,null,null,null,null,null,null,null,null,null,null,{"$f":"IF(C378<>\"\",MAX($P$10:P377)+1,\"\")","v":""},null,null,null,null,null,null,""]
[null,null,"Spm.29","Hvad er de forventede investeringer i it-systemet i it-handlingsplanens \nperiode?\n",null,null,null,null,null,null,null,"[Indsæt sum]",{"$f":"IF(AND(NOT(ISNUMBER(L379)),L379<>S379,L379<>\"\"),\"FEJL\",\"\")","v":""},null,null,{"$f":"IF(C379<>\"\",MAX($P$10:P378)+1,\"\")","v":83},null,null,"[Indsæt sum]",null,null,null,"Ubesvaret"]
[null,null,null,null,null,null,null,null,null,null,null,"Indsæt forventede investeringer i kr.",null,null,null,{"$f":"IF(C380<>\"\",MAX($P$10:P379)+1,\"\")","v":""}]
[null,null,null,"Forklaring: Heri opgøres de samlede forventede investeringer i it-handlingsplanens periode. Investeringer omfatter blandt andet videreudvikling, projektgennemførelse og teknologimodernisering, som forbedrer it-systemets tilstand eller anvendelsesmuligheder.\nBemærk, at tilføjelsen af nye ressourcer til driftsafvikling eller vedligehold af it-systemet skal medtages, uanset om disse aktiveres/anlægsføres. \nOpgørelsen indeholder således ikke afskrivninger og renteudgifter, som falder på baggrund af investeringer inden tidspunktet for opgørelsen. Opgørelsen er desuden udgiftsbaseret i modsætning til de øvrige spørgsmål.\nBemærk, at udgifterne opgøres brutto, og at forventede interne medgåede lønudgifter eksklusive overhead skal medtages.",null,null,null,null,null,null,null,null,null,null,null,{"$f":"IF(C381<>\"\",MAX($P$10:P380)+1,\"\")","v":""}]
[null,null,null,null,null,null,null,null,null,null,null,null,null,null,null,null,null,null,"END"]
[]
[null,null,null,{"$f":"IF(P403>0,\"Der er \"&P403&\" ubesvare\"&IF(P403=1,\"t\",\"de\")&\" spørgsmål i dette spørgeskema. Venligst genbesøg de ubesvarede spørgsmål, inden du fortsætter.\",\"Alle spørgsmål i dette spørgeskema er besvaret.\")","v":"Der er 36 ubesvarede spørgsmål i dette spørgeskema. Venligst genbesøg de ubesvarede spørgsmål, inden du fortsætter."}]
[]
[]
[]
[]
[]
[]
[]
[]
[]
[]
[null,null,"Input til koder og drop-down menuerne"]
[]
[null,null,null,null,null,null,null,null,null,null,null,null,null,null," ","Sourcingtype",null,"Myndighedens kontaktperson"]
[null,null,null,null,null,null,null,null,null,null,null,null,null,null," ",{"$f":"IF(SUM(COUNTIF(L30:L32,{\"Overvejende outsourcet\",\"Delvist outsourcet\"}))>0,\"Outsourcet\",\"Insourcet\")","v":"Insourcet"},null,"Kontaktperson (Navn)",null," "]
[null,null,null,null,null,null,null,null,null,null,null,null,null,null," ","Antal fejl",null,"Kontaktperson (e-mail)",null," "]
[null,null,null,null,null,null,null,null,null,null,null,null,null,null," ",{"$f":"COUNTIF($M:$M,\"FEJL\")","v":0},null,"Kontaktperson (tlf.)",null," "]
[null,null,null,null,null,null,null,null,null,null,null,null,null,null," "]
[null,null,null,null,null,null,null,null,null,null,null,null,null,null," ","Ubesvaret"]
[null,null,null,null,null,null,null,null,null,null,null,null,null,null," ",{"$f":"COUNTIF($W:$W,P402)","v":36}]
[null,null,null,null,null,null,null,null,null,null,null,null,null,null," "]
[null,null,null,null,null,null,null,null,null,null,null,null,null,null," "]
[null,null,null,null,null,null,null,null,null,null,null,null,null,null," "]
[]
[null,null,"Besvarelser"]
[]
[null,null,1,{"$f":"C410+1","v":2},{"$f":"D410+1","v":3},4,5,6,7,8,9,10,11,12,13,14,15,16,17,18,19,20,21,22,23,24,25,26,27,28,29,30,31,32,33,34,35,36,37,38,39,40,41,42,43,44,45,46,47,48,49,50,51,52,53,54,55,56,57,58,59,60,61,62,63,64,65,66,{"$f":"BP410+1","v":67},68,69,70,71,72,73,74,75,76,77,78,{"$f":"CB410+1","v":79},{"$f":"CC410+1","v":80},{"$f":"CD410+1","v":81},{"$f":"CE410+1","v":82},{"$f":"CF410+1","v":83}]
[null,null,{"$f":"IF(INDEX($D$1:$D$382,MATCH(C410,$P$1:$P$382,0))=\"\",B411,INDEX($D$1:$D$382,MATCH(C410,$P$1:$P$382,0)))","v":"Ministerområde"},"Hvad er myndighedens navn?","Hvad er de samlede årlige it-omkostninger i myndigheden eksklusive overhead og fællesomkostninger?","It-systemnavn","It-systemejer","It-systemejernes organisatoriske placering","It-systemets nøglefunktion","Primært understøttet forretningsområde","It-systemets kritikalitet","It-systemets sourcingmodel for drift","It-systemets sourcingmodel for vedligehold og udvikling","Samlet antal leverandørkontrakter for drift, vedligehold og udvikling","Angiv navnene på leverandørkontrakterne og leverandør","Angiv navnene på leverandørkontrakterne og leverandør","Angiv navnene på leverandørkontrakterne og leverandør","Angiv navnene på leverandørkontrakterne og leverandør","Angiv navnene på leverandørkontrakterne og leverandør","Hvor tilfredsstillende er it-systemets understøttelse af forretningsprocesser i dag?","I hvilken grad er der omskiftelighed i forretningsgrundlaget for it-systemet?","Hvor mange slutbrugere har it-systemet?","Hvor tilfredsstillende er it-systemets realiserede tilgængelighed?","Hvor tilfredsstillende er myndighedens kontraktstyring af it-systemets kontraktdokumenter i dag?\n","Hvad er udløbsdatoen for kontrakten eksklusive forlængelsesperioden?","Hvad er udløbsdatoen for kontrakten eksklusive forlængelsesperioden?","Hvor mange forlængelsesmåneder giver kontrakten maksimalt mulighed for?","Hvornår er it-systemets transition til en eventuel ny leverandør planlagt afsluttet?","Hvornår er it-systemets transition til en eventuel ny leverandør planlagt afsluttet?","Er alle væsentlige kontraktdokumenter med videre for it-systemet optaget i et kontraktbibliotek?","Følges faste procedurer for økonomisk controlling imod kontrakt og leverede ydelser?","Hvor tilfredsstillende er myndighedens kontraktstyring af it-systemets kontraktdokumenter i dag?\n","Hvad er udløbsdatoen for kontrakten eksklusive forlængelsesperioden?","Hvad er udløbsdatoen for kontrakten eksklusive forlængelsesperioden?","Hvor mange forlængelsesmåneder giver kontrakten maksimalt mulighed for?","Hvornår er it-systemets transition til en eventuel ny leverandør planlagt afsluttet?","Hvornår er it-systemets transition til en eventuel ny leverandør planlagt afsluttet?","Er alle væsentlige kontraktdokumenter med videre for it-systemet optaget i et kontraktbibliotek?","Følges faste procedurer for økonomisk controlling imod kontrakt og leverede ydelser?","Hvor tilfredsstillende er myndighedens kontraktstyring af it-systemets kontraktdokumenter i dag?\n","Hvad er udløbsdatoen for kontrakten eksklusive forlængelsesperioden?","Hvad er udløbsdatoen for kontrakten eksklusive forlængelsesperioden?","Hvor mange forlængelsesmåneder giver kontrakten maksimalt mulighed for?","Hvornår er it-systemets transition til en eventuel ny leverandør planlagt afsluttet?","Hvornår er it-systemets transition til en eventuel ny leverandør planlagt afsluttet?","Er alle væsentlige kontraktdokumenter med videre for it-systemet optaget i et kontraktbibliotek?","Følges faste procedurer for økonomisk controlling imod kontrakt og leverede ydelser?","Hvor tilfredsstillende er myndighedens kontraktstyring af it-systemets kontraktdokumenter i dag?\n","Hvad er udløbsdatoen for kontrakten eksklusive forlængelsesperioden?","Hvad er udløbsdatoen for kontrakten eksklusive forlængelsesperioden?","Hvor mange forlængelsesmåneder giver kontrakten maksimalt mulighed for?","Hvornår er it-systemets transition til en eventuel ny leverandør planlagt afsluttet?","Hvornår er it-systemets transition til en eventuel ny leverandør planlagt afsluttet?","Er alle væsentlige kontraktdokumenter med videre for it-systemet optaget i et kontraktbibliotek?","Følges faste procedurer for økonomisk controlling imod kontrakt og leverede ydelser?","Hvor tilfredsstillende er myndighedens kontraktstyring af it-systemets kontraktdokumenter i dag?\n","Hvad er udløbsdatoen for kontrakten eksklusive forlængelsesperioden?","Hvad er udløbsdatoen for kontrakten eksklusive forlængelsesperioden?","Hvor mange forlængelsesmåneder giver kontrakten maksimalt mulighed for?","Hvornår er it-systemets transition til en eventuel ny leverandør planlagt afsluttet?","Hvornår er it-systemets transition til en eventuel ny leverandør planlagt afsluttet?","Er alle væsentlige kontraktdokumenter med videre for it-systemet optaget i et kontraktbibliotek?","Følges faste procedurer for økonomisk controlling imod kontrakt og leverede ydelser?","Hvor tilfredsstillende er it-systemets tekniske tilstand i dag?\n","Baserer it-systemets teknologiske komponenter sig primært på versioner, som forventes vedligeholdt af et leverandørmarked fremadrettet?","Understøtter it-systemet, gennem planlagt vedligehold og videreudvikling, alle væsentlige tiltænkte processer i forretningsgrundlaget i de kommende tre år?\n",{"$f":"IF(INDEX($D$1:$D$382,MATCH(BO410,$P$1:$P$382,0))=\"\",BN411,INDEX($D$1:$D$382,MATCH(BO410,$P$1:$P$382,0)))","v":"Er it-systemets primære integrationer baseret på standardadaptere?"},"I hvilken grad kan it-systemet skaleres kapacitetsmæssigt i forhold til behov (flere brugere, flere data)?\n","Hvilke primære programmeringssprog er it-systemet baseret på?\n\n\n\n","Er dokumentationen i al væsentlighed retvisende for it-systemets nuværende tilstand?","Hvad er myndighedens rettigheder i forhold til hovedkomponenterne i it-systemet?\n\n","Hvad er myndighedens rettigheder i forhold til data?\n","Har myndigheden mere end én ressource med teknisk viden om it-systemet?\n\n","Er der en opdateret proces for håndtering af nøglepersonsafhængigheder?","Er der etableret formelle procedurer for løbende opsamling og overlevering af information for it-systemet?","Overholder forvaltningen af it-systemet de gældende politikker og retningslinjer, som myndigheden har implementeret i henhold til ISO 27001-standarden?","Imødekommer it-systemet kravene i databeskyttelsesforordningen?","Er alle relevante sikkerhedsopdateringer og patches implementeret?","Findes der en disaster recovery-plan for it-systemet, og er planen testet?","Hvad er de samlede årlige it-omkostninger til it-systemet?","Sammensætning af omkostninger til it-systemet: Hvad er de årlige omkostninger til drift af it-systemet?\n","Sammensætning af omkostninger til it-systemet: Hvad er de årlige omkostninger til vedligehold af it-systemet?","Sammensætning af omkostninger til it-systemet: Hvor meget udgør de interne personaleomkostninger af drift og vedligehold?","Sammensætning af omkostninger til it-systemet: Hvad er de årlige udviklingsomkostninger til it-systemet?","Hvad er de forventede investeringer i it-systemet i it-handlingsplanens \nperiode?\n"]
[null," ",{"$f":"MATCH(C410,$P1:$P382)","v":12},14,16,18,20,22,24,26,28,30,32,34,36,37,38,39,40,47,52,57,62,72,77,80,84,90,93,97,102,109,114,117,121,127,130,134,139,146,151,154,158,164,167,171,176,183,188,191,195,201,204,208,213,220,225,228,232,238,241,245,250,260,265,270,{"$f":"MATCH(BO410,$P1:$P382)","v":275},280,285,296,301,306,311,316,321,330,335,340,345,354,359,364,369,374,379]
[null," ",{"$f":"IF(ISERROR(MATCH(INDEX($L1:$L382,C412),$S1:$S382,0)),IF(INDEX($L1:$L382,C412)<>\"\",INDEX($L1:$L382,C412),\"\"),\"\")","v":""},{"$f":"IF(ISERROR(MATCH(INDEX($L1:$L382,D412),$S1:$S382,0)),IF(INDEX($L1:$L382,D412)<>\"\",INDEX($L1:$L382,D412),\"\"),\"\")","v":""},"","","","","","","","","",{"$f":"IF(ISERROR(MATCH(INDEX($L1:$L382,N412),$S1:$S382,0)),IF(INDEX($L1:$L382,N412)<>\"\",INDEX($L1:$L382,N412),0),0)","v":0},"","","","","","","","","","","","","","","","","","","","","","","","","","","","","","","","","","","","","","","","","","","","","","","","","","","","","",{"$f":"IF(ISERROR(MATCH(INDEX($L1:$L382,BP412),$S1:$S382,0)),IF(INDEX($L1:$L382,BP412)<>\"\",INDEX($L1:$L382,BP412),\"\"),\"\")","v":""},"","","","","","","","","","","","","","","","",""]
[null,null,{"$f":"IF(ISERROR(MATCH(INDEX($L1:$L382,C412),$S1:$S382,0)),IF(INDEX($L1:$L382,C412)<>\"\",IF(INDEX($U1:$U382,C412)=0,\"\",INDEX($U1:$U382,C412)),\"\"),\"\")","v":""},{"$f":"IF(ISERROR(MATCH(INDEX($L1:$L382,D412),$S1:$S382,0)),IF(INDEX($L1:$L382,D412)<>\"\",IF(INDEX($U1:$U382,D412)=0,\"\",INDEX($U1:$U382,D412)),\"\"),\"\")","v":""},"","","","","","","","","","","","","","","","","","","","","","","","","","","","","","","","","","","","","","","","","","","","","","","","","","","","","","","","","","","","","","","",{"$f":"IF(ISERROR(MATCH(INDEX($L1:$L382,BP412),$S1:$S382,0)),IF(INDEX($L1:$L382,BP412)<>\"\",IF(INDEX($U1:$U382,BP412)=0,\"\",INDEX($U1:$U382,BP412)),\"\"),\"\")","v":""},"","","","","","","","","","","","","","","","",""]
[]
[]
[null,null,"Drop-down"]
[]
[null,null,"Drop-down valgmuligheder"]
[null,null,"TLFRDS","JNVIIR","DIU","DIP","JNVI","IVG","EJ","JN","JNIR","JJNIR","JJNVIIR","IVG_2"]
[null,null," - vælg i dropdown -"," - vælg i dropdown -"," - vælg i dropdown -"," - vælg i dropdown -"," - vælg i dropdown -"," - vælg i dropdown -"," - vælg i dropdown -"," - vælg i dropdown -"," - vælg i dropdown -"," - vælg i dropdown -"," - vælg i dropdown -"," - vælg i dropdown -"]
[null,null,"1. Meget utilfredsstillende","1. Ja","1. Dato (indsæt dato i næste felt)","1. Dato (indsæt dato i næste felt)","1. Ja","1. I meget lav grad","1. Ingen rettigheder","1. Ja","1. Ja","1. Ja, it-systemet understøtter til fulde databeskyttelsesforordningen","1. Ja, og planen er testet","1. I meget lav grad"]
[null,null,"2. Utilfredsstillende","2. Nej","2. Ingen udløbsdato","2. Ikke planlagt","2. Nej","2. I mindre grad","2. Udvidet brugsret","2. Nej","2. Nej","2. Ja, it-systemet understøtter delvist databeskyttelsesforordningen, fuld overholdelse nås gennem manuelle processer","2. Ja, der er en plan","2. I mindre grad"]
[null,null,"3. Tilfredsstillende","3. Ved ikke","3. Ved ikke","3. Ved ikke","3. Ved ikke","3. I nogen grad","3. Fulde rettigheder"," ","3. Ikke relevant","3. Nej, it-systemet understøtter ikke databeskyttelsesforordningen","3. Nej","3. I nogen grad"]
[null,null,"4. Meget tilfredsstillende","4. Ikke relevant"," "," "," ","4. I høj grad","4. Ved ikke"," "," ","4. Ikke relevant","4. Ved ikke","4. I høj grad"]
[null,null,"5. Særdeles tilfredsstillende"," "," "," "," ","5. I meget høj grad",null," "," "," ","5. Ikke relevant","5. I meget høj grad"]
[null,null," "," "," "," "," ","6. Ved ikke"," "," "," "," "," ","6. Ved ikke"]
[null,null," "," "," "," "," "," "," "," "," "," "," ","7. Ikke relevant"]